{"text_format":"1","workbook":"xlsx","n_sheets":4,"sheets":["Formato_ActivosInf_VF","Hoja1","DATA","Lista_Datos"],"not_rendered":{"charts":0,"images":4,"macros":1,"external_links":5,"defined_names":453,"comments":1,"pivot_tables":0},"unopened":[],"bounds":{"document_bytes":16777216,"sheet_cells":100000,"rows_first":2000,"rows_last":500,"rows_between":2000,"halvings":0,"cell_chars":16384,"cell_head_chars":4096},"cells_cut":0,"cells_raw":0,"read":"whole","date_system":"1900"}

{"sheet":"Formato_ActivosInf_VF","index":0,"n_rows":1010,"n_cols":28,"rows_kept":1010,"cut":false,"hidden":false,"merged":[[0,0,2,9],[0,10,2,19],[0,20,2,27],[3,20,5,25],[3,0,5,17],[3,26,5,27],[3,18,5,19]]}
[null,null,null,null,null,null,null,null,null,null,"INVENTARIO DE ACTIVOS DE INFORMACIÓN",null,null,null,null,null,null,null,null,null,"INVENTARIO DE ACTIVOS DE INFORMACIÓN"]
[]
[]
[null,null,null,null,null,null,null,null,null,null,null,null,null,null,null,null,null,null,"Valoración del Activo (Iso 27001:2013)",null,"Índice de Información Clasificada y Reservada (Decreto 103 de 2015)",null,null,null,null,null,"Protección de Datos Personales (Bases de Datos - Ley 1581 de 2012)"]
[]
[]
["Identificador ","Tipo ","Oficina","Nombre","Descripción","Nombre del Responsable de la Producción de la Información\n(Propietario del Activo)","Fecha de Generación de la Información ","Nombre del Responsable de la Información\n(Custodio del Activo)","Fecha de Ingreso del Activo al Archivo","Tipo de Macroproceso","Macroproceso","Proceso","Norma, Ley o Función que lo Justifica ","Origen","Soporte del\n Registro","Medio de Conservación","Formato","Idioma","Confidencialidad","Lugar de Consulta o Ubicación","Objetivo legítimo de la Excepción","Fundamento Constitucional o Legal","Fundamento Jurídico de la Excepción","Excepción Total o Parcial","Fecha de Calificación\nDD/MM/AAAA","Tiempo que Cobija la Clasificación","Tipo de Datos Personales","Finalidad de la Recolección de los Datos Personales"]
["100-1","INFORMACIÓN","DESPACHO DEL MINISTRO","INFORMES","comunicaciones dirigidas a Fiscalia, Contraloria y procuraduria",{"$f":"IF(C8=\"\",\"\",C8)","v":"DESPACHO DEL MINISTRO"},"2018-11-28","DESPACHO DEL MINISTRO","2019-01-02","ESTRATEGICO","MARCO_ESTRATEGICO","DIRECCIONAMIENTO ESTRATEGICO","Ley 1341 de 2009 y normas que lo modifican, complementan o reglamentan","Interno","Físico","Documentos de Archivo - físicos","Papel","Español","INFORMACIÓN PÚBLICA RESERVADA","Alfanet","SI","Ley 1341 de 2009 y normas que lo modifican, complementan o reglamentan","Decreto 103 del 2015 \nArt 31","N/A","2018-09-28","4 AÑOS","Dato personal público","f. Atender y resolver peticiones, quejas, reclamos y sugerencias."]
["100-2","INFORMACIÓN","DESPACHO DEL MINISTRO","INFORMES","Comunicaciones dirigidas a Entes estatales del pais","DESPACHO DEL MINISTRO","2018-11-28","DESPACHO DEL MINISTRO","2019-01-02","ESTRATEGICO","MARCO_ESTRATEGICO","DIRECCIONAMIENTO ESTRATEGICO","Ley 1341 de 2009 y normas que lo modifican, complementan o reglamentan","Interno","Físico","Documentos de Archivo - físicos","Papel","Español","INFORMACIÓN PÚBLICA RESERVADA","Alfanet","SI","Ley 1341 de 2009 y normas que lo modifican, complementan o reglamentan","Decreto 103 del 2015 \nArt 31","N/A","2018-09-28","4 AÑOS","Dato personal privado ","f. Atender y resolver peticiones, quejas, reclamos y sugerencias."]
["100-3","INFORMACIÓN","DESPACHO DEL MINISTRO","Comunicaciones","Documentos dirigidos a canales nacionales","DESPACHO DEL MINISTRO","2018-11-28","DESPACHO DEL MINISTRO","2019-01-02","ESTRATEGICO","MARCO_ESTRATEGICO","DIRECCIONAMIENTO ESTRATEGICO","Ley 1341 de 2009 y normas que lo modifican, complementan o reglamentan","Interno","Físico","Documentos de Archivo - físicos","Papel","Español","INFORMACIÓN PÚBLICA RESERVADA","Alfanet","SI","Ley 1341 de 2009 y normas que lo modifican, complementan o reglamentan","Decreto 103 del 2015 \nArt 31","N/A","2018-09-28","4 AÑOS","Dato personal público","f. Atender y resolver peticiones, quejas, reclamos y sugerencias."]
["100-4","INFORMACIÓN","DESPACHO DEL MINISTRO","Estatutos ","Conjunto de normas legales por las que se regula el funcionamiento del Fondo Unico TIC","DESPACHO DEL MINISTRO","2018-11-28","DESPACHO DEL MINISTRO","2019-01-02","ESTRATEGICO","MARCO_ESTRATEGICO","DIRECCIONAMIENTO ESTRATEGICO","Ley 1341 de 2009 y normas que lo modifican, complementan o reglamentan","Interno","Físico","Documentos de Archivo - físicos","Papel","Español","NO CLASIFICADA","Despacho del Ministro","NO","N/A","N/A","N/A","N/A","N/A","N/A","N/A"]
["100-5","INFORMACIÓN","DESPACHO DEL MINISTRO","Politicas ","Conjunto de estrategias para promover el uso apropiación y divulgación de las TIC","DESPACHO DEL MINISTRO","2018-11-28","DESPACHO DEL MINISTRO","2019-01-02","ESTRATEGICO","MARCO_ESTRATEGICO","DIRECCIONAMIENTO ESTRATEGICO","Ley 1341 de 2009 y normas que lo modifican, complementan o reglamentan","Interno","Físico","Documentos de Archivo - físicos","Papel","Español","INFORMACIÓN PÚBLICA RESERVADA","Despacho del Ministro","SI","Ley 1341 de 2009 y normas que lo modifican, complementan o reglamentan","Decreto 103 del 2015 \nArt 31","N/A","2018-09-28","4 AÑOS","N/A","N/A"]
["101-6","INFORMACIÓN","GRUPO INTERNO DE TRABAJO PARA EL CONSENSO SOCIAL","SOLICITUDES Y RESPUESTAS A PQRS DE GRUPOS SOCIALES Y/O ETNICOS Y DEMAS ENTIDADES DEL GOBIERNO NACIONAL","SOLICITUDES Y RESPUESTAS A PQRS DE GRUPOS SOCIALES Y/O ETNICOS Y DEMAS ENTIDADES DEL GOBIERNO NACIONAL","GRUPO INTERNO DE TRABAJO PARA EL CONSENSO SOCIAL","2018-11-28","GRUPO INTERNO DE TRABAJO PARA EL CONSENSO SOCIAL","2019-01-02","ESTRATEGICO","GESTION_ATENCION_GRUPOS_INTERES","GESTION DE ATENCION A GRUPOS DE INTERES","Ley 1437 del 2011","Externo","Físico","Documentos de Archivo - físicos","Papel","Español","INFORMACIÓN PÚBLICA","Alfanet ; archivo del área","N/A","N/A","N/A","N/A","N/A","N/A","Dato personal privado ","f. Atender y resolver peticiones, quejas, reclamos y sugerencias."]
["101-7","INFORMACIÓN","GRUPO INTERNO DE TRABAJO PARA EL CONSENSO SOCIAL","SOLICITUDES Y RESPUESTAS A PQRS DE GRUPOS SOCIALES Y/O ETNICOS Y DEMAS ENTIDADES DEL GOBIERNO NACIONAL","SOLICITUDES Y RESPUESTAS A PQRS DE GRUPOS SOCIALES Y/O ETNICOS Y DEMAS ENTIDADES DEL GOBIERNO NACIONAL","GRUPO INTERNO DE TRABAJO PARA EL CONSENSO SOCIAL","2018-11-28","GRUPO INTERNO DE TRABAJO PARA EL CONSENSO SOCIAL","2019-01-02","ESTRATEGICO","GESTION_ATENCION_GRUPOS_INTERES","GESTION DE ATENCION A GRUPOS DE INTERES","Ley 1437 del 2011","Externo","Digital","Documentos de Archivo - electrónicos","PDF","Español","INFORMACIÓN PÚBLICA","Alfanet ; Sharepoint ","N/A","N/A","N/A","N/A","N/A","N/A","Dato personal público","f. Atender y resolver peticiones, quejas, reclamos y sugerencias."]
["101-8","INFORMACIÓN","GRUPO INTERNO DE TRABAJO PARA EL CONSENSO SOCIAL","Solicitud y respuesta a conceptos","Conceptos internos dados por las distintas áreas del Mintic","GRUPO INTERNO DE TRABAJO PARA EL CONSENSO SOCIAL","2018-11-28","GRUPO INTERNO DE TRABAJO PARA EL CONSENSO SOCIAL","2019-01-02","ESTRATEGICO","COMUNICACION_ESTRATEGICA","COMUNICACION ESTRATEGICA","Ley 1341 de 2009 y normas que lo modifican, complementan o reglamentan","Interno","Físico","Documentos de Archivo - físicos","Papel","Español","INFORMACIÓN PÚBLICA RESERVADA","Alfanet; Correos de los colaboradores; archivo del área","SI","Ley 1341 de 2009 y normas que lo modifican, complementan o reglamentan","Decreto 103 del 2015 \nArt 31","Reserva parcial","2018-09-28","4 AÑOS","N/A","a. Permitir el desarrollo del objeto del Ministerio/Fondo TIC, en los términos de los artículos 1o y 2o del Decreto 1414 de 2017."]
["101-9","INFORMACIÓN","GRUPO INTERNO DE TRABAJO PARA EL CONSENSO SOCIAL","Solicitud y respuesta a conceptos","Conceptos internos dados por las distintas áreas del Mintic","GRUPO INTERNO DE TRABAJO PARA EL CONSENSO SOCIAL","2018-11-28","GRUPO INTERNO DE TRABAJO PARA EL CONSENSO SOCIAL","2019-01-02","ESTRATEGICO","COMUNICACION_ESTRATEGICA","COMUNICACION ESTRATEGICA","Ley 1341 de 2009 y normas que lo modifican, complementan o reglamentan","Interno","Digital","Documentos de Archivo - electrónicos","PDF","Español","INFORMACIÓN PÚBLICA RESERVADA","Alfanet; Correos de los colaboradores; archivo del área","SI","Ley 1341 de 2009 y normas que lo modifican, complementan o reglamentan","Decreto 103 del 2015 \nArt 31","Reserva parcial","2018-09-28","4 AÑOS","N/A","a. Permitir el desarrollo del objeto del Ministerio/Fondo TIC, en los términos de los artículos 1o y 2o del Decreto 1414 de 2017."]
["101-10","INFORMACIÓN","GRUPO INTERNO DE TRABAJO PARA EL CONSENSO SOCIAL","Evidencia de a atención de espacios y/o reuniones internas atendidas","Evidencia de a atención de espacios y/o reuniones internas atendidas","GRUPO INTERNO DE TRABAJO PARA EL CONSENSO SOCIAL","2018-11-28","GRUPO INTERNO DE TRABAJO PARA EL CONSENSO SOCIAL","2019-01-02","ESTRATEGICO","COMUNICACION_ESTRATEGICA","COMUNICACION ESTRATEGICA","Ley 1341 de 2009 y normas que lo modifican, complementan o reglamentan","Interno","Físico","Documentos de Archivo - físicos","Papel","Español","INFORMACIÓN PÚBLICA","Alfanet; Archivo fisico del área, Archivo de la entidad","N/A","N/A","N/A","N/A","N/A","N/A","Dato semiprivado","a. Permitir el desarrollo del objeto del Ministerio/Fondo TIC, en los términos de los artículos 1o y 2o del Decreto 1414 de 2017."]
["101-11","INFORMACIÓN","GRUPO INTERNO DE TRABAJO PARA EL CONSENSO SOCIAL","Evidencia de a atención de espacios y/o reuniones internas atendidas","Evidencia de a atención de espacios y/o reuniones internas atendidas","GRUPO INTERNO DE TRABAJO PARA EL CONSENSO SOCIAL","2018-11-28","GRUPO INTERNO DE TRABAJO PARA EL CONSENSO SOCIAL","2019-01-02","ESTRATEGICO","COMUNICACION_ESTRATEGICA","COMUNICACION ESTRATEGICA","Ley 1341 de 2009 y normas que lo modifican, complementan o reglamentan","Interno","Digital","Documentos de Archivo - electrónicos","PDF","Español","INFORMACIÓN PÚBLICA","Sharepoint","N/A","N/A","N/A","N/A","N/A","N/A","Dato personal público","a. Permitir el desarrollo del objeto del Ministerio/Fondo TIC, en los términos de los artículos 1o y 2o del Decreto 1414 de 2017."]
["101-12","INFORMACIÓN","GRUPO INTERNO DE TRABAJO PARA EL CONSENSO SOCIAL","Evidencia de a atención de espacios y/o reuniones externas atendidas","Evidencia de a atención de espacios y/o reuniones externas atendidas","GRUPO INTERNO DE TRABAJO PARA EL CONSENSO SOCIAL","2018-11-28","GRUPO INTERNO DE TRABAJO PARA EL CONSENSO SOCIAL","2019-01-02","ESTRATEGICO","GESTION_ATENCION_GRUPOS_INTERES","GESTION DE ATENCION A GRUPOS DE INTERES","N/A","Interno","Digital","Documentos de Archivo - electrónicos","PDF","Español","INFORMACIÓN PÚBLICA","Sharepoint","N/A","N/A","N/A","N/A","N/A","N/A","Dato personal público","a. Permitir el desarrollo del objeto del Ministerio/Fondo TIC, en los términos de los artículos 1o y 2o del Decreto 1414 de 2017."]
["101-13","INFORMACIÓN","GRUPO INTERNO DE TRABAJO PARA EL CONSENSO SOCIAL","Solicitudes y elaboración de informes o insumos para entes de control internos o externos","Solicitudes y elaboración de informes o insumos para entes de control internos o externos","GRUPO INTERNO DE TRABAJO PARA EL CONSENSO SOCIAL","2018-11-28","GRUPO INTERNO DE TRABAJO PARA EL CONSENSO SOCIAL","2019-01-02","EVALUACION","ANALISIS_MEJORA_GESTION","EVALUACION Y APOYO AL CONTROL DE LA GESTION","Ley 1341 de 2009 y normas que lo modifican, complementan o reglamentan","Interno","Digital","Documentos de Archivo - electrónicos","XLS -PDF","Español","INFORMACIÓN PÚBLICA","Pagina WEB del Mintic ","N/A","N/A","N/A","N/A","N/A","N/A","Dato personal público","h. Atender requerimientos de información de entes de control tanto internos como externos."]
["101-14","INFORMACIÓN","GRUPO INTERNO DE TRABAJO PARA EL CONSENSO SOCIAL","Conformación y reportes de seguimiento a planes institucionales de la entidad","Conformación y reportes de seguimiento a planes institucionales de la entidad como ASPA, Plan de Participación Ciudadana, PES, etc","GRUPO INTERNO DE TRABAJO PARA EL CONSENSO SOCIAL","2018-11-28","GRUPO INTERNO DE TRABAJO PARA EL CONSENSO SOCIAL","2019-01-02","EVALUACION","ANALISIS_MEJORA_GESTION","EVALUACION Y APOYO AL CONTROL DE LA GESTION","Ley 1341 de 2009 y normas que lo modifican, complementan o reglamentan","Interno","Digital","Archivos Institucionales - electrónico","XLS -PDF","Español","INFORMACIÓN PÚBLICA","Pagina WEB del Mintic ","N/A","N/A","N/A","N/A","N/A","N/A","N/A","h. Atender requerimientos de información de entes de control tanto internos como externos."]
["101-15","INFORMACIÓN","GRUPO INTERNO DE TRABAJO PARA EL CONSENSO SOCIAL","Seguimiento y reporte de avances en los planes desarrollados con los distintos actores y/o grupos étnicos y/o sociales ","Seguimiento y reporte de avances en los planes desarrollados con los distintos actores y/o grupos étnicos y/o sociales, como por ejemplo CERREM, PIRC, Planes de salvaguarda, Autos, PND, etc","GRUPO INTERNO DE TRABAJO PARA EL CONSENSO SOCIAL","2018-11-28","GRUPO INTERNO DE TRABAJO PARA EL CONSENSO SOCIAL","2019-01-02","MISIONAL","ACCESO_USO_APROPIACION_TIC","USO Y APROPIACION DE LAS TIC","Ley 1341 de 2009 y normas que lo modifican, complementan o reglamentan","Interno","Digital","Documentos de Archivo - electrónicos","XLS -PDF","Español","INFORMACIÓN PÚBLICA","Sharepoint ; Alfanet","N/A","N/A","N/A","N/A","N/A","N/A","N/A","a. Permitir el desarrollo del objeto del Ministerio/Fondo TIC, en los términos de los artículos 1o y 2o del Decreto 1414 de 2017."]
["101-16","INFORMACIÓN","GRUPO INTERNO DE TRABAJO PARA EL CONSENSO SOCIAL","Seguimiento y evaluación a Politicas Publicas TIC con grupos étnicos","Seguimiento y evaluación a Politicas Publicas TIC con grupos étnicos","GRUPO INTERNO DE TRABAJO PARA EL CONSENSO SOCIAL","2018-11-28","GRUPO INTERNO DE TRABAJO PARA EL CONSENSO SOCIAL","2019-01-02","MISIONAL","SEGUIMIENTO_CONTROL_POLITICAS_TIC","SEGUIMIENTO Y EVALUACION DE POLITICAS TIC","Ley 1341 de 2009 y normas que lo modifican, complementan o reglamentan","Interno","Digital","Documentos de Archivo - electrónicos","XLS -PDF","Español","INFORMACIÓN PÚBLICA","Sharepoint ; correos de los funcionarios","N/A","N/A","N/A","N/A","N/A","N/A","N/A","a. Permitir el desarrollo del objeto del Ministerio/Fondo TIC, en los términos de los artículos 1o y 2o del Decreto 1414 de 2017."]
["101-17","INFORMACIÓN","GRUPO INTERNO DE TRABAJO PARA EL CONSENSO SOCIAL","Planeación y Formulación  a Politicas Publicas TIC con grupos étnicos","Planeación y Formulación  a Politicas Publicas TIC con grupos étnicos","GRUPO INTERNO DE TRABAJO PARA EL CONSENSO SOCIAL","2018-11-28","GRUPO INTERNO DE TRABAJO PARA EL CONSENSO SOCIAL","2019-01-02","MISIONAL","PLANEACION_FORMULACION_POLITICAS_TIC","PLANEACION Y FORMULACION DE POLITICAS TIC","Ley 1341 de 2009 y normas que lo modifican, complementan o reglamentan","Interno","Digital","Documentos de Archivo - electrónicos","XLS -PDF","Español","INFORMACIÓN PÚBLICA","Sharepoint; correos de los funcionarios ","N/A","N/A","N/A","N/A","N/A","N/A","N/A","a. Permitir el desarrollo del objeto del Ministerio/Fondo TIC, en los términos de los artículos 1o y 2o del Decreto 1414 de 2017."]
["101-18","RECURSO HUMANO","GRUPO INTERNO DE TRABAJO PARA EL CONSENSO SOCIAL","Personal (Negociadores, Abogados, Politologos, Especialiastas en proyectos y el Gobierno y Derechos Humanos)","Personal (Negociadores, Abogados, Politologos, Especialiastas en proyectos y el Gobierno y Derechos Humanos)","GRUPO INTERNO DE TRABAJO PARA EL CONSENSO SOCIAL","2018-11-28","GRUPO INTERNO DE TRABAJO PARA EL CONSENSO SOCIAL","2019-01-02","ESTRATEGICO","ARQUITECTURA_INSTITUCIONAL","GESTION DELCONOCIMIENTO","Ley 1341 de 2009 y normas que lo modifican, complementan o reglamentan","Interno","N/A","Sistemas de Trabajo colaborativo","N/A","Español","INFORMACIÓN PÚBLICA RESERVADA","Alfanet; Sharepoint; correos de los funcionarios ","SI","Ley 1341 de 2009 y normas que lo modifican, complementan o reglamentan","Decreto 103 del 2015 \nArt 31","Sin reserva","2018-09-28","4 AÑOS","Dato semiprivado","a. Permitir el desarrollo del objeto del Ministerio/Fondo TIC, en los términos de los artículos 1o y 2o del Decreto 1414 de 2017."]
["114-19","INFORMACIÓN","GRUPO INTERNO DE TRABAJO DE TRANSFORMACIÓN ORGANIZACIONAL","Matrices de recopilación de respuestas","Se recopila la información en una matriz de Excel con la información y respuestas solicitadas en FURAG y se guarda en repositorio del GIT de Transformación Organizacional \n\nCONSU","GRUPO INTERNO DE TRABAJO DE TRANSFORMACIÓN ORGANIZACIONAL","2018-11-28","GRUPO INTERNO DE TRABAJO DE TRANSFORMACIÓN ORGANIZACIONAL","2019-11-28","ESTRATEGICO","ARQUITECTURA_INSTITUCIONAL","FORTALECIMIENTO ORGANIZACIONAL","Decreto 1499 de 2017","Externo","Digital","Documentos de Archivo - electrónicos","XLS","Español","INFORMACIÓN PÚBLICA","https://mintic.sharepoint.com/Gestion_Humana/transformacion_organizacional/Documentos%20compartidos/Forms/AllItems.aspx?viewid=3632d54b%2Dc64c%2D439b%2Db068%2D62de45b199cb&id=%2FGestion%5FHumana%2Ftransformacion%5Forganizacional%2FDocumentos%20compartidos%2FFURAG","N/A","N/A","N/A","N/A","N/A","N/A","N/A","N/A"]
["114-20","INFORMACIÓN","GRUPO INTERNO DE TRABAJO DE TRANSFORMACIÓN ORGANIZACIONAL","Informe de resultados","Resultados gráficos que permiten ubicar el nivel de desempeño en cada índice, resultados consolidados por entidad y los grupos par.","GRUPO INTERNO DE TRABAJO DE TRANSFORMACIÓN ORGANIZACIONAL","2018-11-28","GRUPO INTERNO DE TRABAJO DE TRANSFORMACIÓN ORGANIZACIONAL","2019-11-28","ESTRATEGICO","ARQUITECTURA_INSTITUCIONAL","FORTALECIMIENTO ORGANIZACIONAL","Decreto 1499 de 2017","Externo","Digital","Documentos de Archivo - electrónicos","XLS","Español","INFORMACIÓN PÚBLICA","https://mintic.sharepoint.com/Gestion_Humana/transformacion_organizacional/Documentos%20compartidos/Forms/AllItems.aspx?viewid=3632d54b%2Dc64c%2D439b%2Db068%2D62de45b199cb&id=%2FGestion%5FHumana%2Ftransformacion%5Forganizacional%2FDocumentos%20compartidos%2FFURAG","N/A","N/A","N/A","N/A","N/A","N/A","N/A","N/A"]
["114-21","INFORMACIÓN","GRUPO INTERNO DE TRABAJO DE TRANSFORMACIÓN ORGANIZACIONAL","Certificación de reporte de avance a la gestión - FURAG","Notificación generada por el sistema de la Función pública donde se evidencia el reporte FURAG realizado por la Entidad","GRUPO INTERNO DE TRABAJO DE TRANSFORMACIÓN ORGANIZACIONAL","2018-11-28","GRUPO INTERNO DE TRABAJO DE TRANSFORMACIÓN ORGANIZACIONAL","2019-11-28","ESTRATEGICO","ARQUITECTURA_INSTITUCIONAL","FORTALECIMIENTO ORGANIZACIONAL","Decreto 1499 de 2017","Externo","Digital","Documentos de Archivo - electrónicos","XLS","Español","INFORMACIÓN PÚBLICA","https://mintic.sharepoint.com/Gestion_Humana/transformacion_organizacional/Documentos%20compartidos/Forms/AllItems.aspx?viewid=3632d54b%2Dc64c%2D439b%2Db068%2D62de45b199cb&id=%2FGestion%5FHumana%2Ftransformacion%5Forganizacional%2FDocumentos%20compartidos%2FFURAG","N/A","N/A","N/A","N/A","N/A","N/A","N/A","N/A"]
["114-22","INFORMACIÓN","GRUPO INTERNO DE TRABAJO DE TRANSFORMACIÓN ORGANIZACIONAL","Informe   ","Corresponde al informe y al mapa de riesgos de corrupción que se publica obedeciendo a la ley 1474 de 2011 en su articulo 73","GRUPO INTERNO DE TRABAJO DE TRANSFORMACIÓN ORGANIZACIONAL","2018-11-28","GRUPO INTERNO DE TRABAJO DE TRANSFORMACIÓN ORGANIZACIONAL","2019-11-28","ESTRATEGICO","ARQUITECTURA_INSTITUCIONAL","FORTALECIMIENTO ORGANIZACIONAL","Ley 1474 de 2011","Externo","Digital","Documentos de Archivo - electrónicos","PDF","Español","INFORMACIÓN PÚBLICA","https://www.mintic.gov.co/portal/inicio/Ministerio/Planes/Plan-Anticorrupcion/","N/A","N/A","N/A","N/A","N/A","N/A","N/A","N/A"]
["114-23","INFORMACIÓN","GRUPO INTERNO DE TRABAJO DE TRANSFORMACIÓN ORGANIZACIONAL","Comunicación ","Memorando y cronograma de actualización de perfil","GRUPO INTERNO DE TRABAJO DE TRANSFORMACIÓN ORGANIZACIONAL","2018-11-28","GRUPO INTERNO DE TRABAJO DE TRANSFORMACIÓN ORGANIZACIONAL","2019-11-28","ESTRATEGICO","ARQUITECTURA_INSTITUCIONAL","FORTALECIMIENTO ORGANIZACIONAL","N/A","N/A","Digital","Sistemas de Información corporativos",null,"Español","INFORMACIÓN PÚBLICA","Alfanet","N/A","N/A","N/A","N/A","N/A","N/A","Dato personal público","g. Conservar evidencia de los eventos de entrenamiento y sensibilización realizados, audiencias de adjudicación de contratos, reuniones internas y externas."]
["114-24","INFORMACIÓN","GRUPO INTERNO DE TRABAJO DE TRANSFORMACIÓN ORGANIZACIONAL","Cuadro de seguimiento a controles de riesgos","Matriz en excel donde se realiza seguimiento y monitoreo a cada uno de lo controles de gestión y corrupción de cada uno de los proceso del MIG","GRUPO INTERNO DE TRABAJO DE TRANSFORMACIÓN ORGANIZACIONAL","2018-11-28","GRUPO INTERNO DE TRABAJO DE TRANSFORMACIÓN ORGANIZACIONAL","2019-11-28","ESTRATEGICO","ARQUITECTURA_INSTITUCIONAL","FORTALECIMIENTO ORGANIZACIONAL","N/A","N/A","Digital","Documentos de Archivo - electrónicos","XLS","Español","INFORMACIÓN PÚBLICA","https://mintic.sharepoint.com/Gestion_Humana/transformacion_organizacional/Documentos%20compartidos/Forms/AllItems.aspx?viewid=3632d54b%2Dc64c%2D439b%2Db068%2D62de45b199cb&id=%2FGestion%5FHumana%2Ftransformacion%5Forganizacional%2FDocumentos%20compartidos%2FSEGUIMIENTO%20CONTROLES%202019","N/A","N/A","N/A","N/A","N/A","N/A","N/A","N/A"]
["114-25","INFORMACIÓN","GRUPO INTERNO DE TRABAJO DE TRANSFORMACIÓN ORGANIZACIONAL","Cuadro de seguimiento a indicadores ","Matriz en excel donde se realiza seguimiento a cada uno de los indicadores de riesgos","GRUPO INTERNO DE TRABAJO DE TRANSFORMACIÓN ORGANIZACIONAL","2018-11-28","GRUPO INTERNO DE TRABAJO DE TRANSFORMACIÓN ORGANIZACIONAL","2019-11-28","ESTRATEGICO","ARQUITECTURA_INSTITUCIONAL","FORTALECIMIENTO ORGANIZACIONAL","N/A","N/A","Digital","Documentos de Archivo - electrónicos","XLS","Español","INFORMACIÓN PÚBLICA","https://mintic.sharepoint.com/Gestion_Humana/transformacion_organizacional/Documentos%20compartidos/Forms/AllItems.aspx?viewid=3632d54b%2Dc64c%2D439b%2Db068%2D62de45b199cb&id=%2FGestion%5FHumana%2Ftransformacion%5Forganizacional%2FDocumentos%20compartidos%2FFortalecimiento%20Organizacional","N/A","N/A","N/A","N/A","N/A","N/A","N/A","N/A"]
["114-26","INFORMACIÓN","GRUPO INTERNO DE TRABAJO DE TRANSFORMACIÓN ORGANIZACIONAL","Listados de asistencia","Reuniones realizadas con los diferentes procesos con el fin de generar el contexto y el mapa de riesgo","GRUPO INTERNO DE TRABAJO DE TRANSFORMACIÓN ORGANIZACIONAL","2018-11-28","GRUPO INTERNO DE TRABAJO DE TRANSFORMACIÓN ORGANIZACIONAL","2019-11-28","APOYO","GESTION_RECURSOS","GESTION DOCUMENTAL","N/A","N/A","Digital","Documentos de Archivo - electrónicos","PDF","Español","INFORMACIÓN PÚBLICA","https://mintic.sharepoint.com/Gestion_Humana/transformacion_organizacional/Documentos%20compartidos/Forms/AllItems.aspx?viewid=3632d54b%2Dc64c%2D439b%2Db068%2D62de45b199cb&id=%2FGestion%5FHumana%2Ftransformacion%5Forganizacional%2FDocumentos%20compartidos%2FRIESGOS%20MINTIC%2FGESTI%C3%93N%20RIESGOS%202019%2FListados%20de%20asistencia","N/A","N/A","N/A","N/A","N/A","N/A","Dato personal público","g. Conservar evidencia de los eventos de entrenamiento y sensibilización realizados, audiencias de adjudicación de contratos, reuniones internas y externas."]
["114-27","INFORMACIÓN","GRUPO INTERNO DE TRABAJO DE TRANSFORMACIÓN ORGANIZACIONAL","Actas de cierre","Correos enviados a los líderes y gestore de procesos con anexos de los docuemntos de las mesas de trabajo para informar los cambios realizados en la actualización del perfil","GRUPO INTERNO DE TRABAJO DE TRANSFORMACIÓN ORGANIZACIONAL","2018-11-28","GRUPO INTERNO DE TRABAJO DE TRANSFORMACIÓN ORGANIZACIONAL","2019-11-28","ESTRATEGICO","ARQUITECTURA_INSTITUCIONAL","FORTALECIMIENTO ORGANIZACIONAL","N/A","N/A","Digital","Archivos Institucionales - electrónico",null,"Español","INFORMACIÓN PÚBLICA","https://mintic.sharepoint.com/Gestion_Humana/transformacion_organizacional/Documentos%20compartidos/Forms/AllItems.aspx?viewid=3632d54b%2Dc64c%2D439b%2Db068%2D62de45b199cb&id=%2FGestion%5FHumana%2Ftransformacion%5Forganizacional%2FDocumentos%20compartidos%2FRIESGOS%20MINTIC%2FGESTI%C3%93N%20RIESGOS%202019%2FActas%20de%20cierre","N/A","N/A","N/A","N/A","N/A","N/A","N/A","N/A"]
["114-28","INFORMACIÓN","GRUPO INTERNO DE TRABAJO DE TRANSFORMACIÓN ORGANIZACIONAL","Stakeholders y contexto","El contexto del perfil del riesgo que incluye cambios normativos, de proceso, tecnologicos , de grupos de interés, entre otros","GRUPO INTERNO DE TRABAJO DE TRANSFORMACIÓN ORGANIZACIONAL","2018-11-28","GRUPO INTERNO DE TRABAJO DE TRANSFORMACIÓN ORGANIZACIONAL","2019-11-28","ESTRATEGICO","ARQUITECTURA_INSTITUCIONAL","FORTALECIMIENTO ORGANIZACIONAL","N/A","N/A","Digital","Archivos Institucionales - electrónico","XLS","Español","INFORMACIÓN PÚBLICA","https://mintic.sharepoint.com/Gestion_Humana/transformacion_organizacional/Documentos%20compartidos/Forms/AllItems.aspx?viewid=3632d54b%2Dc64c%2D439b%2Db068%2D62de45b199cb&id=%2FGestion%5FHumana%2Ftransformacion%5Forganizacional%2FDocumentos%20compartidos%2FRIESGOS%20MINTIC%2FGESTI%C3%93N%20RIESGOS%202019%2FContexto%20%28Stakeholders%29","N/A","N/A","N/A","N/A","N/A","N/A","N/A","N/A"]
["114-29","INFORMACIÓN","GRUPO INTERNO DE TRABAJO DE TRANSFORMACIÓN ORGANIZACIONAL","Matrices de riesgos","Mapas de riesgos finales de cada uno de los procesos ","GRUPO INTERNO DE TRABAJO DE TRANSFORMACIÓN ORGANIZACIONAL","2018-11-28","GRUPO INTERNO DE TRABAJO DE TRANSFORMACIÓN ORGANIZACIONAL","2019-11-28","ESTRATEGICO","ARQUITECTURA_INSTITUCIONAL","FORTALECIMIENTO ORGANIZACIONAL","N/A","N/A","Digital","Archivos Institucionales - electrónico","XLS","Español","INFORMACIÓN PÚBLICA","https://simig.mintic.gov.co/Documentacion/frmListadoMaestroDocumentos.aspx","N/A","N/A","N/A","N/A","N/A","N/A","N/A","N/A"]
["114-30","INFORMACIÓN","GRUPO INTERNO DE TRABAJO DE TRANSFORMACIÓN ORGANIZACIONAL","Listados de asistencia de asesorias a procesos","El GIT de Transformación Organizacional brinda asesoria a los gestores de procesos con el fin de generar recomendacones y lineamientos frente a los temas que interviene cada dependencia.","GRUPO INTERNO DE TRABAJO DE TRANSFORMACIÓN ORGANIZACIONAL","2018-11-28","GRUPO INTERNO DE TRABAJO DE TRANSFORMACIÓN ORGANIZACIONAL","2019-11-28","ESTRATEGICO","ARQUITECTURA_INSTITUCIONAL","FORTALECIMIENTO ORGANIZACIONAL","N/A","N/A","Digital","Documentos de Archivo - electrónicos","PDF","Español","INFORMACIÓN PÚBLICA","https://mintic.sharepoint.com/Gestion_Humana/transformacion_organizacional/Documentos%20compartidos/Forms/AllItems.aspx?viewid=3632d54b%2Dc64c%2D439b%2Db068%2D62de45b199cb&id=%2FGestion%5FHumana%2Ftransformacion%5Forganizacional%2FDocumentos%20compartidos%2FSEGUIMIENTO%20CONTROLES%202019%2FFortalecimiento%20Organizacional%2FEvidencias%20controles%20FORG%2FCMIG5%2E%20%20Inducci%C3%B3n%20y%20acompa%C3%B1amiento%20a%20los%20gestores%20del%20proceso%20en%20el%20seguimiento%20a%20la%20gesti%C3%B3n%20del%20proceso%20designado","N/A","N/A","N/A","N/A","N/A","N/A","Dato personal público","g. Conservar evidencia de los eventos de entrenamiento y sensibilización realizados, audiencias de adjudicación de contratos, reuniones internas y externas."]
["114-31","INFORMACIÓN","GRUPO INTERNO DE TRABAJO DE TRANSFORMACIÓN ORGANIZACIONAL","Resultados de auditoria externa de calidad","Informes realizados de las auditorias externas al GIT de Transformación Organizaciona ","GRUPO INTERNO DE TRABAJO DE TRANSFORMACIÓN ORGANIZACIONAL","2018-11-28","GRUPO INTERNO DE TRABAJO DE TRANSFORMACIÓN ORGANIZACIONAL","2019-11-28","ESTRATEGICO","ARQUITECTURA_INSTITUCIONAL","FORTALECIMIENTO ORGANIZACIONAL","N/A","N/A","Digital","Documentos de Archivo - electrónicos","PDF","Español","INFORMACIÓN PÚBLICA","https://www.mintic.gov.co/portal/inicio/Transparencia-y-acceso-a-informacion-publica/","N/A","N/A","N/A","N/A","N/A","N/A","N/A","N/A"]
["114-32","INFORMACIÓN","GRUPO INTERNO DE TRABAJO DE TRANSFORMACIÓN ORGANIZACIONAL","Comunicaciones y certificaciones","Correos enviados mensualmente a los gestores de proceso indicado fechas maximas de reporte de indicadores…","GRUPO INTERNO DE TRABAJO DE TRANSFORMACIÓN ORGANIZACIONAL","2018-11-28","GRUPO INTERNO DE TRABAJO DE TRANSFORMACIÓN ORGANIZACIONAL","2019-11-28","ESTRATEGICO","ARQUITECTURA_INSTITUCIONAL","FORTALECIMIENTO ORGANIZACIONAL","N/A","N/A","Digital","Documentos de Archivo - electrónicos",null,"Español","INFORMACIÓN PÚBLICA","https://mintic.sharepoint.com/Gestion_Humana/transformacion_organizacional/Documentos%20compartidos/Forms/AllItems.aspx?viewid=3632d54b%2Dc64c%2D439b%2Db068%2D62de45b199cb&id=%2FGestion%5FHumana%2Ftransformacion%5Forganizacional%2FDocumentos%20compartidos%2FSEGUIMIENTO%20CONTROLES%202019%2FFortalecimiento%20Organizacional%2FEvidencias%20controles%20FORG%2FCMIG2%2E%20Alertas%20para%20el%20reporte%20de%20informaci%C3%B3n%20al%20seguimiento%20a%20la%20gesti%C3%B3n%20por%20procesos","N/A","N/A","N/A","N/A","N/A","N/A","N/A","N/A"]
["114-33","INFORMACIÓN","GRUPO INTERNO DE TRABAJO DE TRANSFORMACIÓN ORGANIZACIONAL","Informe de análisis de capacidades y entornos","Informe de resultados del diagnóstico de capacidades incluyendo la propuesta de mejora ad hoc al servicio priorizado","GRUPO INTERNO DE TRABAJO DE TRANSFORMACIÓN ORGANIZACIONAL","2018-11-28","GRUPO INTERNO DE TRABAJO DE TRANSFORMACIÓN ORGANIZACIONAL","2019-11-28","ESTRATEGICO","ARQUITECTURA_INSTITUCIONAL","FORTALECIMIENTO ORGANIZACIONAL","Decreto 1499 de 2017","Externo","Digital","Sistemas de Información corporativos","PDF","Español","INFORMACIÓN PÚBLICA","https://simig.mintic.gov.co/Documentacion/frmListadoMaestroDocumentos.aspx","N/A","N/A","N/A","N/A","N/A","N/A","N/A","N/A"]
["114-34","INFORMACIÓN","GRUPO INTERNO DE TRABAJO DE TRANSFORMACIÓN ORGANIZACIONAL","Acta de reunión","Actas de las reuniones de gestores y Comité MIG ","GRUPO INTERNO DE TRABAJO DE TRANSFORMACIÓN ORGANIZACIONAL","2018-11-28","GRUPO INTERNO DE TRABAJO DE TRANSFORMACIÓN ORGANIZACIONAL","2019-11-28","ESTRATEGICO","ARQUITECTURA_INSTITUCIONAL","FORTALECIMIENTO ORGANIZACIONAL","Resolución 1905 de 2019","Interno","Digital","Documentos de Archivo - electrónicos","PDF","Español","INFORMACIÓN PÚBLICA","https://mintic.sharepoint.com/Gestion_Humana/transformacion_organizacional/Documentos%20compartidos/Forms/AllItems.aspx?viewid=3632d54b%2Dc64c%2D439b%2Db068%2D62de45b199cb&id=%2FGestion%5FHumana%2Ftransformacion%5Forganizacional%2FDocumentos%20compartidos%2FCOMIT%C3%89%20MIG\n\nhttps://mintic.sharepoint.com/Gestion_Humana/transformacion_organizacional/Documentos%20compartidos/Forms/AllItems.aspx?viewid=3632d54b%2Dc64c%2D439b%2Db068%2D62de45b199cb&id=%2FGestion%5FHumana%2Ftransformacion%5Forganizacional%2FDocumentos%20compartidos%2FActas%20reuni%C3%B3n%20gestores%20de%20procesos","N/A","N/A","N/A","N/A","N/A","N/A","Dato personal público","g. Conservar evidencia de los eventos de entrenamiento y sensibilización realizados, audiencias de adjudicación de contratos, reuniones internas y externas."]
["114-35","INFORMACIÓN","GRUPO INTERNO DE TRABAJO DE TRANSFORMACIÓN ORGANIZACIONAL","Política de gestión y desempeño institucional - Fortalecimiento Organizacional y simplificación de procesos","La implementación de la política de Fortalecimiento Organizacional y Simplificación de Procesos es el resultado del\nejercicio de Direccionamiento Estratégico y Planeación, así como de los resultados obtenidos por la entidad","GRUPO INTERNO DE TRABAJO DE TRANSFORMACIÓN ORGANIZACIONAL","2018-11-28","GRUPO INTERNO DE TRABAJO DE TRANSFORMACIÓN ORGANIZACIONAL","2019-11-28","ESTRATEGICO","ARQUITECTURA_INSTITUCIONAL","FORTALECIMIENTO ORGANIZACIONAL","Decreto 1499 de 2017","Externo","Digital","Documentos de Archivo - electrónicos","PDF","Español","INFORMACIÓN PÚBLICA","https://mintic.sharepoint.com/Gestion_Humana/transformacion_organizacional/Documentos%20compartidos/Forms/AllItems.aspx?viewid=3632d54b%2Dc64c%2D439b%2Db068%2D62de45b199cb&id=%2FGestion%5FHumana%2Ftransformacion%5Forganizacional%2FDocumentos%20compartidos%2FMIPG%2F06%2E%20Fortalecimiento%20Organizacional%20y%20Simplificaci%C3%B3n%20de%20Procesos","N/A","N/A","N/A","N/A","N/A","N/A","N/A","N/A"]
["114-36","INFORMACIÓN","GRUPO INTERNO DE TRABAJO DE TRANSFORMACIÓN ORGANIZACIONAL","Comunicaciones","Comunicaciones generadas por parte de la oficina de planeación correspodnientes a la aporpiación del MIG","GRUPO INTERNO DE TRABAJO DE TRANSFORMACIÓN ORGANIZACIONAL","2018-11-28","GRUPO INTERNO DE TRABAJO DE TRANSFORMACIÓN ORGANIZACIONAL","2019-11-28","ESTRATEGICO","ARQUITECTURA_INSTITUCIONAL","FORTALECIMIENTO ORGANIZACIONAL","1905 DE 2019","Interno","Físico","Documentos de Archivo - físicos","Papel","Español","INFORMACIÓN PÚBLICA","CARPETAS DE ARCVICHO DE CORRESPONDENCIA SALIENTE","N/A","N/A","N/A","N/A","N/A","N/A","N/A","N/A"]
["114-37","INFORMACIÓN","GRUPO INTERNO DE TRABAJO DE TRANSFORMACIÓN ORGANIZACIONAL","Resultados de ambiente laboral","presentaciones de resultados de ambiente laboral en la entidad ","GRUPO INTERNO DE TRABAJO DE TRANSFORMACIÓN ORGANIZACIONAL","2018-11-28","GRUPO INTERNO DE TRABAJO DE TRANSFORMACIÓN ORGANIZACIONAL","2019-11-28","APOYO","GESTION_RECURSOS","GESTION DEL TALENTO HUMANO","1083 DE 2015","Externo","Digital","Documentos de Archivo - electrónicos","PDF","Español","INFORMACIÓN PÚBLICA","expediente contractual 676 de 2018","N/A","N/A","N/A","N/A","N/A","N/A","N/A","N/A"]
["114-38","INFORMACIÓN","GRUPO INTERNO DE TRABAJO DE TRANSFORMACIÓN ORGANIZACIONAL","Planes gestión y mejoramiento de ambiente laboral","estrategias diseñas o implementadas para cerrar las brechas de la medición ","GRUPO INTERNO DE TRABAJO DE TRANSFORMACIÓN ORGANIZACIONAL","2018-11-28","GRUPO INTERNO DE TRABAJO DE TRANSFORMACIÓN ORGANIZACIONAL","2019-11-28","APOYO","GESTION_RECURSOS","GESTION DEL TALENTO HUMANO","1083 DE 2015","Externo","Digital","Documentos de Archivo - electrónicos","PDF","Español","INFORMACIÓN PÚBLICA","https://mintic.sharepoint.com/Gestion_Humana/entregables_aspa_2019/Forms/AllItems.aspx?e=5%3Ac48e3af23e304488aff85796043d43a5&at=9&CT=1574970545724&OR=OWA%2DNT&CID=9c89e22b%2D41d3%2D45c7%2D5ec2%2Dc1083a6d22ae&FolderCTID=0x0120008373D678188F534883AD24A959DD769D&viewid=193c1f7a%2Df3bf%2D4ecd%2Daa13%2Dc2ab78d10b8c&id=%2FGestion%5FHumana%2Fentregables%5Faspa%5F2019%2FC2%2DT1%2D1000%2DT%5FTransformaci%C3%B3n%5Fy%5Fafianzamiento%5Fde%5Fla%5Fexperiencia%2FPLAN%20DE%20CAPACITACION%2FCapacitaciones%2FEnero%20a%20Junio","N/A","N/A","N/A","N/A","N/A","N/A","N/A","N/A"]
["114-39","INFORMACIÓN","GRUPO INTERNO DE TRABAJO DE TRANSFORMACIÓN ORGANIZACIONAL","Actividades de apropiación del MIG","Archivos de actividades y estartegias para la apropiación del modelo integrado de gestión","GRUPO INTERNO DE TRABAJO DE TRANSFORMACIÓN ORGANIZACIONAL","2018-11-28","GRUPO INTERNO DE TRABAJO DE TRANSFORMACIÓN ORGANIZACIONAL","2019-11-28","ESTRATEGICO","ARQUITECTURA_INSTITUCIONAL","FORTALECIMIENTO ORGANIZACIONAL","Resolución 1905 de 2019","Interno","Digital","Documentos de Archivo - electrónicos","PDF","Español","NO CLASIFICADA","https://mintic.sharepoint.com/Gestion_Humana/transformacion_organizacional/Documentos%20compartidos/Forms/AllItems.aspx?CT=1574968705800&OR=OWA%2DNT&CID=08e49e41%2D2779%2D94dd%2D239e%2Dad744644ecee&viewid=3632d54b%2Dc64c%2D439b%2Db068%2D62de45b199cb&id=%2FGestion%5FHumana%2Ftransformacion%5Forganizacional%2FDocumentos%20compartidos%2FSEGUIMIENTO%20CONTROLES%202019%2FFortalecimiento%20Organizacional%2FEvidencias%20controles%20FORG%2FCMIG1%2E%20Dise%C3%B1o%20y%20ejecuci%C3%B3n%20de%20estrategias%20pertinentes%20y%20oportunas%20para%20la%20apropiaci%C3%B3n%20del%20MIG","N/A","N/A","N/A","N/A","N/A","N/A","N/A","N/A"]
["114-40","INFORMACIÓN","GRUPO INTERNO DE TRABAJO DE TRANSFORMACIÓN ORGANIZACIONAL","Informes","Informes correspondientes a la apropiación del modelo integrado de gestión ","GRUPO INTERNO DE TRABAJO DE TRANSFORMACIÓN ORGANIZACIONAL","2018-11-28","GRUPO INTERNO DE TRABAJO DE TRANSFORMACIÓN ORGANIZACIONAL","2019-11-28","ESTRATEGICO","ARQUITECTURA_INSTITUCIONAL","FORTALECIMIENTO ORGANIZACIONAL","1905 DE 2019","Interno","Digital","Documentos de Archivo - electrónicos","PDF","Español","NO CLASIFICADA","https://mintic.sharepoint.com/Gestion_Humana/transformacion_organizacional/Documentos%20compartidos/Forms/AllItems.aspx?CT=1574968705800&OR=OWA%2DNT&CID=08e49e41%2D2779%2D94dd%2D239e%2Dad744644ecee&viewid=3632d54b%2Dc64c%2D439b%2Db068%2D62de45b199cb&id=%2FGestion%5FHumana%2Ftransformacion%5Forganizacional%2FDocumentos%20compartidos%2FSEGUIMIENTO%20CONTROLES%202019%2FFortalecimiento%20Organizacional%2FEvidencias%20controles%20FORG%2FCMIG1%2E%20Dise%C3%B1o%20y%20ejecuci%C3%B3n%20de%20estrategias%20pertinentes%20y%20oportunas%20para%20la%20apropiaci%C3%B3n%20del%20MIG","N/A","N/A","N/A","N/A","N/A","N/A","N/A","N/A"]
["114-41","INFORMACIÓN","GRUPO INTERNO DE TRABAJO DE TRANSFORMACIÓN ORGANIZACIONAL","Autodiagnóstico","Instrumento diseñado para que todas las entidades públicas, puedan determinar en cualquier momento, su estado de\ndesarrollo frente a temas puntuales de su gestión y con base en ello establecer medidas y acciones\nde planeación para su mejoramiento continuo","GRUPO INTERNO DE TRABAJO DE TRANSFORMACIÓN ORGANIZACIONAL","2018-11-28","GRUPO INTERNO DE TRABAJO DE TRANSFORMACIÓN ORGANIZACIONAL","2019-11-28","ESTRATEGICO","ARQUITECTURA_INSTITUCIONAL","FORTALECIMIENTO ORGANIZACIONAL","Decreto 1499 de 2017","Externo","Digital","Documentos de Archivo - electrónicos","PDF","Español","INFORMACIÓN PÚBLICA","https://mintic.sharepoint.com/Gestion_Humana/transformacion_organizacional/Documentos%20compartidos/Forms/AllItems.aspx?viewid=3632d54b%2Dc64c%2D439b%2Db068%2D62de45b199cb&id=%2FGestion%5FHumana%2Ftransformacion%5Forganizacional%2FDocumentos%20compartidos%2FMIPG","N/A","N/A","N/A","N/A","N/A","N/A","N/A","N/A"]
["114-42","INFORMACIÓN","GRUPO INTERNO DE TRABAJO DE TRANSFORMACIÓN ORGANIZACIONAL","Plan de mejoramiento","Conjunto de acciones planteadas por la entidad con el fin de cerrar las brechas identificadas en los autodiagnosticos","GRUPO INTERNO DE TRABAJO DE TRANSFORMACIÓN ORGANIZACIONAL","2018-11-28","GRUPO INTERNO DE TRABAJO DE TRANSFORMACIÓN ORGANIZACIONAL","2019-11-28","ESTRATEGICO","ARQUITECTURA_INSTITUCIONAL","FORTALECIMIENTO ORGANIZACIONAL","Decreto 1499 de 2017","Externo","Digital","Documentos de Archivo - electrónicos","PDF","Español","INFORMACIÓN PÚBLICA","https://mintic.sharepoint.com/Gestion_Humana/transformacion_organizacional/Documentos%20compartidos/Forms/AllItems.aspx?viewid=3632d54b%2Dc64c%2D439b%2Db068%2D62de45b199cb&id=%2FGestion%5FHumana%2Ftransformacion%5Forganizacional%2FDocumentos%20compartidos%2FMIPG","N/A","N/A","N/A","N/A","N/A","N/A","N/A","N/A"]
["114-43","INFORMACIÓN","GRUPO INTERNO DE TRABAJO DE TRANSFORMACIÓN ORGANIZACIONAL","Listados de asistencia","Son las asesoria a las diferentes dependencias por parte de los asesores de politicas del GIT de Transformación Organizacional con el fin de generar recomendaciones y lineamientos frente a los temas del MIPG","GRUPO INTERNO DE TRABAJO DE TRANSFORMACIÓN ORGANIZACIONAL","2018-11-28","GRUPO INTERNO DE TRABAJO DE TRANSFORMACIÓN ORGANIZACIONAL","2019-11-28","ESTRATEGICO","ARQUITECTURA_INSTITUCIONAL","FORTALECIMIENTO ORGANIZACIONAL","Decreto 1499 de 2017","Externo","Digital","Documentos de Archivo - electrónicos","PDF","Español","INFORMACIÓN PÚBLICA","https://mintic.sharepoint.com/Gestion_Humana/transformacion_organizacional/Documentos%20compartidos/Forms/AllItems.aspx?viewid=3632d54b%2Dc64c%2D439b%2Db068%2D62de45b199cb&id=%2FGestion%5FHumana%2Ftransformacion%5Forganizacional%2FDocumentos%20compartidos%2FMIPG","N/A","N/A","N/A","N/A","N/A","N/A","N/A","N/A"]
["114-44","INFORMACIÓN","GRUPO INTERNO DE TRABAJO DE TRANSFORMACIÓN ORGANIZACIONAL","Informes de seguimiento","Plan de acción donde se realiza seguimiento a cada una de las accioens planteadas con el fin de generar alertas de cumplimiento","GRUPO INTERNO DE TRABAJO DE TRANSFORMACIÓN ORGANIZACIONAL","2018-11-28","GRUPO INTERNO DE TRABAJO DE TRANSFORMACIÓN ORGANIZACIONAL","2019-11-28","ESTRATEGICO","ARQUITECTURA_INSTITUCIONAL","FORTALECIMIENTO ORGANIZACIONAL","Decreto 1499 de 2017","Externo","Digital","Documentos de Archivo - electrónicos","PDF","Español","INFORMACIÓN PÚBLICA","https://mintic.sharepoint.com/Gestion_Humana/transformacion_organizacional/Documentos%20compartidos/Forms/AllItems.aspx?viewid=3632d54b%2Dc64c%2D439b%2Db068%2D62de45b199cb&id=%2FGestion%5FHumana%2Ftransformacion%5Forganizacional%2FDocumentos%20compartidos%2FMIPG","N/A","N/A","N/A","N/A","N/A","N/A","N/A","N/A"]
["114-45","INFORMACIÓN","GRUPO INTERNO DE TRABAJO DE TRANSFORMACIÓN ORGANIZACIONAL","Informes de analisis de la estrategia de Grupo Comité Primario","Matriz en excel donde se identifica cada uno de los temas tratados en GCP de las diferentes dependencias, también se generan recomendaciones ","GRUPO INTERNO DE TRABAJO DE TRANSFORMACIÓN ORGANIZACIONAL","2018-11-28","GRUPO INTERNO DE TRABAJO DE TRANSFORMACIÓN ORGANIZACIONAL","2019-11-28","ESTRATEGICO","ARQUITECTURA_INSTITUCIONAL","FORTALECIMIENTO ORGANIZACIONAL","Resolución 1905 de 2019","Interno","Digital","Documentos de Archivo - electrónicos","XLS","Español","INFORMACIÓN PÚBLICA","https://mintic.sharepoint.com/Gestion_Humana/transformacion_organizacional/Documentos%20compartidos/Forms/AllItems.aspx?viewid=3632d54b%2Dc64c%2D439b%2Db068%2D62de45b199cb&id=%2FGestion%5FHumana%2Ftransformacion%5Forganizacional%2FDocumentos%20compartidos%2FSEGUIMIENTO%20CONTROLES%202019%2FFortalecimiento%20Organizacional%2FEvidencias%20controles%20FORG%2FCMIG8%2E%20Fortalecer%20los%20GCP%20dando%20la%20l%C3%ADnea%20inicial%20y%20hacer%20seguimiento%20al%20cumplimiento","N/A","N/A","N/A","N/A","N/A","N/A","N/A","N/A"]
["114-46","INFORMACIÓN","GRUPO INTERNO DE TRABAJO DE TRANSFORMACIÓN ORGANIZACIONAL","Listados de asistencia","Es la divulgación realizada a las diferentes dependencias sobre el protocolo GCP","GRUPO INTERNO DE TRABAJO DE TRANSFORMACIÓN ORGANIZACIONAL","2018-11-28","GRUPO INTERNO DE TRABAJO DE TRANSFORMACIÓN ORGANIZACIONAL","2019-11-28","ESTRATEGICO","ARQUITECTURA_INSTITUCIONAL","FORTALECIMIENTO ORGANIZACIONAL","Resolución 1905 de 2019","Interno","Digital","Documentos de Archivo - electrónicos","PDF","Español","INFORMACIÓN PÚBLICA","https://mintic.sharepoint.com/Gestion_Humana/transformacion_organizacional/Documentos%20compartidos/Forms/AllItems.aspx?viewid=3632d54b%2Dc64c%2D439b%2Db068%2D62de45b199cb&id=%2FGestion%5FHumana%2Ftransformacion%5Forganizacional%2FDocumentos%20compartidos%2FSEGUIMIENTO%20CONTROLES%202019%2FFortalecimiento%20Organizacional%2FEvidencias%20controles%20FORG%2FCMIG8%2E%20Fortalecer%20los%20GCP%20dando%20la%20l%C3%ADnea%20inicial%20y%20hacer%20seguimiento%20al%20cumplimiento","N/A","N/A","N/A","N/A","N/A","N/A","N/A","N/A"]
["114-47","INFORMACIÓN","GRUPO INTERNO DE TRABAJO DE TRANSFORMACIÓN ORGANIZACIONAL","Comunicaciones","Correos enviados a cada uno de los líderes donde se realizan recomendaciones sobre las actas de GCP cargadas en el SharePointo e seguimiento, control y mejora","GRUPO INTERNO DE TRABAJO DE TRANSFORMACIÓN ORGANIZACIONAL","2018-11-28","GRUPO INTERNO DE TRABAJO DE TRANSFORMACIÓN ORGANIZACIONAL","2019-11-28","ESTRATEGICO","ARQUITECTURA_INSTITUCIONAL","FORTALECIMIENTO ORGANIZACIONAL","Resolución 1905 de 2019","Interno","Digital","Documentos de Archivo - electrónicos","XLS","Español","INFORMACIÓN PÚBLICA","https://mintic.sharepoint.com/Gestion_Humana/transformacion_organizacional/Documentos%20compartidos/Forms/AllItems.aspx?viewid=3632d54b%2Dc64c%2D439b%2Db068%2D62de45b199cb&id=%2FGestion%5FHumana%2Ftransformacion%5Forganizacional%2FDocumentos%20compartidos%2FSEGUIMIENTO%20CONTROLES%202019%2FFortalecimiento%20Organizacional%2FEvidencias%20controles%20FORG%2FCMIG8%2E%20Fortalecer%20los%20GCP%20dando%20la%20l%C3%ADnea%20inicial%20y%20hacer%20seguimiento%20al%20cumplimiento","N/A","N/A","N/A","N/A","N/A","N/A","N/A","N/A"]
["114-48","INFORMACIÓN","GRUPO INTERNO DE TRABAJO DE TRANSFORMACIÓN ORGANIZACIONAL","Política de gestión y desempeño institucional -  Seguimiento y desempeño institucional","Lineamientos para la ejecucion de actividades de autoevaluación instirucional a traves del esquema de procesos","GRUPO INTERNO DE TRABAJO DE TRANSFORMACIÓN ORGANIZACIONAL","2018-11-28","GRUPO INTERNO DE TRABAJO ESPECIALIZADO DE RECURSOS Y ACTUACIONES ADMINISTRATIVAS","2019-11-28","ESTRATEGICO","ARQUITECTURA_INSTITUCIONAL","FORTALECIMIENTO ORGANIZACIONAL","Decreto 1499 de 2017","Externo","Digital","Documentos de Archivo - electrónicos","pdf","Español","INFORMACIÓN PÚBLICA","https://mintic.sharepoint.com/Gestion_Humana/transformacion_organizacional/Documentos%20compartidos/Forms/AllItems.aspx?viewid=3632d54b%2Dc64c%2D439b%2Db068%2D62de45b199cb&id=%2FGestion%5FHumana%2Ftransformacion%5Forganizacional%2FDocumentos%20compartidos%2FMIPG%2F16%2E%20Seguimiento%20y%20Evaluaci%C3%B3n%20del%20Desempe%C3%B1o%20Institucional","N/A","N/A","N/A","N/A","N/A","N/A","N/A","N/A"]
["114-49","INFORMACIÓN","GRUPO INTERNO DE TRABAJO DE TRANSFORMACIÓN ORGANIZACIONAL","Objetos virtuales de aprendizaje - modulos virtuales","Multimedia con contenidos relacionados con tecnologia de información, tecnologias de las comunicaciones, Modelo integrado de gestión y desarrollo personal, desarrollados en formato scorm para ser implementados dentro del sistema gestor de aprendizaje de gestion de conocimiento","GRUPO INTERNO DE TRABAJO DE TRANSFORMACIÓN ORGANIZACIONAL","2018-11-28","GRUPO INTERNO DE TRABAJO DE TRANSFORMACIÓN ORGANIZACIONAL","2019-11-28","ESTRATEGICO","ARQUITECTURA_INSTITUCIONAL","GESTION DELCONOCIMIENTO","Decreto 1499 de 2017","Externo","Digital","Portales, Intranet y Extranet","HTML (Página Web)","Español","INFORMACIÓN PÚBLICA","universidadcorporativa.mintic.gov.co/aulaVirtual","N/A","N/A","N/A","N/A","N/A","N/A","N/A","N/A"]
["114-50","INFORMACIÓN","GRUPO INTERNO DE TRABAJO DE TRANSFORMACIÓN ORGANIZACIONAL","Sistemas de información para la gestión del conocimiento","plataformas virtuales que apoyan la gestion de conocimiento, como lo es el micrositio, aulas virtuales y cartelera virtual, los cuales estan dentro del datacenter del mintic","GRUPO INTERNO DE TRABAJO DE TRANSFORMACIÓN ORGANIZACIONAL","2018-11-28","GRUPO INTERNO DE TRABAJO DE TRANSFORMACIÓN ORGANIZACIONAL","2019-11-28","ESTRATEGICO","ARQUITECTURA_INSTITUCIONAL","GESTION DELCONOCIMIENTO","Decreto 1499 de 2017","Externo","Digital","Sistemas de Información corporativos","HTML (Página Web)","Español","INFORMACIÓN PÚBLICA","Universidadcorporativa.mintic.gov.co/carteleraVirtual","N/A","N/A","N/A","N/A","N/A","N/A","Dato personal público","e. Mantener actualizada la historia laboral y registros de nómina de funcionarios del Ministerio/Fondo TIC."]
["114-51","INFORMACIÓN","GRUPO INTERNO DE TRABAJO DE TRANSFORMACIÓN ORGANIZACIONAL","Listados de asistencia","documentos fisicos de las reuniones que se desarrollan en torno a las estrategias de gestion de conocimiento","GRUPO INTERNO DE TRABAJO DE TRANSFORMACIÓN ORGANIZACIONAL","2018-11-28","GRUPO INTERNO DE TRABAJO DE TRANSFORMACIÓN ORGANIZACIONAL","2019-11-28","ESTRATEGICO","ARQUITECTURA_INSTITUCIONAL","GESTION DELCONOCIMIENTO","Decreto 1499 de 2017","Externo","Digital","Documentos de Archivo - electrónicos","PDF","Español","INFORMACIÓN PÚBLICA","https://mintic.sharepoint.com/:f:/r/sites/GestindeConocimiento/Documentos%20compartidos/General/ListasAsistencias?csf=1&e=rKuZim","N/A","N/A","N/A","N/A","N/A","N/A","Dato personal público","N/A"]
["114-52","INFORMACIÓN","GRUPO INTERNO DE TRABAJO DE TRANSFORMACIÓN ORGANIZACIONAL","Informe","documento sobre el avance de la implementación de la gestión de conocimiento en el mintic","GRUPO INTERNO DE TRABAJO DE TRANSFORMACIÓN ORGANIZACIONAL","2018-11-28","GRUPO INTERNO DE TRABAJO DE TRANSFORMACIÓN ORGANIZACIONAL","2019-11-28","ESTRATEGICO","ARQUITECTURA_INSTITUCIONAL","GESTION DELCONOCIMIENTO","Lineamiento de gestión documental","Interno","Digital","Documentos de Archivo - físicos","PDF","Español","INFORMACIÓN PÚBLICA","https://mintic.sharepoint.com/:f:/r/sites/GestindeConocimiento/Documentos%20compartidos/General/Informes?csf=1&e=fGMbsD","N/A","N/A","N/A","N/A","N/A","N/A","N/A","N/A"]
["114-53","INFORMACIÓN","GRUPO INTERNO DE TRABAJO DE TRANSFORMACIÓN ORGANIZACIONAL","Política de gestión y desempeño institucional - Gestión del conocimiento y la innovación","documentos sobre la implementacion de la dimension del mipg de gestion de conocimento e innovación en la entidad,","GRUPO INTERNO DE TRABAJO DE TRANSFORMACIÓN ORGANIZACIONAL","2018-11-28","GRUPO INTERNO DE TRABAJO DE TRANSFORMACIÓN ORGANIZACIONAL","2019-11-28","ESTRATEGICO","ARQUITECTURA_INSTITUCIONAL","GESTION DELCONOCIMIENTO","Decreto 1499 de 2017","Externo","Digital","Documentos de Archivo - electrónicos","PDF","Español","INFORMACIÓN PÚBLICA","https://mintic.sharepoint.com/Gestion_Humana/transformacion_organizacional/Documentos%20compartidos/Forms/AllItems.aspx?viewid=3632d54b%2Dc64c%2D439b%2Db068%2D62de45b199cb&id=%2FGestion%5FHumana%2Ftransformacion%5Forganizacional%2FDocumentos%20compartidos%2FMIPG%2F14%2E%20Gesti%C3%B3n%20del%20Conocimiento%20y%20la%20Innovaci%C3%B3n","N/A","N/A","N/A","N/A","N/A","N/A","N/A","N/A"]
["114-54","INFORMACIÓN","GRUPO INTERNO DE TRABAJO DE TRANSFORMACIÓN ORGANIZACIONAL","Solicitud","Son las inquietudes o manifestaciones generadas por los diferentes grupos de interés","GRUPO INTERNO DE TRABAJO DE TRANSFORMACIÓN ORGANIZACIONAL","2018-11-28","GRUPO INTERNO DE TRABAJO DE FORTALECIMIENTO DE LAS RELACIONES CON LOS GRUPOS DE INTERES","2019-11-28","APOYO","GESTION_RECURSOS","GESTION DOCUMENTAL","N/A","N/A","Digital","Sistemas de Información corporativos","Base de datos","Español","INFORMACIÓN PÚBLICA","ALFANET","N/A","N/A","N/A","N/A","N/A","N/A","Dato personal privado ","f. Atender y resolver peticiones, quejas, reclamos y sugerencias."]
["114-55","INFORMACIÓN","GRUPO INTERNO DE TRABAJO DE TRANSFORMACIÓN ORGANIZACIONAL","Respuestas","Son las respuestas a las inquietudes o manifestaciones generadas por los diferentes grupos de interés","GRUPO INTERNO DE TRABAJO DE TRANSFORMACIÓN ORGANIZACIONAL","2018-11-28","GRUPO INTERNO DE TRABAJO DE FORTALECIMIENTO DE LAS RELACIONES CON LOS GRUPOS DE INTERES","2019-11-28","APOYO","GESTION_RECURSOS","GESTION DOCUMENTAL","N/A","N/A","Digital","Sistemas de Información corporativos","Base de datos","Español","INFORMACIÓN PÚBLICA","ALFANET","N/A","N/A","N/A","N/A","N/A","N/A","Dato personal privado ","f. Atender y resolver peticiones, quejas, reclamos y sugerencias."]
["114-56","INFORMACIÓN","GRUPO INTERNO DE TRABAJO DE TRANSFORMACIÓN ORGANIZACIONAL","Programa","Estudios previos de la contratación de medición de ambiente laboral en la entidad ","GRUPO INTERNO DE TRABAJO DE TRANSFORMACIÓN ORGANIZACIONAL","2018-11-28","GRUPO INTERNO DE TRABAJO DE GESTIÓN DE TALENTO HUMANO","2019-11-28","APOYO","GESTION_RECURSOS","GESTION DEL TALENTO HUMANO","1083 DE 2015","Externo","N/A","Documentos de Archivo - electrónicos","PDF","Español","NO CLASIFICADA","expediente contractual 676 de 2018","N/A","N/A","N/A","N/A","N/A","N/A","Dato personal público","h. Atender requerimientos de información de entes de control tanto internos como externos."]
["114-57","INFORMACIÓN","GRUPO INTERNO DE TRABAJO DE TRANSFORMACIÓN ORGANIZACIONAL","Soporte digital","archivos de segmentación demografica y listados de asistencia ","GRUPO INTERNO DE TRABAJO DE TRANSFORMACIÓN ORGANIZACIONAL","2018-11-28","GRUPO INTERNO DE TRABAJO DE GESTIÓN DE TALENTO HUMANO","2019-11-28","APOYO","GESTION_RECURSOS","GESTION DEL TALENTO HUMANO","1083 DE 2015","Externo","Digital","Documentos de Archivo - electrónicos","XLS","Español","NO CLASIFICADA","expediente contractual 676 de 2018","N/A","N/A","N/A","N/A","N/A","N/A","N/A","N/A"]
["114-58","INFORMACIÓN","GRUPO INTERNO DE TRABAJO DE TRANSFORMACIÓN ORGANIZACIONAL","Actividades de sensibilización ","Se realiza las actividades correspondientes para cerrar las brechas identificadas en la medición","GRUPO INTERNO DE TRABAJO DE TRANSFORMACIÓN ORGANIZACIONAL","2018-11-28","GRUPO INTERNO DE TRABAJO DE GESTIÓN DE TALENTO HUMANO","2019-11-28","APOYO","GESTION_RECURSOS","GESTION DEL TALENTO HUMANO","1083 DE 2015","Externo","N/A","Documentos de Archivo - electrónicos","PDF","Español","NO CLASIFICADA","https://mintic.sharepoint.com/Gestion_Humana/entregables_aspa_2019/Forms/AllItems.aspx?e=5%3Ac48e3af23e304488aff85796043d43a5&at=9&CT=1574869556303&OR=OWA%2DNT&CID=9f52df98%2De397%2D79d9%2D9613%2D5c6b21f333a5&FolderCTID=0x0120008373D678188F534883AD24A959DD769D&viewid=193c1f7a%2Df3bf%2D4ecd%2Daa13%2Dc2ab78d10b8c&id=%2FGestion%5FHumana%2Fentregables%5Faspa%5F2019%2FC2%2DT1%2D1000%2DT%5FTransformaci%C3%B3n%5Fy%5Fafianzamiento%5Fde%5Fla%5Fexperiencia%2FPLAN%20DE%20CAPACITACION%2FCapacitaciones%2FEnero%20a%20Junio","N/A","N/A","N/A","N/A","N/A","N/A","N/A","N/A"]
["114-59","INFORMACIÓN","GRUPO INTERNO DE TRABAJO DE TRANSFORMACIÓN ORGANIZACIONAL","Informe de resultados","presentaciones de resultados de ambiente laboral en la entidad ","GRUPO INTERNO DE TRABAJO DE TRANSFORMACIÓN ORGANIZACIONAL","2018-11-28","GRUPO INTERNO DE TRABAJO DE GESTIÓN DE TALENTO HUMANO","2019-11-28","APOYO","GESTION_RECURSOS","GESTION DEL TALENTO HUMANO","1083 DE 2015","Externo","N/A","Documentos de Archivo - electrónicos","PDF","Español","NO CLASIFICADA","expediente contractual 676 de 2018","N/A","N/A","N/A","N/A","N/A","N/A","N/A","N/A"]
["112-60","INFORMACIÓN","GRUPO INTERNO DE TRABAJO DE SEGUIMIENTO A LA ESTRATEGIA","Plan de Acción","El Plan de Acción es la ruta durante la vigencia actual de la entidad  que consta de metas, asignación presupuestal, Políticas de Gestión y desempeño Institucional, sus responsables, presentando los objetivos de cada iniciativa, sus proyectos, indicadores y metas.","GRUPO INTERNO DE TRABAJO DE SEGUIMIENTO A LA ESTRATEGIA","2018-11-28","OFICINA DE TECNOLOGIAS DE LA INFORMACIÓN","2019-11-18","ESTRATEGICO","MARCO_ESTRATEGICO","DIRECCIONAMIENTO ESTRATEGICO","Resolución 3211 de 2018","Interno","Digital","Archivos Institucionales - electrónico","XLS -PDF","Español","INFORMACIÓN PÚBLICA",null,"N/A","N/A","N/A","N/A","N/A","N/A","N/A","a. Permitir el desarrollo del objeto del Ministerio/Fondo TIC, en los términos de los artículos 1o y 2o del Decreto 1414 de 2017."]
["112-61","INFORMACIÓN","GRUPO INTERNO DE TRABAJO DE SEGUIMIENTO A LA ESTRATEGIA","Plan Estratégico Sectorial","Comunicaciones y anexos referentes al plan estratégico","GRUPO INTERNO DE TRABAJO DE SEGUIMIENTO A LA ESTRATEGIA","2018-11-28","OFICINA DE TECNOLOGIAS DE LA INFORMACIÓN","2019-01-02","ESTRATEGICO","MARCO_ESTRATEGICO","DIRECCIONAMIENTO ESTRATEGICO","Resolución 3211 de 2018","Externo","Digital","Archivos Institucionales - electrónico","HTML (Página Web)","Español","INFORMACIÓN PÚBLICA",null,"N/A","N/A","N/A","N/A","N/A","N/A","N/A","a. Permitir el desarrollo del objeto del Ministerio/Fondo TIC, en los términos de los artículos 1o y 2o del Decreto 1414 de 2017."]
["112-62","INFORMACIÓN","GRUPO INTERNO DE TRABAJO DE SEGUIMIENTO A LA ESTRATEGIA","Informe al congreso","Describe los avances del Ministerio y entidades adscritas y vinculadas, de las metas anualmente en un periodo evaludado del plan estratégico, plan de acción, y ejecución presupuestal.","GRUPO INTERNO DE TRABAJO DE SEGUIMIENTO A LA ESTRATEGIA","2018-11-28","OFICINA DE TECNOLOGIAS DE LA INFORMACIÓN","2019-11-18","ESTRATEGICO","MARCO_ESTRATEGICO","DIRECCIONAMIENTO ESTRATEGICO","La Ley 152 de 1994, la Ley 1474 de 2011 y el Decreto 2482 de 2012","Externo","Digital","Archivos Institucionales - electrónico","XLS -PDF","Español","INFORMACIÓN PÚBLICA",null,"N/A","N/A","N/A","N/A","N/A","N/A","N/A","a. Permitir el desarrollo del objeto del Ministerio/Fondo TIC, en los términos de los artículos 1o y 2o del Decreto 1414 de 2017."]
["112-63","INFORMACIÓN","GRUPO INTERNO DE TRABAJO DE SEGUIMIENTO A LA ESTRATEGIA","Proyectos de gestión institucional, Proyectos misionales","Listado de proyectos de gestión institucional y misionales, enmarcados en las iniciativas (Prespuesto)","GRUPO INTERNO DE TRABAJO DE SEGUIMIENTO A LA ESTRATEGIA","2018-11-28","OFICINA DE TECNOLOGIAS DE LA INFORMACIÓN","2019-11-18","ESTRATEGICO","MARCO_ESTRATEGICO","DIRECCIONAMIENTO ESTRATEGICO","Ley 1341 de 2009","Externo","Digital","Archivos Institucionales - electrónico","PDF","Español","INFORMACIÓN PÚBLICA",null,"N/A","N/A","N/A","N/A","N/A","N/A","N/A","a. Permitir el desarrollo del objeto del Ministerio/Fondo TIC, en los términos de los artículos 1o y 2o del Decreto 1414 de 2017."]
["112-64","SOFTWARE","GRUPO INTERNO DE TRABAJO DE SEGUIMIENTO A LA ESTRATEGIA","ASPA","Aplicativo de seguimiento a plan de acción","GRUPO INTERNO DE TRABAJO DE SEGUIMIENTO A LA ESTRATEGIA","2018-11-28","OFICINA DE TECNOLOGIAS DE LA INFORMACIÓN","2019-01-02","ESTRATEGICO","MARCO_ESTRATEGICO","DIRECCIONAMIENTO ESTRATEGICO","Resolución 3211 de 2018","Interno","Digital","Sistemas de Información corporativos","HTML (Página Web)","Español","INFORMACIÓN PÚBLICA","https://www.mintic.gov.co/portal/604/w3-propertyvalue-570.html?_noredirect=1","N/A","N/A","N/A","N/A","N/A","N/A","Dato personal público","a. Permitir el desarrollo del objeto del Ministerio/Fondo TIC, en los términos de los artículos 1o y 2o del Decreto 1414 de 2017."]
["112-65","INFORMACIÓN","GRUPO INTERNO DE TRABAJO DE SEGUIMIENTO A LA ESTRATEGIA","Avances trimestrales del Plan de Acción","Seguimiento y avance en los proyectos,  actividades  de las iniciativas del Plan de Acción.",{"$f":"IF(C72=\"\",\"\",C72)","v":"GRUPO INTERNO DE TRABAJO DE SEGUIMIENTO A LA ESTRATEGIA"},"2018-11-28","OFICINA DE TECNOLOGIAS DE LA INFORMACIÓN","2019-01-02","ESTRATEGICO","MARCO_ESTRATEGICO","DIRECCIONAMIENTO ESTRATEGICO","Resolución 3211 de 2018","Interno","Digital","Archivos Institucionales - electrónico","PDF","Español","INFORMACIÓN PÚBLICA","https://aspa.mintic.gov.co/index.asp?vigencia=2019 \nUsuario: consulta\nClave: consulta","N/A","N/A","N/A","N/A","N/A","N/A","N/A","a. Permitir el desarrollo del objeto del Ministerio/Fondo TIC, en los términos de los artículos 1o y 2o del Decreto 1414 de 2017."]
["112-66","INFORMACIÓN","GRUPO INTERNO DE TRABAJO DE SEGUIMIENTO A LA ESTRATEGIA","Informe de Gestión del Plan de Acción","Resultados de la gestión del Plan de Acción indicando avance final consoliddado de la gestión y sus indicadores. ","GRUPO INTERNO DE TRABAJO DE SEGUIMIENTO A LA ESTRATEGIA","2018-11-28","OFICINA DE TECNOLOGIAS DE LA INFORMACIÓN","2019-11-18","ESTRATEGICO","MARCO_ESTRATEGICO","DIRECCIONAMIENTO ESTRATEGICO","Resolución 3211 de 2018","Interno","Digital","Sistemas de Información corporativos","PDF","Español","INFORMACIÓN PÚBLICA","http://www.mintic.gov.co/portal/604/w3-propertyvalue-560.html","N/A","N/A","N/A","N/A","N/A","N/A","N/A","a. Permitir el desarrollo del objeto del Ministerio/Fondo TIC, en los términos de los artículos 1o y 2o del Decreto 1414 de 2017."]
["112-67","INFORMACIÓN","GRUPO INTERNO DE TRABAJO DE SEGUIMIENTO A LA ESTRATEGIA","Comité Sectorial de Gestión y Desempeño","Actas y listados de asistencia del comité sectorial de gestión del desempeño","GRUPO INTERNO DE TRABAJO DE SEGUIMIENTO A LA ESTRATEGIA","2018-11-28","GRUPO INTERNO DE TRABAJO DE FORTALECIMIENTO DE LAS RELACIONES CON LOS GRUPOS DE INTERES","2019-11-18","ESTRATEGICO","MARCO_ESTRATEGICO","DIRECCIONAMIENTO ESTRATEGICO","Resolución 878 de 2018","Externo","Físico","Documentos de Archivo - físicos","Papel","Español","INFORMACIÓN PÚBLICA","http://www.mintic.gov.co/portal/604/w3-propertyvalue-560.html","N/A","N/A","N/A","N/A","N/A","N/A","Dato personal público","a. Permitir el desarrollo del objeto del Ministerio/Fondo TIC, en los términos de los artículos 1o y 2o del Decreto 1414 de 2017."]
["110-68","INFORMACIÓN","OFICINA ASESORA DE PLANEACIÓN Y ESTUDIOS SECTORIALES","Boletín seguimiento a metas de gobierno","Boletín de periodicidad Trimestral por medio del cual se observa la evolución de los compromisos del Gobierno, a través del seguimiento que realiza la Oficina Asesora de Planeación y Estudios Sectoriales.","OFICINA ASESORA DE PLANEACIÓN Y ESTUDIOS SECTORIALES","2018-11-28","OFICINA DE TECNOLOGIAS DE LA INFORMACIÓN","2019-11-18","MISIONAL","GESTION_CONOCIMIENTO_SECTOR_TIC","GESTION DE LA INFORMACION SECTORIAL","Plan Nacional de Desarrollo \"Pacto por Colombia, pacto por la equidad\", Ley del Plan Nacional de Desarrollo 2018-2022, el 25 de mayo de 2019","Externo","Digital","Documentos de Archivo - electrónicos","HTML (Página Web)","Español","INFORMACIÓN PÚBLICA","http://www.mintic.gov.co/portal/604/w3-propertyvalue-562.html","N/A","N/A","N/A","N/A","N/A","N/A","N/A","N/A"]
["112-69","INFORMACIÓN","GRUPO INTERNO DE TRABAJO DE SEGUIMIENTO A LA ESTRATEGIA","Actas de Comité Primario","Actas de las reuniones de comites primarios realizados por el grupo interno de trabajo de seguimiento a la estrategia","GRUPO INTERNO DE TRABAJO DE SEGUIMIENTO A LA ESTRATEGIA","2018-11-28","GRUPO INTERNO DE TRABAJO DE SEGUIMIENTO A LA GESTIÓN DE INGRESOS DEL FONDO TIC","2019-11-18","ESTRATEGICO","MARCO_ESTRATEGICO","DIRECCIONAMIENTO ESTRATEGICO","Resolucion 1905 de 2019 Mintic","Interno","Digital","Documentos de Archivo - electrónicos","HTML (Página Web)","Español","INFORMACIÓN PÚBLICA","https://colombiatic.mintic.gov.co/679/w3-multipropertyvalues-36371-85236.html","N/A","N/A","N/A","N/A","N/A","N/A","Dato personal público","a. Permitir el desarrollo del objeto del Ministerio/Fondo TIC, en los términos de los artículos 1o y 2o del Decreto 1414 de 2017."]
["112-70","RECURSO HUMANO","GRUPO INTERNO DE TRABAJO DE SEGUIMIENTO A LA ESTRATEGIA","Profesionales encargados de las funciones de asesoría y seguimiento del plan de acción, plan estratégico sectorial pertenecientes al grupo interno de trabajo de seguimiento a la estrategia","Este perfil es usado para el desarrollo de todos los procesos de la entidad operaciones internas asesora a las áreas en la planeación estratégica, asesoría y seguimiento del plan de acción, plan estratégico sectorial, informes realcionados al seguimiento de metas de gobierno sinergia ; este perfil  es presta servicios a los usuarios y partes interesadas servicios tanto internos como externos. Realiza la gestión de avanece en los proyectos institucional y misionales para dar a conocer a las partes interesadas. Asegura que la información publicada en planes proyectos programas, informe cuenta con la calidad, veracidad e intregridad.","GRUPO INTERNO DE TRABAJO DE SEGUIMIENTO A LA ESTRATEGIA","2018-11-28","GRUPO INTERNO DE TRABAJO DE SEGUIMIENTO A LA ESTRATEGIA","2019-01-02","ESTRATEGICO","MARCO_ESTRATEGICO","DIRECCIONAMIENTO ESTRATEGICO","N/A","N/A","N/A","N/A","N/A","N/A","NO CLASIFICADA","MIG https://mintic.sharepoint.com/sites/mig/seguimiento/Paginas/gcp_seguimiento_estrategia.aspx","N/A","N/A","N/A","N/A","N/A","N/A","N/A","a. Permitir el desarrollo del objeto del Ministerio/Fondo TIC, en los términos de los artículos 1o y 2o del Decreto 1414 de 2017."]
["120-71","RECURSO HUMANO","OFICINA DE TECNOLOGIAS DE LA INFORMACIÓN","Profesional encargado de las funciones de mantenimiento y asesoría del sofware usado.","Este perfil asegura que el sofware usado para realizar el seguimiento de metas de la entidad se encuentra funcionando y presta su servicios  para que los usuarios puedan acceder al él. Repara las fallas que se presente y asegura confiablidad en el acceso a la información.","OFICINA DE TECNOLOGIAS DE LA INFORMACIÓN","2018-11-28","OFICINA DE TECNOLOGIAS DE LA INFORMACIÓN","2019-01-02","ESTRATEGICO","ARQUITECTURA_INSTITUCIONAL","GESTION DE TECNOLOGIAS DE LA INFORMACION ","N/A","N/A","N/A","N/A","N/A","N/A","NO CLASIFICADA",null,null,null,null,null,null,null,null,"a. Permitir el desarrollo del objeto del Ministerio/Fondo TIC, en los términos de los artículos 1o y 2o del Decreto 1414 de 2017."]
["111-72","INFORMACIÓN","GRUPO INTERNO DE TRABAJO DE PLANEACIÓN Y SEGUIMIENTO PRESUPUESTAL","Documentos formulacion de proyectos","Estos documentos son elaborados por los Formualdores de los proyectos de inversión los cuales quedan cargados en la MGA de Departamento Nacional de Planeación.","GRUPO INTERNO DE TRABAJO DE PLANEACIÓN Y SEGUIMIENTO PRESUPUESTAL","2018-11-28","GRUPO INTERNO DE TRABAJO DE PLANEACIÓN Y SEGUIMIENTO PRESUPUESTAL","2019-01-01","ESTRATEGICO","MARCO_ESTRATEGICO","DIRECCIONAMIENTO ESTRATEGICO","Ley 819 de 2003 y el Plan Nacional de Desarrollo \"Pacto por Colombia, pacto por la equidad\", Ley del Plan Nacional de Desarrollo 2018-2022, el 25 de mayo de 2019","Interno","Digital","Documentos de Archivo - electrónicos","HTML (Página Web)","Español","INFORMACIÓN PÚBLICA","https://www.mintic.gov.co/portal/inicio/Ministerio/Presupuestos/","N/A","N/A","N/A","N/A","N/A","N/A","N/A","N/A"]
["111-73","INFORMACIÓN","GRUPO INTERNO DE TRABAJO DE PLANEACIÓN Y SEGUIMIENTO PRESUPUESTAL","Circulares de programacion ","Son documentos expedidos por entidades competentes como DNP y Min Hacienda o el Ministerio de Comunicaciones en donde se indica las fehas para entregar los proyectos a formular o el presupuesto a solicitar para la siguiente vigencia","GRUPO INTERNO DE TRABAJO DE PLANEACIÓN Y SEGUIMIENTO PRESUPUESTAL","2018-11-28","GRUPO INTERNO DE TRABAJO DE PLANEACIÓN Y SEGUIMIENTO PRESUPUESTAL","2019-01-02","ESTRATEGICO","MARCO_ESTRATEGICO","DIRECCIONAMIENTO ESTRATEGICO","Ley 819 de 2003 y el Plan Nacional de Desarrollo \"Pacto por Colombia, pacto por la equidad\", Ley del Plan Nacional de Desarrollo 2018-2022, el 25 de mayo de 2019","Externo","Físico","Documentos de Archivo - físicos","Papel","Español","INFORMACIÓN PÚBLICA","Archivo de la Entidad Ministerio de Tecnologia de la Información y las Comunicaciones","N/A","N/A","N/A","N/A","N/A","N/A","N/A","N/A"]
["111-74","INFORMACIÓN","GRUPO INTERNO DE TRABAJO DE PLANEACIÓN Y SEGUIMIENTO PRESUPUESTAL","Informes","Seguimiento a los proyectos de inversión a traves del SPI, con corte mensual  de las Metas e Indicadores y presupuesto de los respectivos proyectos","GRUPO INTERNO DE TRABAJO DE PLANEACIÓN Y SEGUIMIENTO PRESUPUESTAL","2018-11-28","GRUPO INTERNO DE TRABAJO DE PLANEACIÓN Y SEGUIMIENTO PRESUPUESTAL","2019-01-01","ESTRATEGICO","MARCO_ESTRATEGICO","DIRECCIONAMIENTO ESTRATEGICO","Ley 819 de 2003 y el Plan Nacional de Desarrollo \"Pacto por Colombia, pacto por la equidad\", Ley del Plan Nacional de Desarrollo 2018-2022, el 25 de mayo de 2019","Interno","Digital","Documentos de Archivo - electrónicos","HTML (Página Web)","Español","INFORMACIÓN PÚBLICA","https://spi.dnp.gov.co/","N/A","N/A","N/A","N/A","N/A","N/A","N/A","N/A"]
["111-75","INFORMACIÓN","GRUPO INTERNO DE TRABAJO DE PLANEACIÓN Y SEGUIMIENTO PRESUPUESTAL","Anteproyecto del Presupuesto de Inversion","Documentos que se consolida para el Marco de Gasto de Mediano Plazo con la informacion presupuestal del siguiente año de las  entidades del sector.","GRUPO INTERNO DE TRABAJO DE PLANEACIÓN Y SEGUIMIENTO PRESUPUESTAL","2018-11-28","GRUPO INTERNO DE TRABAJO DE PLANEACIÓN Y SEGUIMIENTO PRESUPUESTAL","2019-01-01","ESTRATEGICO","MARCO_ESTRATEGICO","DIRECCIONAMIENTO ESTRATEGICO","Ley 819 de 2003 y el Plan Nacional de Desarrollo \"Pacto por Colombia, pacto por la equidad\", Ley del Plan Nacional de Desarrollo 2018-2022, el 25 de mayo de 2019","Interno","Digital","Documentos de Archivo - electrónicos","Office OpenXML ","Español","INFORMACIÓN PÚBLICA","https://www.minhacienda.gov.co/webcenter/portal/Minhacienda/system/Search?resourceId=marco+de+gasto&wc.taskFlowId=dynamic-view&com.sun.faces.facelets.MARK_ID=goBtn&searchTaskflow=%2Foracle%2Fwebcenter%2Fsearch%2Fcontroller%2Ftaskflows%2FsearchMain%23main-taskflow&wc.taskFlowPath=%2Foracle%2Fwebcenter%2Fsearch%2Fcontroller%2Ftaskflows%2FdynamicSearch.xml&styleClass=WCSearchGoButton&resourceType=searchKeywords","N/A","N/A","N/A","N/A","N/A","N/A","N/A","N/A"]
["110-76","INFORMACIÓN","OFICINA ASESORA DE PLANEACIÓN Y ESTUDIOS SECTORIALES","PQRSd","Respuestas a las peticiones, quejas reclamos, sugerencias y denuncias","OFICINA ASESORA DE PLANEACIÓN Y ESTUDIOS SECTORIALES","2018-11-28","OFICINA ASESORA DE PLANEACIÓN Y ESTUDIOS SECTORIALES","2019-11-28","ESTRATEGICO","MARCO_ESTRATEGICO","DIRECCIONAMIENTO ESTRATEGICO","Ley 1712 de 2014 y ley 134 del 94","Externo","Físico","Documentos de Archivo - electrónicos","dBase ","Español","INFORMACIÓN PÚBLICA","Las respuestas deacuerdo con la solicitud se envían al peticionario.","N/A","N/A","N/A","N/A","N/A","N/A","Dato semiprivado","a. Permitir el desarrollo del objeto del Ministerio/Fondo TIC, en los términos de los artículos 1o y 2o del Decreto 1414 de 2017."]
["113-77","INFORMACIÓN","GRUPO INTERNO DE TRABAJO DE ESTADISTICAS Y ESTUDIOS SECTORIALES","Mesa técnica de estadísticas TIC","La mesa técnica de estadísticas TIC, asesora a la organización en temas  especificos de indicadores del sector, razón por la cual en sus actas se encuentra información de carácter oficial y con un altisimo valor para la investigación. Por todo lo anterior el contenido de la agrupación se debe conservar en su totalidad y al terminar los tiempos de retención, este material debe ser transferido al Archivo general de la Nación.","GRUPO INTERNO DE TRABAJO DE ESTADISTICAS Y ESTUDIOS SECTORIALES","2018-11-28","GRUPO INTERNO DE TRABAJO DE ESTADISTICAS Y ESTUDIOS SECTORIALES","2019-01-02","MISIONAL","GESTION_CONOCIMIENTO_SECTOR_TIC","GESTION DE LA INFORMACION SECTORIAL","Ley 1753 de 2015\nArticulo 160\n\nDecreto 1743 de 2016","Interno","Físico","Archivos Institucionales - físicos","PDF","Español","INFORMACIÓN PÚBLICA","N/A","N/A","N/A","N/A","N/A","N/A","N/A","Dato personal público","N/A"]
["113-78","INFORMACIÓN","GRUPO INTERNO DE TRABAJO DE ESTADISTICAS Y ESTUDIOS SECTORIALES","Certificación de calidad","Es el proceso mediante el cual se certifica el nivel de cumplimiento de los atributos de calidad establecidos internacionalmente para la producción estadística y que se enmarcan en los Principios Fundamentales de las Estadísticas Oficiales de la Organización de las Naciones Unidas (ONU) y del Código Nacional de Buenas Prácticas para las Estadísticas Oficiales, con el fin de satisfacer las necesidades de los usuarios, promoviendo así la credibilidad, la confiabilidad y la transparencia en la producción de información estadística.","GRUPO INTERNO DE TRABAJO DE ESTADISTICAS Y ESTUDIOS SECTORIALES","2018-11-28","GRUPO INTERNO DE TRABAJO DE ESTADISTICAS Y ESTUDIOS SECTORIALES","2019-01-02","MISIONAL","GESTION_CONOCIMIENTO_SECTOR_TIC","GESTION DE LA INFORMACION SECTORIAL","Ley 1753 de 2015\nArticulo 160\n\nDecreto 1743 de 2016","Interno","Físico","Archivos Institucionales - físicos","PDF","Español","INFORMACIÓN PÚBLICA","https://colombiatic.mintic.gov.co/","N/A","N/A","N/A","N/A","N/A","N/A","N/A","N/A"]
["113-79","INFORMACIÓN","GRUPO INTERNO DE TRABAJO DE ESTADISTICAS Y ESTUDIOS SECTORIALES","Boletín TIC","Este boletín tiene una periodicidad trimestral y su objetivo es divulgar los datos más relevantes del Sector de las TIC.  Para conocer el detalle de\nla información se sugiere consultar el archivo en Excel denominado Informe Trimestral de las TIC,\npublicado en el portal oficial de estadísticas del sector TIC – Colombia TIC.","GRUPO INTERNO DE TRABAJO DE ESTADISTICAS Y ESTUDIOS SECTORIALES","2018-11-28","GRUPO INTERNO DE TRABAJO DE ESTADISTICAS Y ESTUDIOS SECTORIALES","2019-01-02","MISIONAL","GESTION_CONOCIMIENTO_SECTOR_TIC","GESTION DE LA INFORMACION SECTORIAL","Resolución 5076 de 2016","Externo","Digital","Portales, Intranet y Extranet","PDF","Español","INFORMACIÓN PÚBLICA","https://colombiatic.mintic.gov.co/","N/A","N/A","N/A","N/A","N/A","N/A","N/A","N/A"]
["113-80","INFORMACIÓN","GRUPO INTERNO DE TRABAJO DE ESTADISTICAS Y ESTUDIOS SECTORIALES","Boletín Postal","El boletín tiene como objetivo dar a conocer el análisis y comportamiento estadístico de las cifras reportadas por los operadores de servicios postales en cuanto a la prestación de los servicios básicos y expresos definidos en la Ley 1369 de 2009; a través de los cuales se envían, movilizan y entregan cartas, paquetes, publicidad directa, publicaciones periódicas, catálogos y libros, entre otros objetos postales.","GRUPO INTERNO DE TRABAJO DE ESTADISTICAS Y ESTUDIOS SECTORIALES","2018-11-28","GRUPO INTERNO DE TRABAJO DE ESTADISTICAS Y ESTUDIOS SECTORIALES","2019-01-02","MISIONAL","GESTION_CONOCIMIENTO_SECTOR_TIC","GESTION DE LA INFORMACION SECTORIAL","Resolución 5076 de 2016","Externo","Digital","Portales, Intranet y Extranet","PDF","Español","INFORMACIÓN PÚBLICA","https://colombiatic.mintic.gov.co/","N/A","N/A","N/A","N/A","N/A","N/A","N/A","N/A"]
["113-81","INFORMACIÓN","GRUPO INTERNO DE TRABAJO DE ESTADISTICAS Y ESTUDIOS SECTORIALES","Boletín Acceso fijo a Internet","Este documento tiene como objetivo presentar un análisis del servicio de acceso fijo a Internet en Colombia, mediante el estudio y comportamiento de la velocidad efectiva de bajada o descarga ofrecida por cada uno de los proveedores de redes y servicios. Se desagrega a nivel geográfico, por tecnología y segmento.","GRUPO INTERNO DE TRABAJO DE ESTADISTICAS Y ESTUDIOS SECTORIALES","2018-11-28","GRUPO INTERNO DE TRABAJO DE ESTADISTICAS Y ESTUDIOS SECTORIALES","2019-01-02","MISIONAL","GESTION_CONOCIMIENTO_SECTOR_TIC","GESTION DE LA INFORMACION SECTORIAL","Resolución 5076 de 2016","Externo","Digital","Portales, Intranet y Extranet","PDF","Español","INFORMACIÓN PÚBLICA","https://colombiatic.mintic.gov.co/","N/A","N/A","N/A","N/A","N/A","N/A","N/A","N/A"]
["113-82","INFORMACIÓN","GRUPO INTERNO DE TRABAJO DE ESTADISTICAS Y ESTUDIOS SECTORIALES","Primera Gran Encuesta TIC 2017","La primera Gran Encuesta TIC tiene como objetivo articular esfuerzos estadísticos históricamente dispersos en diversas investigaciones, con el fin de permitirle al país contar con un referente unificado de información para los principales indicadores sectoriales producidos desde el Ministerio TIC","GRUPO INTERNO DE TRABAJO DE ESTADISTICAS Y ESTUDIOS SECTORIALES","2018-11-28","GRUPO INTERNO DE TRABAJO DE ESTADISTICAS Y ESTUDIOS SECTORIALES","2019-01-02","MISIONAL","GESTION_CONOCIMIENTO_SECTOR_TIC","GESTION DE LA INFORMACION SECTORIAL","N/A","Externo","Digital","Portales, Intranet y Extranet","PDF","Español","INFORMACIÓN PÚBLICA","https://colombiatic.mintic.gov.co/","N/A","N/A","N/A","N/A","N/A","N/A","N/A","N/A"]
["113-83","INFORMACIÓN","GRUPO INTERNO DE TRABAJO DE ESTADISTICAS Y ESTUDIOS SECTORIALES","Cuenta Satelite 2018","El sector TIC para la cuenta satélite corresponde a un grupo de actividades\neconómicas productivas que se enumeran a continuación:\n1. Manufactura TIC: corresponde a los procesos de fabricación de bienes TIC, incluye la\nproducción de productos tales como computadores y equipo periférico, equipos de\ncomunicación, equipos electrónicos de consumo y otros bienes y componentes TIC.\n2. Infraestructura TIC: incluye las obras civiles de infraestructura en telecomunicaciones.\n3. Comercio TIC: corresponde a la compra venta de bienes TIC.\n4. Telecomunicaciones: incluye servicios de telefonía fija, telefonía móvil, servicios a través\nde internet y otros servicios.\n5. Servicios TI: incluye servicios especializados en TI (edición de programas, desarrollo de\nsistemas, consultoría y gestión TI).\n6. Contenido y media: corresponde a servicios de producción, publicación y/o distribución de\ncontenido; se relaciona con servicios de distribución de programas en paquetes básicos,\nde películas (pago por ver) y radio, software de juegos, contenido en línea y servicios\nrelacionados, y otros contenidos y servicios relacionados.","GRUPO INTERNO DE TRABAJO DE ESTADISTICAS Y ESTUDIOS SECTORIALES","2018-11-28","GRUPO INTERNO DE TRABAJO DE ESTADISTICAS Y ESTUDIOS SECTORIALES","2019-01-02","MISIONAL","GESTION_CONOCIMIENTO_SECTOR_TIC","GESTION DE LA INFORMACION SECTORIAL","N/A","Externo","Digital","Portales, Intranet y Extranet","PDF","Español","INFORMACIÓN PÚBLICA","https://colombiatic.mintic.gov.co/","N/A","N/A","N/A","N/A","N/A","N/A","N/A","N/A"]
["120-84","INFORMACIÓN","OFICINA DE TECNOLOGIAS DE LA INFORMACIÓN","Citación ","Citaciones de los comités de control de cambios que realiza la Oficina de TI","OFICINA DE TECNOLOGIAS DE LA INFORMACIÓN","2018-11-28","OFICINA DE TECNOLOGIAS DE LA INFORMACIÓN","2019-01-02","ESTRATEGICO","ARQUITECTURA_INSTITUCIONAL","GESTION DE TECNOLOGIAS DE LA INFORMACION ","Decreto 1008 del 14 de junio de 2018","Externo","Digital","Sistemas de Mensajería Electrónica","EML ","Español","INFORMACIÓN PÚBLICA","Correo electrónico de los integrantes de comité de control de cambios","N/A","N/A","N/A","N/A","N/A","N/A","Dato personal público","N/A"]
["120-85","INFORMACIÓN","OFICINA DE TECNOLOGIAS DE LA INFORMACIÓN","Acta","Documento  que evidencia lo sucedido en los comités de control de cambios","OFICINA DE TECNOLOGIAS DE LA INFORMACIÓN","2018-11-28","OFICINA DE TECNOLOGIAS DE LA INFORMACIÓN","2019-01-02","ESTRATEGICO","ARQUITECTURA_INSTITUCIONAL","GESTION DE TECNOLOGIAS DE LA INFORMACION ","Decreto 1008 del 14 de junio de 2018","Externo","Físico","Documentos de Archivo - físicos","Papel","Español","INFORMACIÓN PÚBLICA RESERVADA","Repositorio SharePoint y archivo Oficina de TI","SI","Ley 1273 de 2009 \nArt 269","Resolución 318 de 2019","Reserva total","2018-11-28","5 Años","Dato personal público","N/A"]
["120-86","INFORMACIÓN","OFICINA DE TECNOLOGIAS DE LA INFORMACIÓN","Revisión pos implementación - PIR","Documento que evidencia la solicitud del cambio y la revisión que se realiza después de la implementación de este","OFICINA DE TECNOLOGIAS DE LA INFORMACIÓN","2018-11-28","OFICINA DE TECNOLOGIAS DE LA INFORMACIÓN","2019-01-02","ESTRATEGICO","ARQUITECTURA_INSTITUCIONAL","GESTION DE TECNOLOGIAS DE LA INFORMACION ","Decreto 1008 del 14 de junio de 2018","Externo","Digital","Documentos de Archivo - electrónicos","XLS","Español","INFORMACIÓN PÚBLICA RESERVADA","Herramienta de gestión de casos de la Oficina de TI (https://serviciosti.mintic.gov.co/)","SI","Ley 1273 de 2009 \nArt 269","Resolución 318 de 2019","Reserva total","2018-11-28","5 años","Dato personal público","N/A"]
["120-87","INFORMACIÓN","OFICINA DE TECNOLOGIAS DE LA INFORMACIÓN","Citación "," Citaciones del comité del Cooperación del Sistema Colombia TIC ","OFICINA DE TECNOLOGIAS DE LA INFORMACIÓN","2018-11-28","OFICINA DE TECNOLOGIAS DE LA INFORMACIÓN","2019-01-02","ESTRATEGICO","ARQUITECTURA_INSTITUCIONAL","GESTION DE TECNOLOGIAS DE LA INFORMACION ","Resolución 3484 del 2012","Externo","Digital","Documentos de Archivo - electrónicos","EML ","Español","INFORMACIÓN PÚBLICA","Correo electrónico","N/A","N/A","N/A","N/A","N/A","N/A","Dato personal público","N/A"]
["120-88","INFORMACIÓN","OFICINA DE TECNOLOGIAS DE LA INFORMACIÓN","Acta ","Actas del comité de Cooperación del Sistema Colombia TIC (actas y anexos)","OFICINA DE TECNOLOGIAS DE LA INFORMACIÓN","2018-11-28","OFICINA DE TECNOLOGIAS DE LA INFORMACIÓN","2019-01-02","ESTRATEGICO","ARQUITECTURA_INSTITUCIONAL","GESTION DE TECNOLOGIAS DE LA INFORMACION ","Resolución 3484 del 2012","Externo","Digital","Documentos de Archivo - electrónicos","PDF","Español","INFORMACIÓN PÚBLICA RESERVADA","Archivo MinTIC","SI","Las actas contienen información jurídica, administrativa y técnica, y en concordancia con el art 31  parrafo 2do del Decreto 103 de 2015 se anonimiza la información","Decreto 103 del 2015 \nArt 31","Reserva parcial","2016-12-26","5 Años","Dato personal público","N/A"]
["120-89","INFORMACIÓN","OFICINA DE TECNOLOGIAS DE LA INFORMACIÓN","ACUERDOS","Acuerdos de servicios estratégicos con entidades del sector  (actas y anexos)","OFICINA DE TECNOLOGIAS DE LA INFORMACIÓN","2018-11-28","OFICINA DE TECNOLOGIAS DE LA INFORMACIÓN","2019-01-02","ESTRATEGICO","ARQUITECTURA_INSTITUCIONAL","GESTION DE TECNOLOGIAS DE LA INFORMACION ","Decreto 1414 de 2017 y normas reglamentarias","Interno","Físico","Documentos de Archivo - físicos","Papel","Español","INFORMACIÓN PÚBLICA RESERVADA","Repositorio SharePoint y archivo Oficina de TI","SI","Ley 1273 de 2009 \nArt 269","Resolución 318 de 2019","Reserva total","2018-11-28","5 años","N/A","a. Permitir el desarrollo del objeto del Ministerio/Fondo TIC, en los términos de los artículos 1o y 2o del Decreto 1414 de 2017."]
["120-90","INFORMACIÓN","OFICINA DE TECNOLOGIAS DE LA INFORMACIÓN","Informe","Informe de estadisticas del sector","OFICINA DE TECNOLOGIAS DE LA INFORMACIÓN","2018-11-28","OFICINA DE TECNOLOGIAS DE LA INFORMACIÓN","2019-01-02","ESTRATEGICO","ARQUITECTURA_INSTITUCIONAL","GESTION DE TECNOLOGIAS DE LA INFORMACION ","Decreto 1414 de 2017 y normas reglamentarias","Interno","Digital","Documentos de Archivo - electrónicos","PDF","Español","INFORMACIÓN PÚBLICA RESERVADA","Repositorio SharePoint y archivo Oficina de TI","SI","Las actas contienen información jurídica, administrativa y técnica, y en concordancia con el art 31  parrafo 2do del Decreto 103 de 2015 se anonimiza la información","Decreto 103 del 2015 \nArt 31","Reserva parcial","2018-11-28","5 Años","N/A","a. Permitir el desarrollo del objeto del Ministerio/Fondo TIC, en los términos de los artículos 1o y 2o del Decreto 1414 de 2017."]
["120-91","INFORMACIÓN","OFICINA DE TECNOLOGIAS DE LA INFORMACIÓN","Estadisticas"," Estadisticas del sector","OFICINA DE TECNOLOGIAS DE LA INFORMACIÓN","2018-11-28","OFICINA DE TECNOLOGIAS DE LA INFORMACIÓN","2019-01-02","ESTRATEGICO","ARQUITECTURA_INSTITUCIONAL","GESTION DE TECNOLOGIAS DE LA INFORMACION ","Decreto 1414 de 2017 y normas reglamentarias","Interno","Digital","Documentos de Archivo - electrónicos",null,"Español","INFORMACIÓN PÚBLICA",null,"N/A","N/A","N/A","N/A","N/A","N/A","N/A","a. Permitir el desarrollo del objeto del Ministerio/Fondo TIC, en los términos de los artículos 1o y 2o del Decreto 1414 de 2017."]
["120-92","INFORMACIÓN","OFICINA DE TECNOLOGIAS DE LA INFORMACIÓN","Indicadores"," Indicadores del sector","OFICINA DE TECNOLOGIAS DE LA INFORMACIÓN","2018-11-28","OFICINA DE TECNOLOGIAS DE LA INFORMACIÓN","2019-01-02","ESTRATEGICO","ARQUITECTURA_INSTITUCIONAL","GESTION DE TECNOLOGIAS DE LA INFORMACION ","Decreto 1414 de 2017 y normas reglamentarias","Interno","Digital","Documentos de Archivo - electrónicos",null,"Español","INFORMACIÓN PÚBLICA",null,"N/A","N/A","N/A","N/A","N/A","N/A","N/A","a. Permitir el desarrollo del objeto del Ministerio/Fondo TIC, en los términos de los artículos 1o y 2o del Decreto 1414 de 2017."]
["120-93","INFORMACIÓN","OFICINA DE TECNOLOGIAS DE LA INFORMACIÓN","Solicitud","Solicitud de informes de gestión","OFICINA DE TECNOLOGIAS DE LA INFORMACIÓN","2018-11-28","OFICINA DE TECNOLOGIAS DE LA INFORMACIÓN","2019-01-02","ESTRATEGICO","ARQUITECTURA_INSTITUCIONAL","GESTION DE TECNOLOGIAS DE LA INFORMACION ","Decreto 1414 de 2017 y normas reglamentarias","Interno","Digital","Documentos de Archivo - electrónicos","PDF","Español","INFORMACIÓN PÚBLICA RESERVADA","Repositorio SharePoint y archivo Oficina de TI","SI","Ley 1273 de 2009 \nArt 269","Resolución 318 de 2019","Reserva total","2018-11-28","5 años","N/A","a. Permitir el desarrollo del objeto del Ministerio/Fondo TIC, en los términos de los artículos 1o y 2o del Decreto 1414 de 2017."]
["120-94","INFORMACIÓN","OFICINA DE TECNOLOGIAS DE LA INFORMACIÓN","Informe","Informes de Gestión","OFICINA DE TECNOLOGIAS DE LA INFORMACIÓN","2018-11-28","OFICINA DE TECNOLOGIAS DE LA INFORMACIÓN","2019-01-02","ESTRATEGICO","ARQUITECTURA_INSTITUCIONAL","GESTION DE TECNOLOGIAS DE LA INFORMACION ","Ley 951 de marzo 31 de 2005, acta de informe de gestión","Externo","Digital","Documentos de Archivo - electrónicos","PDF","Español","INFORMACIÓN PÚBLICA RESERVADA","Repositorio SharePoint y archivo Oficina de TI","SI","Las actas contienen información jurídica, administrativa y técnica, y en concordancia con el art 31  parrafo 2do del Decreto 103 de 2015 se anonimiza la información","Decreto 103 del 2015 \nArt 31","Reserva parcial","2018-11-28","5 Años","N/A","a. Permitir el desarrollo del objeto del Ministerio/Fondo TIC, en los términos de los artículos 1o y 2o del Decreto 1414 de 2017."]
["120-95","INFORMACIÓN","OFICINA DE TECNOLOGIAS DE LA INFORMACIÓN","Plan","Plan Estratégico de tecnologías de la Información PETI","OFICINA DE TECNOLOGIAS DE LA INFORMACIÓN","2018-11-28","OFICINA DE TECNOLOGIAS DE LA INFORMACIÓN","2019-01-02","ESTRATEGICO","ARQUITECTURA_INSTITUCIONAL","GESTION DE TECNOLOGIAS DE LA INFORMACION ","DECRETO 612 DE 2018","Externo","Digital","Documentos de Archivo - electrónicos","PDF","Español","INFORMACIÓN PÚBLICA RESERVADA","https://www.mintic.gov.co/portal/inicio/Ministerio/Acerca-del-MinTIC/Implementacion-estrategia-de-Gobierno-Digital/","SI","Artículo 21 y  literal c  del articulo 18 de la Ley 1712 de 2014 se anonimiza la información y secreto comercial industrial de terceros","Ley 1712 2014","Reserva parcial","2015-06-10","15 Años","N/A","N/A"]
["120-96","INFORMACIÓN","OFICINA DE TECNOLOGIAS DE LA INFORMACIÓN","Mapa de proceso","Proceso de información sectorial  (informes)","OFICINA DE TECNOLOGIAS DE LA INFORMACIÓN","2018-11-28","OFICINA DE TECNOLOGIAS DE LA INFORMACIÓN","2019-01-02","ESTRATEGICO","MARCO_ESTRATEGICO","DIRECCIONAMIENTO ESTRATEGICO","DECRETO 612 DE 2018","Externo","Digital","Documentos de Archivo - electrónicos","XLS","Español","INFORMACIÓN PÚBLICA",null,"N/A","N/A","N/A","N/A","N/A","N/A","N/A","N/A"]
["120-97","INFORMACIÓN","OFICINA DE TECNOLOGIAS DE LA INFORMACIÓN","Proceso de información sectorial  (informes)","Proceso de información sectorial  (informes)","OFICINA DE TECNOLOGIAS DE LA INFORMACIÓN","2018-11-28","OFICINA DE TECNOLOGIAS DE LA INFORMACIÓN","2019-01-02","ESTRATEGICO","MARCO_ESTRATEGICO","DIRECCIONAMIENTO ESTRATEGICO","DECRETO 612 DE 2018","Externo","Digital","Documentos de Archivo - electrónicos","XLS","Español","INFORMACIÓN PÚBLICA","MIG","N/A","N/A","N/A","N/A","N/A","N/A","N/A","N/A"]
["120-98","INFORMACIÓN","OFICINA DE TECNOLOGIAS DE LA INFORMACIÓN","Base de datos Usuarios Plataformas Telefónica y comunicaciones unificadas UC","Registro y actualización de usuarios en las respectivas bases de datos de las plataformas telefónicas y Comunicaciones Unificadas","OFICINA DE TECNOLOGIAS DE LA INFORMACIÓN","2018-11-28","OFICINA DE TECNOLOGIAS DE LA INFORMACIÓN","2019-01-02","ESTRATEGICO","ARQUITECTURA_INSTITUCIONAL","GESTION DE TECNOLOGIAS DE LA INFORMACION ","N/A","N/A","Digital","Sistemas de Bases de Datos","Base de datos","Español","INFORMACIÓN PÚBLICA RESERVADA","INTRANET","SI","Ley 1712 2014 \nArticulo 18 literal c","Ley 1712 2014","Reserva total","2016-12-26","15 Años","Dato personal público","N/A"]
["120-99","INFORMACIÓN","OFICINA DE TECNOLOGIAS DE LA INFORMACIÓN","Plan Estratégico de tecnologías de la Información PETI ","Contiene el plan estratégico de tecnologías de la Información PETI, del ministerio de Tecnologías de Información de acuerdo con las guias de marco de referencia de la arquitectura empresarial.","OFICINA DE TECNOLOGIAS DE LA INFORMACIÓN","2018-11-28","OFICINA DE TECNOLOGIAS DE LA INFORMACIÓN","2019-01-02","ESTRATEGICO","ARQUITECTURA_INSTITUCIONAL","GESTION DE TECNOLOGIAS DE LA INFORMACION ","DECRETO 612 DE 2018","Externo","Digital","Documentos de Archivo - electrónicos","PDF","Español","INFORMACIÓN PÚBLICA RESERVADA","https://www.mintic.gov.co/portal/inicio/Ministerio/Acerca-del-MinTIC/Implementacion-estrategia-de-Gobierno-Digital/","SI","Artículo 21 y  literal c  del articulo 18 de la Ley 1712 de 2014 se anonimiza la información y secreto comercial industrial de terceros","Ley 1712 2014","Reserva parcial","2015-06-10","15 Años","N/A","N/A"]
["120-100","SOFTWARE","OFICINA DE TECNOLOGIAS DE LA INFORMACIÓN","Aplicativo - Alfanet","Sistema de información de gestión documental","OFICINA DE TECNOLOGIAS DE LA INFORMACIÓN","2018-11-28","OFICINA DE TECNOLOGIAS DE LA INFORMACIÓN","2019-01-02","ESTRATEGICO","ARQUITECTURA_INSTITUCIONAL","GESTION DE TECNOLOGIAS DE LA INFORMACION ","N/A","N/A","Digital","Sistemas de Información corporativos","Base de datos","Español","INFORMACIÓN PÚBLICA RESERVADA","Servidores de la Oficina de TI","SI","Ley 1712 Articulo 18 literal c. Los secretos comerciales, industriales y profesionales asi como los estipulados en el paragrafo del articulo 77 de la ley 1474 de 2011","Ley 1712 2014","Reserva parcial","2017-06-30","15 Años","N/A","N/A"]
["120-101","SOFTWARE","OFICINA DE TECNOLOGIAS DE LA INFORMACIÓN","Aplicativo - Zafiro","Sistema de información de gestión documental","OFICINA DE TECNOLOGIAS DE LA INFORMACIÓN","2018-11-28","OFICINA DE TECNOLOGIAS DE LA INFORMACIÓN","2019-01-02","ESTRATEGICO","ARQUITECTURA_INSTITUCIONAL","GESTION DE TECNOLOGIAS DE LA INFORMACION ","N/A","N/A","Digital","Sistemas de Información corporativos","Base de datos","Español","INFORMACIÓN PÚBLICA RESERVADA","Servidores de la Oficina de TI","SI","Ley 1712 Articulo 18 literal c. Los secretos comerciales, industriales y profesionales asi como los estipulados en el paragrafo del articulo 77 de la ley 1474 de 2011","Ley 1712 2014","Reserva parcial","2017-06-30","15 Años","N/A","N/A"]
["120-102","SOFTWARE","OFICINA DE TECNOLOGIAS DE LA INFORMACIÓN","Aplicativo - Seven","Sistema de información financiera y Administrativa","OFICINA DE TECNOLOGIAS DE LA INFORMACIÓN","2018-11-28","OFICINA DE TECNOLOGIAS DE LA INFORMACIÓN","2019-01-02","ESTRATEGICO","ARQUITECTURA_INSTITUCIONAL","GESTION DE TECNOLOGIAS DE LA INFORMACION ","N/A","N/A","Digital","Sistemas de Información corporativos","Base de datos","Español","INFORMACIÓN PÚBLICA RESERVADA","Servidores de la Oficina de TI","SI","Ley 1712 Articulo 18 literal c. Los secretos comerciales, industriales y profesionales asi como los estipulados en el paragrafo del articulo 77 de la ley 1474 de 2011","Ley 1712 2014","Reserva parcial","2017-06-30","15 Años","N/A","N/A"]
["120-103","SOFTWARE","OFICINA DE TECNOLOGIAS DE LA INFORMACIÓN","Aplicativo - Cobro coactivo","Sistema de información financiera y Administrativa","OFICINA DE TECNOLOGIAS DE LA INFORMACIÓN","2018-11-28","OFICINA DE TECNOLOGIAS DE LA INFORMACIÓN","2019-01-02","ESTRATEGICO","ARQUITECTURA_INSTITUCIONAL","GESTION DE TECNOLOGIAS DE LA INFORMACION ","N/A","N/A","Digital","Sistemas de Información corporativos","Base de datos","Español","INFORMACIÓN PÚBLICA RESERVADA","Servidores de la Oficina de TI","SI","Ley 1712 Articulo 18 literal c. Los secretos comerciales, industriales y profesionales asi como los estipulados en el paragrafo del articulo 77 de la ley 1474 de 2011","Ley 1712 2014","Reserva parcial","2017-07-01","15 Años","N/A","N/A"]
["120-104","SOFTWARE","OFICINA DE TECNOLOGIAS DE LA INFORMACIÓN","Aplicativo - Kactus","Sistema de información de gestion de recurso humano","OFICINA DE TECNOLOGIAS DE LA INFORMACIÓN","2018-11-28","OFICINA DE TECNOLOGIAS DE LA INFORMACIÓN","2019-01-02","ESTRATEGICO","ARQUITECTURA_INSTITUCIONAL","GESTION DE TECNOLOGIAS DE LA INFORMACION ","N/A","N/A","Digital","Sistemas de Información corporativos","Base de datos","Español","INFORMACIÓN PÚBLICA RESERVADA","Servidores de la Oficina de TI","SI","Ley 1712 Articulo 18 literal c. Los secretos comerciales, industriales y profesionales asi como los estipulados en el paragrafo del articulo 77 de la ley 1474 de 2011","Ley 1712 2014","Reserva parcial","2017-07-03","15 Años","N/A","N/A"]
["120-105","SOFTWARE","OFICINA DE TECNOLOGIAS DE LA INFORMACIÓN","Aplicativo - Pólizas y garantías","Módulo de gestión de polizas y garantías","OFICINA DE TECNOLOGIAS DE LA INFORMACIÓN","2018-11-28","OFICINA DE TECNOLOGIAS DE LA INFORMACIÓN","2019-01-02","ESTRATEGICO","ARQUITECTURA_INSTITUCIONAL","GESTION DE TECNOLOGIAS DE LA INFORMACION ","N/A","N/A","Digital","Sistemas de Información corporativos","Base de datos","Español","INFORMACIÓN PÚBLICA RESERVADA","Servidores de la Oficina de TI","SI","Ley 1712 Articulo 18 literal c. Los secretos comerciales, industriales y profesionales asi como los estipulados en el paragrafo del articulo 77 de la ley 1474 de 2011","Ley 1712 2014","Reserva parcial","2017-06-30","15 Años","N/A","N/A"]
["120-106","SOFTWARE","OFICINA DE TECNOLOGIAS DE LA INFORMACIÓN","Aplicativo - BDU","Base de datos única de Operadores y prestadores de servicio","OFICINA DE TECNOLOGIAS DE LA INFORMACIÓN","2018-11-28","OFICINA DE TECNOLOGIAS DE LA INFORMACIÓN","2019-01-02","ESTRATEGICO","ARQUITECTURA_INSTITUCIONAL","GESTION DE TECNOLOGIAS DE LA INFORMACION ","N/A","N/A","Digital","Sistemas de Información corporativos","Base de datos","Español","INFORMACIÓN PÚBLICA RESERVADA","Servidores de la Oficina de TI","SI","Ley 1712 Articulo 18 literal c. Los secretos comerciales, industriales y profesionales asi como los estipulados en el paragrafo del articulo 77 de la ley 1474 de 2011","Ley 1712 2014","Reserva parcial","2017-06-30","15 Años","N/A","N/A"]
["120-107","SOFTWARE","OFICINA DE TECNOLOGIAS DE LA INFORMACIÓN","Aplicativo - Alertas","Base de datos única de Operadores y prestadores de servicio","OFICINA DE TECNOLOGIAS DE LA INFORMACIÓN","2018-11-28","OFICINA DE TECNOLOGIAS DE LA INFORMACIÓN","2019-01-02","ESTRATEGICO","ARQUITECTURA_INSTITUCIONAL","GESTION DE TECNOLOGIAS DE LA INFORMACION ","N/A","N/A","Digital","Sistemas de Información corporativos","Base de datos","Español","INFORMACIÓN PÚBLICA RESERVADA","Servidores de la Oficina de TI","SI","Ley 1712 Articulo 18 literal c. Los secretos comerciales, industriales y profesionales asi como los estipulados en el paragrafo del articulo 77 de la ley 1474 de 2011","Ley 1712 2014","Reserva parcial","2017-06-30","15 Años","N/A","N/A"]
["120-108","SOFTWARE","OFICINA DE TECNOLOGIAS DE LA INFORMACIÓN","Aplicativo - Notificaciones","Base de datos única de Operadores y prestadores de servicio","OFICINA DE TECNOLOGIAS DE LA INFORMACIÓN","2018-11-28","OFICINA DE TECNOLOGIAS DE LA INFORMACIÓN","2019-01-02","ESTRATEGICO","ARQUITECTURA_INSTITUCIONAL","GESTION DE TECNOLOGIAS DE LA INFORMACION ","N/A","N/A","Digital","Sistemas de Información corporativos","Base de datos","Español","INFORMACIÓN PÚBLICA RESERVADA","Servidores de la Oficina de TI","SI","Ley 1712 Articulo 18 literal c. Los secretos comerciales, industriales y profesionales asi como los estipulados en el paragrafo del articulo 77 de la ley 1474 de 2011","Ley 1712 2014","Reserva parcial","2017-06-30","15 Años","N/A","N/A"]
["120-109","SOFTWARE","OFICINA DE TECNOLOGIAS DE LA INFORMACIÓN","Aplicativo - Auraportal","Registro y autorización de operadores de comunicaciones","OFICINA DE TECNOLOGIAS DE LA INFORMACIÓN","2018-11-28","OFICINA DE TECNOLOGIAS DE LA INFORMACIÓN","2019-01-02","ESTRATEGICO","ARQUITECTURA_INSTITUCIONAL","GESTION DE TECNOLOGIAS DE LA INFORMACION ","N/A","N/A","Digital","Sistemas de Información corporativos","Base de datos","Español","INFORMACIÓN PÚBLICA RESERVADA","Servidores de la Oficina de TI","SI","Ley 1712 Articulo 18 literal c. Los secretos comerciales, industriales y profesionales asi como los estipulados en el paragrafo del articulo 77 de la ley 1474 de 2011","Ley 1712 2014","Reserva parcial","2017-06-30","15 Años","N/A","N/A"]
["120-110","SOFTWARE","OFICINA DE TECNOLOGIAS DE LA INFORMACIÓN","Aplicativo - SGE","Sistema de Gestión del Espectro","OFICINA DE TECNOLOGIAS DE LA INFORMACIÓN","2018-11-28","OFICINA DE TECNOLOGIAS DE LA INFORMACIÓN","2019-01-02","ESTRATEGICO","ARQUITECTURA_INSTITUCIONAL","GESTION DE TECNOLOGIAS DE LA INFORMACION ","N/A","N/A","Digital","Sistemas de Información corporativos","Base de datos","Español","INFORMACIÓN PÚBLICA RESERVADA","Servidores de la Oficina de TI","SI","Ley 1712 Articulo 18 literal c. Los secretos comerciales, industriales y profesionales asi como los estipulados en el paragrafo del articulo 77 de la ley 1474 de 2011","Ley 1712 2014","Reserva parcial","2017-06-30","15 Años","N/A","N/A"]
["120-111","SOFTWARE","OFICINA DE TECNOLOGIAS DE LA INFORMACIÓN","Aplicativo - SER","Sistema electrónico de recaudo","OFICINA DE TECNOLOGIAS DE LA INFORMACIÓN","2018-11-28","OFICINA DE TECNOLOGIAS DE LA INFORMACIÓN","2019-01-02","ESTRATEGICO","ARQUITECTURA_INSTITUCIONAL","GESTION DE TECNOLOGIAS DE LA INFORMACION ","N/A","N/A","Digital","Sistemas de Información corporativos","Base de datos","Español","INFORMACIÓN PÚBLICA RESERVADA","Servidores de la Oficina de TI","SI","Ley 1712 Articulo 18 literal c. Los secretos comerciales, industriales y profesionales asi como los estipulados en el paragrafo del articulo 77 de la ley 1474 de 2011","Ley 1712 2014","Reserva parcial","2017-06-30","15 Años","N/A","N/A"]
["120-112","SOFTWARE","OFICINA DE TECNOLOGIAS DE LA INFORMACIÓN","Aplicativo - SIUST","Sistema de información único del sector de las comunicaciones","OFICINA DE TECNOLOGIAS DE LA INFORMACIÓN","2018-11-28","OFICINA DE TECNOLOGIAS DE LA INFORMACIÓN","2019-01-02","ESTRATEGICO","ARQUITECTURA_INSTITUCIONAL","GESTION DE TECNOLOGIAS DE LA INFORMACION ","N/A","N/A","Digital","Sistemas de Información corporativos","Base de datos","Español","INFORMACIÓN PÚBLICA RESERVADA","Servidores de la Oficina de TI","SI","Ley 1712 Articulo 18 literal c. Los secretos comerciales, industriales y profesionales asi como los estipulados en el paragrafo del articulo 77 de la ley 1474 de 2011","Ley 1712 2014","Reserva parcial","2017-06-30","15 Años","N/A","N/A"]
["120-113","SOFTWARE","OFICINA DE TECNOLOGIAS DE LA INFORMACIÓN","Aplicativo - SIGEST","Sistema Integral de gestión del sector","OFICINA DE TECNOLOGIAS DE LA INFORMACIÓN","2018-11-28","OFICINA DE TECNOLOGIAS DE LA INFORMACIÓN","2019-01-02","ESTRATEGICO","ARQUITECTURA_INSTITUCIONAL","GESTION DE TECNOLOGIAS DE LA INFORMACION ","N/A","N/A","Digital","Sistemas de Información corporativos","Base de datos","Español","INFORMACIÓN PÚBLICA RESERVADA","Servidores de la Oficina de TI","SI","Ley 1712 Articulo 18 literal c. Los secretos comerciales, industriales y profesionales asi como los estipulados en el paragrafo del articulo 77 de la ley 1474 de 2011","Ley 1712 2014","Reserva parcial","2017-06-30","15 Años","N/A","N/A"]
["120-114","SOFTWARE","OFICINA DE TECNOLOGIAS DE LA INFORMACIÓN","Aplicativo - SIMONTIC","SimonTIC - Sistema de Monitoreo de las tecnologías de la información y las comunicaciones.\n","OFICINA DE TECNOLOGIAS DE LA INFORMACIÓN","2018-11-28","OFICINA DE TECNOLOGIAS DE LA INFORMACIÓN","2019-01-02","ESTRATEGICO","ARQUITECTURA_INSTITUCIONAL","GESTION DE TECNOLOGIAS DE LA INFORMACION ","N/A","N/A","Digital","Sistemas de Información corporativos","Base de datos","Español","INFORMACIÓN PÚBLICA RESERVADA","Servidores de la Oficina de TI","SI","Ley 1712 Articulo 18 literal c. Los secretos comerciales, industriales y profesionales asi como los estipulados en el paragrafo del articulo 77 de la ley 1474 de 2011","Ley 1712 2014","Reserva parcial","2017-06-30","15 Años","N/A","N/A"]
["120-115","SOFTWARE","OFICINA DE TECNOLOGIAS DE LA INFORMACIÓN","Aplicativo - ASPA","\nAplicativo de seguimiento a plan de acción","OFICINA DE TECNOLOGIAS DE LA INFORMACIÓN","2018-11-28","OFICINA DE TECNOLOGIAS DE LA INFORMACIÓN","2019-01-02","ESTRATEGICO","ARQUITECTURA_INSTITUCIONAL","GESTION DE TECNOLOGIAS DE LA INFORMACION ","N/A","N/A","Digital","Sistemas de Información corporativos","Base de datos","Español","INFORMACIÓN PÚBLICA RESERVADA","Servidores de la Oficina de TI","SI","Ley 1712 Articulo 18 literal c. Los secretos comerciales, industriales y profesionales asi como los estipulados en el paragrafo del articulo 77 de la ley 1474 de 2011","Ley 1712 2014","Reserva parcial","2017-06-30","15 Años","N/A","N/A"]
["120-116","SOFTWARE","OFICINA DE TECNOLOGIAS DE LA INFORMACIÓN","Aplicativo - Comisiones y viaticos","Comisiones en Linea","OFICINA DE TECNOLOGIAS DE LA INFORMACIÓN","2018-11-28","OFICINA DE TECNOLOGIAS DE LA INFORMACIÓN","2019-01-02","ESTRATEGICO","ARQUITECTURA_INSTITUCIONAL","GESTION DE TECNOLOGIAS DE LA INFORMACION ","N/A","N/A","Digital","Sistemas de Información corporativos","Base de datos","Español","INFORMACIÓN PÚBLICA RESERVADA","Servidores de la Oficina de TI","SI","Ley 1712 Articulo 18 literal c. Los secretos comerciales, industriales y profesionales asi como los estipulados en el paragrafo del articulo 77 de la ley 1474 de 2011","Ley 1712 2014","Reserva parcial","2017-06-30","15 Años","N/A","N/A"]
["120-117","SOFTWARE","OFICINA DE TECNOLOGIAS DE LA INFORMACIÓN","BI","Aplicativo de gestion de los proyectos de Vive Digital para la gente","OFICINA DE TECNOLOGIAS DE LA INFORMACIÓN","2018-11-28","OFICINA DE TECNOLOGIAS DE LA INFORMACIÓN","2019-01-02","ESTRATEGICO","ARQUITECTURA_INSTITUCIONAL","GESTION DE TECNOLOGIAS DE LA INFORMACION ","N/A","N/A","Digital","Sistemas de Información corporativos","Base de datos","Español","INFORMACIÓN PÚBLICA RESERVADA","Servidores de la Oficina de TI","SI","Ley 1712 Articulo 18 literal c. Los secretos comerciales, industriales y profesionales asi como los estipulados en el paragrafo del articulo 77 de la ley 1474 de 2011","Ley 1712 2014","Reserva parcial","2017-06-30","15 Años","N/A","N/A"]
["120-118","SOFTWARE","OFICINA DE TECNOLOGIAS DE LA INFORMACIÓN","Aplicativo - Kronos","Aplicativo que  permite la administración y liquidación de las Cuotas Partes Pensionales por cobrar, por pagar y generación de cuentas de cobro.","OFICINA DE TECNOLOGIAS DE LA INFORMACIÓN","2018-11-28","OFICINA DE TECNOLOGIAS DE LA INFORMACIÓN","2019-01-02","ESTRATEGICO","ARQUITECTURA_INSTITUCIONAL","GESTION DE TECNOLOGIAS DE LA INFORMACION ","N/A","N/A","Digital","Sistemas de Información corporativos","Base de datos","Español","INFORMACIÓN PÚBLICA RESERVADA","Servidores de la Oficina de TI","SI","Ley 1712 Articulo 18 literal c. Los secretos comerciales, industriales y profesionales asi como los estipulados en el paragrafo del articulo 77 de la ley 1474 de 2011","Ley 1712 2014","Reserva parcial","2017-06-30","15 Años","N/A","N/A"]
["120-119","SOFTWARE","OFICINA DE TECNOLOGIAS DE LA INFORMACIÓN","Herramienta de gestión de portafolio de proyectos - PPM","Herramienta donde se realiza gestión del portafolio de proyectos del Ministerio","OFICINA DE TECNOLOGIAS DE LA INFORMACIÓN","2018-11-28","OFICINA DE TECNOLOGIAS DE LA INFORMACIÓN","2019-01-02","ESTRATEGICO","ARQUITECTURA_INSTITUCIONAL","GESTION DE TECNOLOGIAS DE LA INFORMACION ","N/A","N/A","Digital","Sistemas de Información corporativos","Base de datos","Español","INFORMACIÓN PÚBLICA RESERVADA","Servidores de la Oficina de TI","SI","Ley 1712 Articulo 18 literal c. Los secretos comerciales, industriales y profesionales asi como los estipulados en el paragrafo del articulo 77 de la ley 1474 de 2011","Ley 1712 2014","Reserva parcial","2017-06-30","15 Años","N/A","N/A"]
["120-120","SOFTWARE","OFICINA DE TECNOLOGIAS DE LA INFORMACIÓN","Aplicativo - SIAT RDS","Aplicativo que  permite la administración alertas tempranas para coordinacion de radio de la subdireccion de vigilancia y control.","OFICINA DE TECNOLOGIAS DE LA INFORMACIÓN","2018-11-28","OFICINA DE TECNOLOGIAS DE LA INFORMACIÓN","2019-01-02","ESTRATEGICO","ARQUITECTURA_INSTITUCIONAL","GESTION DE TECNOLOGIAS DE LA INFORMACION ","N/A","N/A","Digital","Sistemas de Información corporativos","Base de datos","Español","INFORMACIÓN PÚBLICA RESERVADA","Servidores de la Oficina de TI","SI","Ley 1712 Articulo 18 literal c. Los secretos comerciales, industriales y profesionales asi como los estipulados en el paragrafo del articulo 77 de la ley 1474 de 2011","Ley 1712 2014","Reserva parcial","2017-12-31","15 Años","N/A","N/A"]
["120-121","INFORMACIÓN","OFICINA DE TECNOLOGIAS DE LA INFORMACIÓN","Estrategia de inteligencia de negocios BI","Herramienta que publica indicadores de la oferta TIC (Proyectos de inversión del Ministerio)","OFICINA DE TECNOLOGIAS DE LA INFORMACIÓN","2018-11-28","OFICINA DE TECNOLOGIAS DE LA INFORMACIÓN","2019-01-02","ESTRATEGICO","ARQUITECTURA_INSTITUCIONAL","GESTION DE TECNOLOGIAS DE LA INFORMACION ","N/A","N/A","Digital","Sistemas de Información corporativos","Base de datos","Español","INFORMACIÓN PÚBLICA","Servidores de la Oficina de TI","N/A","N/A","N/A","N/A","N/A","N/A","N/A","N/A"]
["120-122","INFORMACIÓN","OFICINA DE TECNOLOGIAS DE LA INFORMACIÓN","Plan de Comunicaciones","Plan de Comunicaciones de la Oficina de TI","OFICINA DE TECNOLOGIAS DE LA INFORMACIÓN","2018-11-28","OFICINA DE TECNOLOGIAS DE LA INFORMACIÓN","2019-01-02","ESTRATEGICO","ARQUITECTURA_INSTITUCIONAL","GESTION DE TECNOLOGIAS DE LA INFORMACION ","N/A","N/A","Digital","Documentos de Archivo - electrónicos","XLS -PDF","Español","INFORMACIÓN PÚBLICA","https://mintic.sharepoint.com/oficinaTI/grupo_uso_y_apropiacion/_layouts/15/guestaccess.aspx?guestaccesstoken=3MMCfIpv5yyrswf2PD02U4WkBienNirtjlO0ERs9r4o%3d&docid=18fa8b54cdf444b2ebc312f645c5ad703&rev=1&expiration=2019-01-10T14%3a11%3a01.000Z","N/A","N/A","N/A","N/A","N/A","N/A","N/A","N/A"]
["120-123","INFORMACIÓN","OFICINA DE TECNOLOGIAS DE LA INFORMACIÓN","Plan de gestión de la capacidad","Documento con el plan de gestión de la capacidad  de los equipos de computo de MINTIC. El documento contiene los siguientes datos: equipos, monitorización del rendimiento y la carga del servidor o conjunto de servidores, análisis del rendimiento y medición de datos, incluyendo análisis del impacto de nuevas instalaciones en la capacidad, ajustes de rendimiento para asegurar el uso más eficiente de la infraestructura, comprensión de las demandas del servicio y planes futuros de aumento o disminución de carga. Influencia en la petición de recursos informáticos","OFICINA DE TECNOLOGIAS DE LA INFORMACIÓN","2018-11-28","OFICINA DE TECNOLOGIAS DE LA INFORMACIÓN","2019-01-02","ESTRATEGICO","ARQUITECTURA_INSTITUCIONAL","GESTION DE TECNOLOGIAS DE LA INFORMACION ","N/A","N/A","Digital","Documentos de Archivo - electrónicos","PDF","Español","INFORMACIÓN PÚBLICA RESERVADA","Consulta interna Oficina de TI","SI","Artículo 18 de la ley 1712 del 2014","Artículo 18 de la ley 1712 del 2014","Reserva total","2017-07-14","15 Años","N/A","N/A"]
["120-124","INFORMACIÓN","OFICINA DE TECNOLOGIAS DE LA INFORMACIÓN","CMDB\n (Formato de administración de versiones y configuraciones)","Base de datos con la información de las configuraciónes de los difertes elementos tecnológicos y su interrelación. Contiene información como:  Tipo de servidor, recursos de hardware y software, y parametrización ","OFICINA DE TECNOLOGIAS DE LA INFORMACIÓN","2018-11-28","OFICINA DE TECNOLOGIAS DE LA INFORMACIÓN","2019-01-02","ESTRATEGICO","ARQUITECTURA_INSTITUCIONAL","GESTION DE TECNOLOGIAS DE LA INFORMACION ","N/A","N/A","Digital","Documentos de Archivo - electrónicos","XLS","Español","INFORMACIÓN PÚBLICA RESERVADA","Consulta interna Oficina de TI","SI","Artículo 18 de la ley 1712 del 2014","Artículo 18 de la ley 1712 del 2014","Reserva total","2017-07-14","15 Años","N/A","N/A"]
["120-125","INFORMACIÓN","OFICINA DE TECNOLOGIAS DE LA INFORMACIÓN","Plan de gestión de contigencia de TI","Documento con el plan de gestión de contigencia de TI  de los equipos de cómputo y soluciones de MINTIC. El documento contiene los siguientes datos: equipos o soluciones, componentes, procedimiento de puesta al aire, análisis de impacto, planificación de despliegue.","OFICINA DE TECNOLOGIAS DE LA INFORMACIÓN","2018-11-28","OFICINA DE TECNOLOGIAS DE LA INFORMACIÓN","2019-01-02","ESTRATEGICO","ARQUITECTURA_INSTITUCIONAL","GESTION DE TECNOLOGIAS DE LA INFORMACION ","N/A","N/A","Digital","Archivos Institucionales - electrónico","PDF","Español","INFORMACIÓN PÚBLICA RESERVADA","Consulta interna Oficina de TI","SI","Artículo 18 de la ley 1712 del 2014","Artículo 18 de la ley 1712 del 2014","Reserva total","2017-07-14","15 años","N/A","N/A"]
["120-126","INFORMACIÓN","OFICINA DE TECNOLOGIAS DE LA INFORMACIÓN","Listado de servidores","Documento de registro de inventario de servidores. El documento contiene los siguientes campos: ID del servidor, ubicación , tipo de servidor, placa MINTIC,  fecha de inicio de registro y  fecha de traslado ","OFICINA DE TECNOLOGIAS DE LA INFORMACIÓN","2018-11-28","OFICINA DE TECNOLOGIAS DE LA INFORMACIÓN","2019-01-02","ESTRATEGICO","ARQUITECTURA_INSTITUCIONAL","GESTION DE TECNOLOGIAS DE LA INFORMACION ","N/A","N/A","Digital","Archivos Institucionales - electrónico","XLS","Español","INFORMACIÓN PÚBLICA RESERVADA","Sharepoint Oficina de TI","SI","Artículo 18 de la ley 1712 del 2014","Artículo 18 de la ley 1712 del 2014","Reserva total","2017-07-14","15 años","N/A","N/A"]
["120-127","INFORMACIÓN","OFICINA DE TECNOLOGIAS DE LA INFORMACIÓN","Listado de equipos de comunicaciones","Documento de registro de inventario de los equipos de comunicaciones. El documento contiene los siguientes campos: ID del equipo, ubicación fisica, placa MINTIC,  fecha de inicio de registro  y fecha de traslado ","OFICINA DE TECNOLOGIAS DE LA INFORMACIÓN","2018-11-28","OFICINA DE TECNOLOGIAS DE LA INFORMACIÓN","2019-01-02","ESTRATEGICO","ARQUITECTURA_INSTITUCIONAL","GESTION DE TECNOLOGIAS DE LA INFORMACION ","N/A","N/A","Digital","Archivos Institucionales - electrónico","XLS","Español","INFORMACIÓN PÚBLICA RESERVADA","Sharepoint Oficina de TI","SI","Artículo 18 de la ley 1712 del 2014","Artículo 18 de la ley 1712 del 2014","Reserva total","2017-07-14","15 años","N/A","N/A"]
["120-128","INFORMACIÓN","OFICINA DE TECNOLOGIAS DE LA INFORMACIÓN","Hoja de vida de los equipos","Documento de hoja de vida de los equipos tecnológicos usados o adquiridos por MINTIC. El documento contiene el detalle del hardware (marca, modelo, serie, capacidad de procesamiento, almacenamiento y fecha de cambio, también detalle del proveedor con el que se adquirió el hardware y/o software, así como todos los eventos y acciones que se han realizado sobre el mismo)","OFICINA DE TECNOLOGIAS DE LA INFORMACIÓN","2018-11-28","OFICINA DE TECNOLOGIAS DE LA INFORMACIÓN","2019-01-02","ESTRATEGICO","ARQUITECTURA_INSTITUCIONAL","GESTION DE TECNOLOGIAS DE LA INFORMACION ","N/A","N/A","Digital","Archivos Institucionales - electrónico","XLS -PDF","Español","INFORMACIÓN PÚBLICA RESERVADA","Servidores de la Oficina de TI","SI","Artículo 18 de la ley 1712 del 2014","Artículo 18 de la ley 1712 del 2014","Reserva total","2017-07-14","15 años","N/A","N/A"]
["120-129","INFORMACIÓN","OFICINA DE TECNOLOGIAS DE LA INFORMACIÓN","Plan de mantenimiento","Documento con el plan de mantenimiento de los equipos de computo de MINTIC. El documento contiene los siguientes datos: equipos, contratista, nombre del contacto, teléfonos, objeto del contrato, fecha de mantenimiento programado y ejecutado y responsable visita",{"$f":"IF(C136=\"\",\"\",C136)","v":"OFICINA DE TECNOLOGIAS DE LA INFORMACIÓN"},"2018-11-28","OFICINA DE TECNOLOGIAS DE LA INFORMACIÓN","2019-01-02","ESTRATEGICO","ARQUITECTURA_INSTITUCIONAL","GESTION DE TECNOLOGIAS DE LA INFORMACION ","N/A","N/A","Digital","Archivos Institucionales - electrónico","XLS -PDF","Español","INFORMACIÓN PÚBLICA RESERVADA","Servidores de la Oficina de TI","SI","Artículo 18 de la ley 1712 del 2014","Artículo 18 de la ley 1712 del 2014","Reserva total","2017-07-14","15 años","N/A","N/A"]
["120-130","INFORMACIÓN","OFICINA DE TECNOLOGIAS DE LA INFORMACIÓN","Registro y control de software operativo","Documento de registro y control del software operativo y licenciamiento de las aplicaciones del entorno computacional de MINTIC. El documento contiene los siguientes datos: identificación y nombre del producto, descripción del software, versión, cantidad, tipo de licencia, fecha compra, no. factura, fecha vencimiento, usuario registro, clave registro y observaciones","OFICINA DE TECNOLOGIAS DE LA INFORMACIÓN","2018-11-28","OFICINA DE TECNOLOGIAS DE LA INFORMACIÓN","2019-01-02","ESTRATEGICO","ARQUITECTURA_INSTITUCIONAL","GESTION DE TECNOLOGIAS DE LA INFORMACION ","N/A","N/A","Digital","Archivos Institucionales - electrónico","XLS","Español","INFORMACIÓN PÚBLICA RESERVADA","Sharepoint Oficina de TI","SI","Artículo 18 de la ley 1712 del 2014","Artículo 18 de la ley 1712 del 2014","Reserva total","2017-07-14","15 años","N/A","N/A"]
["120-131","INFORMACIÓN","OFICINA DE TECNOLOGIAS DE LA INFORMACIÓN","Bitacora de plataforma tecnológica","Bitácora de los eventos evidenciados en la plataforma tecnológica. El documento contiene los siguientes datos: fecha del evento, servidor/aplicación, tema, hora del evento, solución, quien reporta, tiempo fuera de servicio y no. de usuarios afectados","OFICINA DE TECNOLOGIAS DE LA INFORMACIÓN","2018-11-28","OFICINA DE TECNOLOGIAS DE LA INFORMACIÓN","2019-01-02","ESTRATEGICO","ARQUITECTURA_INSTITUCIONAL","GESTION DE TECNOLOGIAS DE LA INFORMACION ","N/A","N/A","Digital","Sistemas de Bases de Datos","Base de datos","Español","INFORMACIÓN PÚBLICA RESERVADA","Oficina de TI","SI","Artículo 18 de la ley 1712 del 2014","Artículo 18 de la ley 1712 del 2014","Reserva total","2017-07-14","15 años","N/A","N/A"]
["120-132","INFORMACIÓN","OFICINA DE TECNOLOGIAS DE LA INFORMACIÓN","Plan de respaldo","Documento con el plan de respaldos. El documento contiene los siguientes datos: nombre del servidor, servicio o contenido, rotulo MINTIC, fecha backup, fecha envió, fecha regresa, ID MINTIC, rotulo custodio y descripción contenido en cinta","OFICINA DE TECNOLOGIAS DE LA INFORMACIÓN","2018-11-28","OFICINA DE TECNOLOGIAS DE LA INFORMACIÓN","2019-01-02","ESTRATEGICO","ARQUITECTURA_INSTITUCIONAL","GESTION DE TECNOLOGIAS DE LA INFORMACION ","N/A","N/A","Físico","Archivos Institucionales - físicos","Papel","Español","INFORMACIÓN PÚBLICA","Oficina de TI","N/A","N/A","N/A","N/A","N/A","N/A","N/A","N/A"]
["120-133","INFORMACIÓN","OFICINA DE TECNOLOGIAS DE LA INFORMACIÓN","Registro de inventario de medios","Documento de registro de inventario de medios. El documento contiene los siguientes campos: numero de cinta, ubicación , rotulo MINTIC, rotulo custodio, fecha de inicio de registro, de backup, contenido del medio, ubicación proviene y fecha de traslado ","OFICINA DE TECNOLOGIAS DE LA INFORMACIÓN","2018-11-28","OFICINA DE TECNOLOGIAS DE LA INFORMACIÓN","2019-01-02","ESTRATEGICO","ARQUITECTURA_INSTITUCIONAL","GESTION DE TECNOLOGIAS DE LA INFORMACION ","N/A","N/A","Digital","Sistemas de Bases de Datos","Base de datos","Español","INFORMACIÓN PÚBLICA RESERVADA","Servidores de la Oficina de TI","SI","Artículo 18 de la ley 1712 del 2014","Artículo 18 de la ley 1712 del 2014","Reserva total","2017-07-14","15 años","N/A","N/A"]
["120-134","INFORMACIÓN","OFICINA DE TECNOLOGIAS DE LA INFORMACIÓN","Gestión de cuentas de usuario y claves de acceso","Documento de gestión de las cuentas de usuario, perfiles y claves de acceso de los sistemas de información de la entidad","OFICINA DE TECNOLOGIAS DE LA INFORMACIÓN","2018-11-28","OFICINA DE TECNOLOGIAS DE LA INFORMACIÓN","2019-01-02","ESTRATEGICO","ARQUITECTURA_INSTITUCIONAL","GESTION DE TECNOLOGIAS DE LA INFORMACION ","N/A","N/A","Físico","Documentos de Archivo - físicos","Papel","Español","INFORMACIÓN PÚBLICA RESERVADA","Oficina de TI","SI","Artículo 18 de la ley 1712 del 2014","Artículo 18 de la ley 1712 del 2014","Reserva total","2017-07-14","15 años","N/A","N/A"]
["120-135","INFORMACIÓN","OFICINA DE TECNOLOGIAS DE LA INFORMACIÓN","Actas de entrega de hardware y software","Base de datos con el acta que el  usuario que recibe a conformidad hardware y software. El documento contiene la siguiente información: nombre de quien hace a entrega y quien la recibe, fecha de entrega, extensión y ubicación, información de la CPU, del monitor, hardware interno y software instalado","OFICINA DE TECNOLOGIAS DE LA INFORMACIÓN","2018-11-28","OFICINA DE TECNOLOGIAS DE LA INFORMACIÓN","2019-01-02","ESTRATEGICO","ARQUITECTURA_INSTITUCIONAL","GESTION DE TECNOLOGIAS DE LA INFORMACION ","N/A","N/A","Digital","Archivos Institucionales - electrónico","XLS","Español","INFORMACIÓN PÚBLICA RESERVADA","Consulta interna Oficina de TI","SI","Artículo 18 de la ley 1712 del 2014","Artículo 18 de la ley 1712 del 2014","Reserva total","2017-07-14","15 años","N/A","N/A"]
["120-136","INFORMACIÓN","OFICINA DE TECNOLOGIAS DE LA INFORMACIÓN","Directorio de sistemas de información","Documento de registro de sistemas de informacion. El documento contiene la descripcion de los sistemas de informacion ademas del detalle de los servidores de lo soportan ","OFICINA DE TECNOLOGIAS DE LA INFORMACIÓN","2018-11-28","OFICINA DE TECNOLOGIAS DE LA INFORMACIÓN","2019-01-02","ESTRATEGICO","ARQUITECTURA_INSTITUCIONAL","GESTION DE TECNOLOGIAS DE LA INFORMACION ","N/A","N/A","Digital","Archivos Institucionales - electrónico","XLS","Español","INFORMACIÓN PÚBLICA RESERVADA","Sharepoint Oficina de TI","SI","Artículo 18 de la ley 1712 del 2014","Artículo 18 de la ley 1712 del 2014","Reserva total","2017-12-31","15 años","N/A","N/A"]
["120-137","INFORMACIÓN","OFICINA DE TECNOLOGIAS DE LA INFORMACIÓN","Kioscos Vive Digital","Los Kioscos vive digital son puntos de acceso comunitario a Internet para los niños, jóvenes y adultos en zonas rurales de más de 100 habitantes, ubicados en las zonas más alejadas de Colombia, donde pueden conectarse a internet y recibir capacitaciones gratuitas en uso y apropiación de las TIC","OFICINA DE TECNOLOGIAS DE LA INFORMACIÓN","2018-11-28","OFICINA DE TECNOLOGIAS DE LA INFORMACIÓN","2019-01-02","ESTRATEGICO","ARQUITECTURA_INSTITUCIONAL","GESTION DE TECNOLOGIAS DE LA INFORMACION ","Ley 1712 de 2014, Artículo 6. literal J","Externo","Digital","Archivos Institucionales - electrónico","XLS","Español","INFORMACIÓN PÚBLICA","http://colombiatic.mintic.gov.co/","N/A","N/A","N/A","N/A","N/A","N/A","N/A","N/A"]
["120-138","INFORMACIÓN","OFICINA DE TECNOLOGIAS DE LA INFORMACIÓN","Puntos Vive Digital","Es un espacio que garantiza el acceso a las Tecnologías de la Información y las Comunicaciones mediante un modelo de servicios sostenible que permite integrar a la comunidad en escenarios de acceso, capacitación, entretenimiento y otras alternativas de servicios TIC en un mismo lugar.","OFICINA DE TECNOLOGIAS DE LA INFORMACIÓN","2018-11-28","OFICINA DE TECNOLOGIAS DE LA INFORMACIÓN","2019-01-02","ESTRATEGICO","ARQUITECTURA_INSTITUCIONAL","GESTION DE TECNOLOGIAS DE LA INFORMACION ","Ley 1712 de 2014, Artículo 6. literal J","Externo","Digital","Portales, Intranet y Extranet","XLS","Español","INFORMACIÓN PÚBLICA","http://colombiatic.mintic.gov.co/","N/A","N/A","N/A","N/A","N/A","N/A","N/A","N/A"]
["120-139","INFORMACIÓN","OFICINA DE TECNOLOGIAS DE LA INFORMACIÓN","Proyecto Nacional de fibra óptica","El Proyecto Nacional de Fibra Óptica busca promover la ampliación de la infraestructura de fibra óptica existente en el país, para así llevar Internet a un mayor número de colombianos con mejores servicios, condiciones técnicas y económicas.","OFICINA DE TECNOLOGIAS DE LA INFORMACIÓN","2018-11-28","OFICINA DE TECNOLOGIAS DE LA INFORMACIÓN","2019-01-02","ESTRATEGICO","ARQUITECTURA_INSTITUCIONAL","GESTION DE TECNOLOGIAS DE LA INFORMACION ","Ley 1712 de 2014, Artículo 6. literal J","Externo","Digital","Portales, Intranet y Extranet","XLS","Español","INFORMACIÓN PÚBLICA","http://colombiatic.mintic.gov.co/","N/A","N/A","N/A","N/A","N/A","N/A","N/A","N/A"]
["120-140","INFORMACIÓN","OFICINA DE TECNOLOGIAS DE LA INFORMACIÓN","Zonas Wi-Fi","En este documento se encuentra la ubicacion con coordenadas geograficas (formato decimal) de las zonas wifi gratis inaguradas y proximas a inagurar en cada municipio y departamento del pais, que el Ministerio TIC a desplegado a traves de la Direccion de Promocion TIC (Proyecto Zonas Wifi Gratis para la gente) y la Direccion de Infraestructura (Proyecto de Conectividad de Alta Velocidad).","OFICINA DE TECNOLOGIAS DE LA INFORMACIÓN","2018-11-28","OFICINA DE TECNOLOGIAS DE LA INFORMACIÓN","2019-01-02","ESTRATEGICO","ARQUITECTURA_INSTITUCIONAL","GESTION DE TECNOLOGIAS DE LA INFORMACION ","Ley 1712 de 2014, Artículo 6. literal J","Externo","Digital","Portales, Intranet y Extranet","XLS","Español","INFORMACIÓN PÚBLICA","http://colombiatic.mintic.gov.co/","N/A","N/A","N/A","N/A","N/A","N/A","N/A","N/A"]
["120-141","INFORMACIÓN","OFICINA DE TECNOLOGIAS DE LA INFORMACIÓN","Conectividad de Alta Velocidad","El proyecto de Conectividad de Alta Velocidad-PNCAV busca conectar 28 cabeceras municipales y 19 corregimientos departamentales a través del despliegue de redes de alta velocidad, satelitales y/o terrestres, beneficiando aproximadamente 441.000 personas ubicadas en la selva colombiana.","OFICINA DE TECNOLOGIAS DE LA INFORMACIÓN","2018-11-28","OFICINA DE TECNOLOGIAS DE LA INFORMACIÓN","2019-01-02","ESTRATEGICO","ARQUITECTURA_INSTITUCIONAL","GESTION DE TECNOLOGIAS DE LA INFORMACION ","Ley 1712 de 2014, Artículo 6. literal J","Externo","Digital","Portales, Intranet y Extranet","XLS","Español","INFORMACIÓN PÚBLICA","http://colombiatic.mintic.gov.co/","N/A","N/A","N/A","N/A","N/A","N/A","N/A","N/A"]
["120-142","INFORMACIÓN","OFICINA DE TECNOLOGIAS DE LA INFORMACIÓN","Hogares conectados I","Proyecto que lleva Internet a las familias de estratos 1 y 2, y Viviendas de Interés Prioritario -VIP, con el objetivo de que usen y se apropien de la tecnología.","OFICINA DE TECNOLOGIAS DE LA INFORMACIÓN","2018-11-28","OFICINA DE TECNOLOGIAS DE LA INFORMACIÓN","2019-01-02","ESTRATEGICO","ARQUITECTURA_INSTITUCIONAL","GESTION DE TECNOLOGIAS DE LA INFORMACION ","Ley 1712 de 2014, Artículo 6. literal J","Externo","Digital","Portales, Intranet y Extranet","XLS","Español","INFORMACIÓN PÚBLICA","http://colombiatic.mintic.gov.co/","N/A","N/A","N/A","N/A","N/A","N/A","N/A","N/A"]
["120-143","INFORMACIÓN","OFICINA DE TECNOLOGIAS DE LA INFORMACIÓN","Hogares conectados II","Proyecto que lleva Internet a las familias de estratos 1 y 2, y Viviendas de Interés Prioritario -VIP, con el objetivo de que usen y se apropien de la tecnología.","OFICINA DE TECNOLOGIAS DE LA INFORMACIÓN","2018-11-28","OFICINA DE TECNOLOGIAS DE LA INFORMACIÓN","2019-01-02","ESTRATEGICO","ARQUITECTURA_INSTITUCIONAL","GESTION DE TECNOLOGIAS DE LA INFORMACION ","Ley 1712 de 2014, Artículo 6. literal J","Externo","Digital","Portales, Intranet y Extranet","XLS","Español","INFORMACIÓN PÚBLICA","http://colombiatic.mintic.gov.co/","N/A","N/A","N/A","N/A","N/A","N/A","N/A","N/A"]
["120-144","INFORMACIÓN","OFICINA DE TECNOLOGIAS DE LA INFORMACIÓN","Computadores Para Educar","Computadores para Educar-CPE es el programa del Gobierno Nacional de mayor impacto social que genera equidad a través de las TIC, fomentando la calidad de la educación bajo un modelo sostenible","OFICINA DE TECNOLOGIAS DE LA INFORMACIÓN","2018-11-28","OFICINA DE TECNOLOGIAS DE LA INFORMACIÓN","2019-01-02","ESTRATEGICO","ARQUITECTURA_INSTITUCIONAL","GESTION DE TECNOLOGIAS DE LA INFORMACION ","Ley 1712 de 2014, Artículo 6. literal J","Externo","Digital","Portales, Intranet y Extranet","XLS","Español","INFORMACIÓN PÚBLICA","http://colombiatic.mintic.gov.co/","N/A","N/A","N/A","N/A","N/A","N/A","N/A","N/A"]
["120-145","INFORMACIÓN","OFICINA DE TECNOLOGIAS DE LA INFORMACIÓN","Ciudadanía Digital","Entendemos la Ciudadanía Digital como el resultado de la transformación digital y productiva de los ciudadanos. Ante el reto de la economía digital, tenemos como país la meta de impulsar esa transformación en los próximos años.","OFICINA DE TECNOLOGIAS DE LA INFORMACIÓN","2018-11-28","OFICINA DE TECNOLOGIAS DE LA INFORMACIÓN","2019-01-02","ESTRATEGICO","ARQUITECTURA_INSTITUCIONAL","GESTION DE TECNOLOGIAS DE LA INFORMACION ","Ley 1712 de 2014, Artículo 6. literal J","Externo","Digital","Portales, Intranet y Extranet","XLS","Español","INFORMACIÓN PÚBLICA","http://colombiatic.mintic.gov.co/","N/A","N/A","N/A","N/A","N/A","N/A","N/A","N/A"]
["120-146","INFORMACIÓN","OFICINA DE TECNOLOGIAS DE LA INFORMACIÓN","En TIC Confío","En TIC confío es la estrategia de promoción de uso responsable de internet y las TIC que ayuda a la sociedad a desenvolverse e interactuar responsablemente con las TIC, al tiempo que promueve la cero tolerancia con la pornografía infantil y la convivencia digital.","OFICINA DE TECNOLOGIAS DE LA INFORMACIÓN","2018-11-28","OFICINA DE TECNOLOGIAS DE LA INFORMACIÓN","2019-01-02","ESTRATEGICO","ARQUITECTURA_INSTITUCIONAL","GESTION DE TECNOLOGIAS DE LA INFORMACION ","Ley 1712 de 2014, Artículo 6. literal J","Externo","Digital","Portales, Intranet y Extranet","XLS","Español","INFORMACIÓN PÚBLICA","http://colombiatic.mintic.gov.co/","N/A","N/A","N/A","N/A","N/A","N/A","N/A","N/A"]
["120-147","INFORMACIÓN","OFICINA DE TECNOLOGIAS DE LA INFORMACIÓN","RedVolución","Es un programa del Ministerio de Tecnologías de la Información y las Comunicaciones – MINTIC – que, busca inspirar el uso de internet en los colombianos, con el fin de reducir la brecha digital brindando a la sociedad herramientas y conocimientos que le permitan mejorar su calidad de vida y generar un mejor desarrollo social y económico.","OFICINA DE TECNOLOGIAS DE LA INFORMACIÓN","2018-11-28","OFICINA DE TECNOLOGIAS DE LA INFORMACIÓN","2019-01-02","ESTRATEGICO","ARQUITECTURA_INSTITUCIONAL","GESTION DE TECNOLOGIAS DE LA INFORMACION ","Ley 1712 de 2014, Artículo 6. literal J","Externo","Digital","Portales, Intranet y Extranet","XLS","Español","INFORMACIÓN PÚBLICA","http://colombiatic.mintic.gov.co/","N/A","N/A","N/A","N/A","N/A","N/A","N/A","N/A"]
["120-148","INFORMACIÓN","OFICINA DE TECNOLOGIAS DE LA INFORMACIÓN","Talento TI","La iniciativa Talento TI del MinTIC es una de las apuestas del Plan Vive Digital para la Gente, que busca promover la formación de los colombianos en carreras TI para impulsar la competitividad, la investigación, la innovación y la proyección internacional del sector TI del país.","OFICINA DE TECNOLOGIAS DE LA INFORMACIÓN","2018-11-28","OFICINA DE TECNOLOGIAS DE LA INFORMACIÓN","2019-01-02","ESTRATEGICO","ARQUITECTURA_INSTITUCIONAL","GESTION DE TECNOLOGIAS DE LA INFORMACION ","Ley 1712 de 2014, Artículo 6. literal J","Externo","Digital","Portales, Intranet y Extranet","XLS","Español","INFORMACIÓN PÚBLICA","http://colombiatic.mintic.gov.co/","N/A","N/A","N/A","N/A","N/A","N/A","N/A","N/A"]
["120-149","INFORMACIÓN","OFICINA DE TECNOLOGIAS DE LA INFORMACIÓN","ViveLabs","Espacios donde se facilitan herramientas tecnológicas y se brindan capacitaciones para realizar actividades de emprendimiento digital enfocados en aplicaciones y contenidos digitales. Buscan continuar con la estrategia nacional para el fortalecimiento y promoción de contenidos digitales.","OFICINA DE TECNOLOGIAS DE LA INFORMACIÓN","2018-11-28","OFICINA DE TECNOLOGIAS DE LA INFORMACIÓN","2019-01-02","ESTRATEGICO","ARQUITECTURA_INSTITUCIONAL","GESTION DE TECNOLOGIAS DE LA INFORMACION ","Ley 1712 de 2014, Artículo 6. literal J","Externo","Digital","Portales, Intranet y Extranet","XLS","Español","INFORMACIÓN PÚBLICA","http://colombiatic.mintic.gov.co/","N/A","N/A","N/A","N/A","N/A","N/A","N/A","N/A"]
["120-150","INFORMACIÓN","OFICINA DE TECNOLOGIAS DE LA INFORMACIÓN","Beneficiarios Apps.co","Una iniciativa diseñada desde MinTIC para promover y potenciar la creación de negocios a partir del uso de las TIC, poniendo especial interés en el desarrollo de aplicaciones móviles, software y otros contenidos digitales.","OFICINA DE TECNOLOGIAS DE LA INFORMACIÓN","2018-11-28","OFICINA DE TECNOLOGIAS DE LA INFORMACIÓN","2019-01-02","ESTRATEGICO","ARQUITECTURA_INSTITUCIONAL","GESTION DE TECNOLOGIAS DE LA INFORMACION ","Ley 1712 de 2014, Artículo 6. literal J","Externo","Digital","Portales, Intranet y Extranet","XLS","Español","INFORMACIÓN PÚBLICA","http://colombiatic.mintic.gov.co/","N/A","N/A","N/A","N/A","N/A","N/A","N/A","N/A"]
["120-151","INFORMACIÓN","OFICINA DE TECNOLOGIAS DE LA INFORMACIÓN","MiPyme - Empresario, competencias y capacidades","MiPyme Vive Digital busca incrementar el acceso, uso y apropiación de Internet en las MiPyme colombianas para aplicar las TIC en sus procesos de negocio, con el fin de incrementar su competitividad y productividad.","OFICINA DE TECNOLOGIAS DE LA INFORMACIÓN","2018-11-28","OFICINA DE TECNOLOGIAS DE LA INFORMACIÓN","2019-01-02","ESTRATEGICO","ARQUITECTURA_INSTITUCIONAL","GESTION DE TECNOLOGIAS DE LA INFORMACION ","Ley 1712 de 2014, Artículo 6. literal J","Externo","Digital","Portales, Intranet y Extranet","XLS","Español","INFORMACIÓN PÚBLICA","http://colombiatic.mintic.gov.co/","N/A","N/A","N/A","N/A","N/A","N/A","N/A","N/A"]
["120-152","INFORMACIÓN","OFICINA DE TECNOLOGIAS DE LA INFORMACIÓN","Indice GEL","Índice que mide el avance promedio de las alcaldías y gobernaciones en la implementación de la Estrategia de Gobierno en línea.","OFICINA DE TECNOLOGIAS DE LA INFORMACIÓN","2018-11-28","OFICINA DE TECNOLOGIAS DE LA INFORMACIÓN","2019-01-02","ESTRATEGICO","ARQUITECTURA_INSTITUCIONAL","GESTION DE TECNOLOGIAS DE LA INFORMACION ","Ley 1712 de 2014, Artículo 6. literal J","Externo","Digital","Portales, Intranet y Extranet","XLS","Español","INFORMACIÓN PÚBLICA","http://colombiatic.mintic.gov.co/","N/A","N/A","N/A","N/A","N/A","N/A","N/A","N/A"]
["120-153","INFORMACIÓN","OFICINA DE TECNOLOGIAS DE LA INFORMACIÓN","Estudio de acceso, uso y retos de las TIC","La Primera Gran Encuesta TIC articula esfuerzos estadísticos históricamente dispersos en diversas investigaciones, esto le permitirá al país contar con un referente unificado de información para los principales indicadores. sectoriales producidos desde el Ministerio TIC. ","OFICINA DE TECNOLOGIAS DE LA INFORMACIÓN","2018-11-28","OFICINA DE TECNOLOGIAS DE LA INFORMACIÓN","2019-01-02","ESTRATEGICO","ARQUITECTURA_INSTITUCIONAL","GESTION DE TECNOLOGIAS DE LA INFORMACION ","Ley 1712 de 2014, Artículo 6. literal J","Externo","Digital","Portales, Intranet y Extranet","XLS","Español","INFORMACIÓN PÚBLICA","http://colombiatic.mintic.gov.co/","N/A","N/A","N/A","N/A","N/A","N/A","N/A","N/A"]
["120-154","INFORMACIÓN","OFICINA DE TECNOLOGIAS DE LA INFORMACIÓN","Repositorio Arquitectura Empresarial MinTIC","Repositorio Documental de la Arquitectura TI y Arquitectura Empresarial acorde a Decreto 1008 de 2018, por el cual se se establecen los lineamientos de cumplimiento de la estrategia de gobierno en linea, y alineado con el Guia General G.GEN.03 del proceso de arquitectura empresarial, donde se establece el repositorio de Arquitectura Empresarial","OFICINA DE TECNOLOGIAS DE LA INFORMACIÓN","2018-11-28","OFICINA DE TECNOLOGIAS DE LA INFORMACIÓN","2019-01-02","ESTRATEGICO","ARQUITECTURA_INSTITUCIONAL","GESTION DE TECNOLOGIAS DE LA INFORMACION ","Decreto 1008 del 14 de junio de 2018","Externo","Digital","Sistemas de Bases de Datos","Base de datos","Inglés y Español","INFORMACIÓN PÚBLICA RESERVADA","Software de escritorio Enterprise Architect","SI","Ley 1712 de 2014 articulo 19 literal a","Ley 1712 2014","Reserva total","2018-02-06","15 años","N/A","N/A"]
["120-155","INFORMACIÓN","OFICINA DE TECNOLOGIAS DE LA INFORMACIÓN","Inventario de datos abiertos minTIC","Contiene el listados de los datos publicados en el portal de datos abiertos","OFICINA DE TECNOLOGIAS DE LA INFORMACIÓN","2018-11-28","OFICINA DE TECNOLOGIAS DE LA INFORMACIÓN","2019-01-02","ESTRATEGICO","ARQUITECTURA_INSTITUCIONAL","GESTION DE TECNOLOGIAS DE LA INFORMACION ","Ley 1712 de 2014, Artículo 6. literal J","Externo","Digital","Archivos Institucionales - electrónico","XLS","Español","INFORMACIÓN PÚBLICA","Portal de datos abiertos","N/A","N/A","N/A","N/A","N/A","N/A","N/A","N/A"]
["120-156","INFORMACIÓN","OFICINA DE TECNOLOGIAS DE LA INFORMACIÓN","Portal oficial de estadísticas del sector TIC - ColombiaTIC","Portal oficial del ministerio donde se publican  estadísticas del sector TIC","OFICINA DE TECNOLOGIAS DE LA INFORMACIÓN","2018-11-28","OFICINA DE TECNOLOGIAS DE LA INFORMACIÓN","2019-01-02","ESTRATEGICO","ARQUITECTURA_INSTITUCIONAL","GESTION DE TECNOLOGIAS DE LA INFORMACION ","N/A","N/A","Digital","Portales, Intranet y Extranet","XML","Español","INFORMACIÓN PÚBLICA","http://colombiatic.mintic.gov.co/","N/A","N/A","N/A","N/A","N/A","N/A","N/A","N/A"]
["120-157","INFORMACIÓN","OFICINA DE TECNOLOGIAS DE LA INFORMACIÓN","Internet Fijo Cuota por proveedor","Número de suscriptores con acceso fijo a Internet por proveedor de redes y servicios según sus datos al último día de cada trimestre, Consolidado. Basados en estos datos, se muestra el porcentaje de participación que tiene cada proveedor con respecto al total de suscriptores con acceso fijo a Internet en Colombia para cada trimestre. La tabla muestra en la última fila el total de suscriptores con acceso fijo a Internet en Colombia.","OFICINA DE TECNOLOGIAS DE LA INFORMACIÓN","2018-11-28","OFICINA DE TECNOLOGIAS DE LA INFORMACIÓN","2019-01-02","ESTRATEGICO","ARQUITECTURA_INSTITUCIONAL","GESTION DE TECNOLOGIAS DE LA INFORMACION ","Ley 1712 de 2014, Artículo 6. literal J","Externo","Digital","Portales, Intranet y Extranet","XLS","Español","INFORMACIÓN PÚBLICA","https://www.datos.gov.co/Ciencia-Tecnolog-a-e-Innovaci-n/Internet-Fijo-Cuota-por-proveedor/jbu8-2ymz/","N/A","N/A","N/A","N/A","N/A","N/A","N/A","N/A"]
["120-158","INFORMACIÓN","OFICINA DE TECNOLOGIAS DE LA INFORMACIÓN","Internet Fijo Penetración Departamentos","Número de suscriptores con acceso fijo a Internet para cada uno de los departamentos de Colombia según los datos reportados por los proveedores al último día de cada trimestre . Basados en estos datos, y en las proyecciones del DANE para la población por departamento, consolidado, se muestra el porcentaje de penetración de Internet fijo para cada trimestre.","OFICINA DE TECNOLOGIAS DE LA INFORMACIÓN","2018-11-28","OFICINA DE TECNOLOGIAS DE LA INFORMACIÓN","2019-01-02","ESTRATEGICO","ARQUITECTURA_INSTITUCIONAL","GESTION DE TECNOLOGIAS DE LA INFORMACION ","Ley 1712 de 2014, Artículo 6. literal J","Externo","Digital","Portales, Intranet y Extranet","XLS","Español","INFORMACIÓN PÚBLICA","https://www.datos.gov.co/Ciencia-Tecnolog-a-e-Innovaci-n/Internet-Fijo-Penetraci-n-Departamentos/4py7-br84","N/A","N/A","N/A","N/A","N/A","N/A","N/A","N/A"]
["120-159","INFORMACIÓN","OFICINA DE TECNOLOGIAS DE LA INFORMACIÓN","Internet Fijo Penetración Municipio","Número de suscriptores con acceso dedicado a Internet para cada uno de los departamentos y municipios de Colombia, según los datos reportados por los proveedores al último día de cada trimestre. Basados en estos datos y en las proyecciones del DANE para la población por municipio, departamento y en total en Colombia, se muestra el porcentaje de penetración de Internet fijo.","OFICINA DE TECNOLOGIAS DE LA INFORMACIÓN","2018-11-28","OFICINA DE TECNOLOGIAS DE LA INFORMACIÓN","2019-01-02","ESTRATEGICO","ARQUITECTURA_INSTITUCIONAL","GESTION DE TECNOLOGIAS DE LA INFORMACION ","Ley 1712 de 2014, Artículo 6. literal J","Externo","Digital","Portales, Intranet y Extranet","XLS","Español","INFORMACIÓN PÚBLICA","https://www.datos.gov.co/Ciencia-Tecnolog-a-e-Innovaci-n/Internet-Fijo-Penetraci-n-Municipio/fut2-keu8","N/A","N/A","N/A","N/A","N/A","N/A","N/A","N/A"]
["120-160","INFORMACIÓN","OFICINA DE TECNOLOGIAS DE LA INFORMACIÓN","Internet Fijo Accesos por tecnología y segmento","Ingresos del servicio de acceso fijo a Internet por proveedor de redes y servicios según sus datos al último día de cada trimestre. Esta información se refiere exclusivamente a los ingresos operacionales (en pesos colombianos), entendidos para efectos del reporte, como aquéllos que se producen en desarrollo de la actividad económica propia del negocio, por la prestación de servicios de telecomunicaciones. Se excluyen aquéllos ingresos que se producen por otros conceptos no operacionales, tales como ingresos financieros, rendimientos de inversiones o utilidades en venta de activos fijos, entre otros.","OFICINA DE TECNOLOGIAS DE LA INFORMACIÓN","2018-11-28","OFICINA DE TECNOLOGIAS DE LA INFORMACIÓN","2019-01-02","ESTRATEGICO","ARQUITECTURA_INSTITUCIONAL","GESTION DE TECNOLOGIAS DE LA INFORMACION ","Ley 1712 de 2014, Artículo 6. literal J","Externo","Digital","Portales, Intranet y Extranet","XLS","Español","INFORMACIÓN PÚBLICA","https://datos.gov.co/Ciencia-Tecnolog-a-e-Innovaci-n/Internet-Fijo-Accesos-por-tecnolog-a-y-segmento/n48w-gutb","N/A","N/A","N/A","N/A","N/A","N/A","N/A","N/A"]
["120-161","INFORMACIÓN","OFICINA DE TECNOLOGIAS DE LA INFORMACIÓN","Internet Fijo ingresos por proveedor","Datos referentes al servicio de acceso móvil a Internet por demanda. El número de abonados con acceso móvil a Internet por demanda es reportado por los proveedores al último día de cada trimestre. El acceso por demanda corresponde al acceso a Internet móvil sin que medie la contratación de un plan para tal fin. (...) Resolución 5076 de 2016.","OFICINA DE TECNOLOGIAS DE LA INFORMACIÓN","2018-11-28","OFICINA DE TECNOLOGIAS DE LA INFORMACIÓN","2019-01-02","ESTRATEGICO","ARQUITECTURA_INSTITUCIONAL","GESTION DE TECNOLOGIAS DE LA INFORMACION ","Ley 1712 de 2014, Artículo 6. literal J","Externo","Digital","Portales, Intranet y Extranet","XLS","Español","INFORMACIÓN PÚBLICA","https://datos.gov.co/Ciencia-Tecnolog-a-e-Innovaci-n/Internet-Fijo-ingresos-por-proveedor/rcst-xw55","N/A","N/A","N/A","N/A","N/A","N/A","N/A","N/A"]
["120-162","INFORMACIÓN","OFICINA DE TECNOLOGIAS DE LA INFORMACIÓN","Internet Móvil, abonado, ingresos, trafico demanda por proveedor","Índice de penetración de los suscriptores y cantidad total de suscriptores de Internet con acceso móvil por suscripción. Los datos se muestran discriminados por proveedor y en total en Colombia","OFICINA DE TECNOLOGIAS DE LA INFORMACIÓN","2018-11-28","OFICINA DE TECNOLOGIAS DE LA INFORMACIÓN","2019-01-02","ESTRATEGICO","ARQUITECTURA_INSTITUCIONAL","GESTION DE TECNOLOGIAS DE LA INFORMACION ","Ley 1712 de 2014, Artículo 6. literal J","Externo","Digital","Portales, Intranet y Extranet","XLS","Español","INFORMACIÓN PÚBLICA","https://datos.gov.co/Ciencia-Tecnolog-a-e-Innovaci-n/Internet-M-vil-abonado-ingresos-trafico-demanda-po/ezyw-egbj","N/A","N/A","N/A","N/A","N/A","N/A","N/A","N/A"]
["120-163","INFORMACIÓN","OFICINA DE TECNOLOGIAS DE LA INFORMACIÓN","Internet Móvil suscriptores por proveedor","Datos referentes al servicio de acceso móvil a Internet por suscripción. El número de suscriptores con acceso móvil a Internet por suscripción es reportado por los proveedores al último día de cada trimestre. El acceso por suscripción (...) corresponde al acceso a Internet móvil a través de la contratación de un plan con un cargo fijo que se paga de forma periódica","OFICINA DE TECNOLOGIAS DE LA INFORMACIÓN","2018-11-28","OFICINA DE TECNOLOGIAS DE LA INFORMACIÓN","2019-01-02","ESTRATEGICO","ARQUITECTURA_INSTITUCIONAL","GESTION DE TECNOLOGIAS DE LA INFORMACION ","Ley 1712 de 2014, Artículo 6. literal J","Externo","Digital","Portales, Intranet y Extranet","XLS","Español","INFORMACIÓN PÚBLICA","https://www.datos.gov.co/Ciencia-Tecnolog-a-e-Innovaci-n/Internet-M-vil-suscriptores-por-proveedor/3grk-w373","N/A","N/A","N/A","N/A","N/A","N/A","N/A","N/A"]
["120-164","INFORMACIÓN","OFICINA DE TECNOLOGIAS DE LA INFORMACIÓN","Internet Móvil, abonado, ingresos, trafico suscripción por proveedor","    Compartir en redes sociales\n    Contactar con el propietario del conjunto de datos\n    Comentar sobre este conjunto de datos\n    Acceder a los datos a través de OData\n\nDatos referentes a los mensajes (SMS - MMS) enviados a través de la infraestructura de telefonía móvil: número de mensajes SMS y MMS intercambiados entre usuarios, tanto facturables como no facturables, enviados durante el periodo de reporte; red del proveedor de destino de los mensajes SMS/MMS; Total ingresos en pesos colombianos generados por cada tipo de mensaje durante el periodo de reporte.","OFICINA DE TECNOLOGIAS DE LA INFORMACIÓN","2018-11-28","OFICINA DE TECNOLOGIAS DE LA INFORMACIÓN","2019-01-02","ESTRATEGICO","ARQUITECTURA_INSTITUCIONAL","GESTION DE TECNOLOGIAS DE LA INFORMACION ","Ley 1712 de 2014, Artículo 6. literal J","Externo","Digital","Portales, Intranet y Extranet","XLS","Español","INFORMACIÓN PÚBLICA","https://www.datos.gov.co/Ciencia-Tecnolog-a-e-Innovaci-n/Internet-M-vil-abonado-ingresos-trafico-suscripci-/4vk3-rzfy","N/A","N/A","N/A","N/A","N/A","N/A","N/A","N/A"]
["120-165","INFORMACIÓN","OFICINA DE TECNOLOGIAS DE LA INFORMACIÓN","Telefonía Móvil ingresos mensaje de texto","Información de abonados en servicio de Telefonía Móvil por modalidad de suscripción (Prepago o Pospago), Líneas activadas y retiradas del servicios de telefonía móvil. Los datos se presentan discriminados para cada uno de los proveedores de redes y servicios móviles. ","OFICINA DE TECNOLOGIAS DE LA INFORMACIÓN","2018-11-28","OFICINA DE TECNOLOGIAS DE LA INFORMACIÓN","2019-01-02","ESTRATEGICO","ARQUITECTURA_INSTITUCIONAL","GESTION DE TECNOLOGIAS DE LA INFORMACION ","Ley 1712 de 2014, Artículo 6. literal J","Externo","Digital","Portales, Intranet y Extranet","XLS","Español","INFORMACIÓN PÚBLICA","https://www.datos.gov.co/Ciencia-Tecnolog-a-e-Innovaci-n/Telefon-a-M-vil-ingresos-mensaje-de-texto/m5pi-7cau","N/A","N/A","N/A","N/A","N/A","N/A","N/A","N/A"]
["120-166","INFORMACIÓN","OFICINA DE TECNOLOGIAS DE LA INFORMACIÓN","Telefonía Móvil abonados por categoría","    Compartir en redes sociales\n    Contactar con el propietario del conjunto de datos\n    Comentar sobre este conjunto de datos\n    Acceder a los datos a través de OData\n\nInformación referente al tráfico de voz expresado en minutos de Proveedores de Redes y Servicios Móviles de acuerdo con la Resolución 5076 de 2016.","OFICINA DE TECNOLOGIAS DE LA INFORMACIÓN","2018-11-28","OFICINA DE TECNOLOGIAS DE LA INFORMACIÓN","2019-01-02","ESTRATEGICO","ARQUITECTURA_INSTITUCIONAL","GESTION DE TECNOLOGIAS DE LA INFORMACION ","Ley 1712 de 2014, Artículo 6. literal J","Externo","Digital","Portales, Intranet y Extranet","XLS","Español","INFORMACIÓN PÚBLICA","https://www.datos.gov.co/Ciencia-Tecnolog-a-e-Innovaci-n/Telefon-a-M-vil-abonados-por-categor-a/nrst-mwx4","N/A","N/A","N/A","N/A","N/A","N/A","N/A","N/A"]
["120-167","INFORMACIÓN","OFICINA DE TECNOLOGIAS DE LA INFORMACIÓN","Telefonía Móvil trafico de voz por proveedor","Información del servicio básico de telecomunicaciones cuyo objeto es la transmisión conmutada de voz o a través de la red telefónica de circuitos físicos con acceso generalizado al público. Datos sobre Líneas en servicio por proveedor, departamento, municipio y segmento. Los datos se presentan discriminados por los diferentes proveedores de redes y servicios que prestan el servicio. Información agrupada y publicada conforme a la Resolución 5076 de 2016","OFICINA DE TECNOLOGIAS DE LA INFORMACIÓN","2018-11-28","OFICINA DE TECNOLOGIAS DE LA INFORMACIÓN","2019-01-02","ESTRATEGICO","ARQUITECTURA_INSTITUCIONAL","GESTION DE TECNOLOGIAS DE LA INFORMACION ","Ley 1712 de 2014, Artículo 6. literal J","Externo","Digital","Portales, Intranet y Extranet","XLS","Español","INFORMACIÓN PÚBLICA","https://www.datos.gov.co/Ciencia-Tecnolog-a-e-Innovaci-n/Telefon-a-M-vil-trafico-de-voz-por-proveedor/67wf-gj42","N/A","N/A","N/A","N/A","N/A","N/A","N/A","N/A"]
["120-168","INFORMACIÓN","OFICINA DE TECNOLOGIAS DE LA INFORMACIÓN","Telefonía fija Líneas TPBC por estrato","Información del servicio básico de telecomunicaciones cuyo objeto es la transmisión conmutada de voz o a través de la red telefónica de circuitos físicos con acceso generalizado al público. Datos correspondientes al tráfico en minutos para los servicios de telefonía Local, Local Extendida, Larga Distancia Nacional, Larga Distancia Internacional Saliente, Larga Distancia Internacional Entrante. Los datos se presentan discriminados por los diferentes proveedores de redes y servicios que prestan el servicio.","OFICINA DE TECNOLOGIAS DE LA INFORMACIÓN","2018-11-28","OFICINA DE TECNOLOGIAS DE LA INFORMACIÓN","2019-01-02","ESTRATEGICO","ARQUITECTURA_INSTITUCIONAL","GESTION DE TECNOLOGIAS DE LA INFORMACION ","Ley 1712 de 2014, Artículo 6. literal J","Externo","Digital","Portales, Intranet y Extranet","XLS","Español","INFORMACIÓN PÚBLICA","https://www.datos.gov.co/Ciencia-Tecnolog-a-e-Innovaci-n/Telefon-a-fija-L-neas-TPBC-por-estrato/utfu-675p","N/A","N/A","N/A","N/A","N/A","N/A","N/A","N/A"]
["120-169","INFORMACIÓN","OFICINA DE TECNOLOGIAS DE LA INFORMACIÓN","Telefonía fija trafico voz TPBC","Información del servicio básico de telecomunicaciones cuyo objeto es la transmisión conmutada de voz o a través de la red telefónica de circuitos físicos con acceso generalizado al público. Datos correspondientes al tráfico en minutos para los servicios de telefonía Local, Local Extendida, Larga Distancia Nacional, Larga Distancia Internacional Saliente, Larga Distancia Internacional Entrante. Los datos se presentan discriminados por los diferentes proveedores de redes y servicios que prestan el servicio.","OFICINA DE TECNOLOGIAS DE LA INFORMACIÓN","2018-11-28","OFICINA DE TECNOLOGIAS DE LA INFORMACIÓN","2019-01-02","ESTRATEGICO","ARQUITECTURA_INSTITUCIONAL","GESTION DE TECNOLOGIAS DE LA INFORMACION ","Ley 1712 de 2014, Artículo 6. literal J","Externo","Digital","Portales, Intranet y Extranet","XLS","Español","INFORMACIÓN PÚBLICA","https://www.datos.gov.co/Ciencia-Tecnolog-a-e-Innovaci-n/Telefon-a-fija-trafico-voz-TPBC/mps4-qecf","N/A","N/A","N/A","N/A","N/A","N/A","N/A","N/A"]
["120-170","INFORMACIÓN","OFICINA DE TECNOLOGIAS DE LA INFORMACIÓN","Telefonía fija tráfico larga distancia internacional","Tráfico en minutos originado en Colombia y gestionado por el proveedor de larga distancia hacia un país destino","OFICINA DE TECNOLOGIAS DE LA INFORMACIÓN","2018-11-28","OFICINA DE TECNOLOGIAS DE LA INFORMACIÓN","2019-01-02","ESTRATEGICO","ARQUITECTURA_INSTITUCIONAL","GESTION DE TECNOLOGIAS DE LA INFORMACION ","Ley 1712 de 2014, Artículo 6. literal J","Externo","Digital","Portales, Intranet y Extranet","XLS","Español","INFORMACIÓN PÚBLICA","https://www.datos.gov.co/Ciencia-Tecnolog-a-e-Innovaci-n/Telefon-a-fija-tr-fico-larga-distancia-internacion/tamy-ffaj","N/A","N/A","N/A","N/A","N/A","N/A","N/A","N/A"]
["120-171","INFORMACIÓN","OFICINA DE TECNOLOGIAS DE LA INFORMACIÓN","Telefonía fija ingresos","    Compartir en redes sociales\n    Contactar con el propietario del conjunto de datos\n    Comentar sobre este conjunto de datos\n    Acceder a los datos a través de OData\n\nInformación del servicio básico de telecomunicaciones cuyo objeto es la transmisión conmutada de voz o a través de la red telefónica de circuitos físicos con acceso generalizado al público. Datos correspondientes a los ingresos en pesos Colombianos para los servicios de telefonía local, telefonía Local extendida, Larga Distancia Nacional, Larga Distancia Internacional Saliente, Larga Distancia Internacional Entrante. Los datos se presentan discriminados por los diferentes proveedores de redes y servicios que prestan el servicio","OFICINA DE TECNOLOGIAS DE LA INFORMACIÓN","2018-11-28","OFICINA DE TECNOLOGIAS DE LA INFORMACIÓN","2019-01-02","ESTRATEGICO","ARQUITECTURA_INSTITUCIONAL","GESTION DE TECNOLOGIAS DE LA INFORMACION ","Ley 1712 de 2014, Artículo 6. literal J","Externo","Digital","Portales, Intranet y Extranet","XLS","Español","INFORMACIÓN PÚBLICA","https://www.datos.gov.co/Ciencia-Tecnolog-a-e-Innovaci-n/Telefon-a-fija-ingresos/pfqh-5v7r","N/A","N/A","N/A","N/A","N/A","N/A","N/A","N/A"]
["120-172","SERVICIOS","OFICINA DE TECNOLOGIAS DE LA INFORMACIÓN","Portal oficial de estadísticas del sector TIC - ColombiaTIC","Portal oficial del ministerio donde se publican  estadísticas del sector TIC","OFICINA DE TECNOLOGIAS DE LA INFORMACIÓN","2018-11-28","OFICINA DE TECNOLOGIAS DE LA INFORMACIÓN","2019-01-02","ESTRATEGICO","ARQUITECTURA_INSTITUCIONAL","GESTION DE TECNOLOGIAS DE LA INFORMACION ","N/A","N/A","Digital","Portales, Intranet y Extranet","XLS -PDF","Español","INFORMACIÓN PÚBLICA","https://colombiatic.mintic.gov.co/","N/A","N/A","N/A","N/A","N/A","N/A","N/A","N/A"]
["133-173","INFORMACIÓN","GRUPO INTERNO DE TRABAJO DE PROCESOS JUDICIALES Y EXTRAJUDICIALES","Procesos","Procesos Juduciales y Extrajudiciales","GRUPO INTERNO DE TRABAJO DE PROCESOS JUDICIALES Y EXTRAJUDICIALES","2018-11-28","OFICINA ASESORA JURIDICA","2019-01-02","APOYO","GESTION_JURIDICA","GESTION JURIDICA","Artículo 18 y 19 de la Ley 1712 de 2014","Interno","Físico","Archivos Institucionales - físicos","Papel","Español","INFORMACIÓN PÚBLICA","OFICINA ASESORA JURÍDICA ","N/A","N/A","N/A","N/A","N/A","N/A","N/A","N/A"]
["133-174","INFORMACIÓN","GRUPO INTERNO DE TRABAJO DE PROCESOS JUDICIALES Y EXTRAJUDICIALES","Procesos ","Procesos Juduciales y Extrajudiciales","GRUPO INTERNO DE TRABAJO DE PROCESOS JUDICIALES Y EXTRAJUDICIALES","2018-11-28","OFICINA ASESORA JURIDICA","2019-01-02","APOYO","GESTION_JURIDICA","GESTION JURIDICA","Artículo 18 y 19 de la Ley 1712 de 2014","Interno","Físico","Archivos Institucionales - físicos","Papel","Español","INFORMACIÓN PÚBLICA","OFICINA ASESORA JURÍDICA ","N/A","N/A","N/A","N/A","N/A","N/A","N/A","N/A"]
["130-175","INFORMACIÓN","OFICINA ASESORA JURIDICA","Derechos de petición ","Derechos de petición que por competencia sean de la Oficina Asesora Jurídica ","OFICINA ASESORA JURIDICA","2018-11-28","OFICINA ASESORA JURIDICA","2019-01-02","APOYO","GESTION_JURIDICA","GESTION JURIDICA","Artículo 18 de la Ley 1712 de 2014","Interno","Físico","Archivos Institucionales - físicos","Papel","Español","INFORMACIÓN PÚBLICA","OFICINA ASESORA JURÍDICA ","N/A","N/A","N/A","N/A","N/A","N/A","Dato personal público","f. Atender y resolver peticiones, quejas, reclamos y sugerencias."]
["131-176","INFORMACIÓN","GRUPO INTERNO DE TRABAJO DE CONCEPTOS","Concepto Jurídico","Conceptos Jurídicos","GRUPO INTERNO DE TRABAJO DE CONCEPTOS","2018-11-28","OFICINA ASESORA JURIDICA","2019-01-02","APOYO","GESTION_JURIDICA","GESTION JURIDICA","Artículo 18 y 19 de la Ley 1712 de 2014","Interno","Físico","Archivos Institucionales - físicos","Papel","Español","INFORMACIÓN PÚBLICA","OFICINA ASESORA JURÍDICA ","N/A","N/A","N/A","N/A","N/A","N/A","Dato personal público","f. Atender y resolver peticiones, quejas, reclamos y sugerencias."]
["134-177","INFORMACIÓN","GRUPO INTERNO DE TRABAJO DE COBRO COACTIVO","Procesos de Cobro Coactivo","Proceso de Cobro Coactivo","GRUPO INTERNO DE TRABAJO DE COBRO COACTIVO","2018-11-28","OFICINA ASESORA JURIDICA","2019-01-02","APOYO","GESTION_JURIDICA","GESTION JURIDICA","N/A","Interno","Físico","Archivos Institucionales - físicos","Papel","Español","INFORMACIÓN PÚBLICA","OFICINA ASESORA JURÍDICA ","N/A","N/A","N/A","N/A","N/A","N/A","Dato personal público","N/A"]
["132-178","INFORMACIÓN","GRUPO INTERNO DE TRABAJO ACTUACIONES ADMINISTRATIVAS Y ASESORIA CONTRACTUAL","Informes de Gestión Patrimonios Autónomos ","Informes mensual de la gestión adelantada dentro de cada patrimonio autónomo de remanentes","GRUPO INTERNO DE TRABAJO ACTUACIONES ADMINISTRATIVAS Y ASESORIA CONTRACTUAL","2018-11-28","OFICINA ASESORA JURIDICA","2019-01-02","APOYO","GESTION_JURIDICA","GESTION JURIDICA","N/A","Interno","Físico","Archivos Institucionales - físicos","Papel","Español","INFORMACIÓN PÚBLICA","OFICINA ASESORA JURÍDICA ","N/A","N/A","N/A","N/A","N/A","N/A","N/A","N/A"]
["130-179","INFORMACIÓN","OFICINA ASESORA JURIDICA","Demandas Consticuionales ","Demanda de tipo constyitucional en las que es parte el Ministerio Fondo Único de TIC","OFICINA ASESORA JURIDICA","2018-11-28","OFICINA ASESORA JURIDICA","2019-01-02","APOYO","GESTION_JURIDICA","GESTION JURIDICA","N/A","Interno","Físico","Archivos Institucionales - físicos","Papel","Español","INFORMACIÓN PÚBLICA","OFICINA ASESORA JURÍDICA ","N/A","N/A","N/A","N/A","N/A","N/A","N/A","N/A"]
["140-180","INFORMACIÓN","OFICINA INTERNACIONAL","ACUERDOS INTERNACIONALES DE COOPERACIÓN","Establecer acuerdos y planes de cooperación con instancias internacionales, que apoyen el desarrollo de las iniciativas del ministerio derivadas de la política TIC definida.","OFICINA INTERNACIONAL","2018-11-28","OFICINA INTERNACIONAL","2019-01-02","ESTRATEGICO","COOPERACION_INTERNACIONAL","GESTION INTERNACIONAL","N/A","Interno","Físico","Documentos de Archivo - físicos","Papel","Español","INFORMACIÓN PÚBLICA","Sharepoint y Archivo Físico","N/A","N/A","N/A","N/A","N/A","N/A","N/A","a. Permitir el desarrollo del objeto del Ministerio/Fondo TIC, en los términos de los artículos 1o y 2o del Decreto 1414 de 2017."]
["140-181","INFORMACIÓN","OFICINA INTERNACIONAL","Informes de Agenda Internacional","Participar activamente en escenarios internacionales relevantes del mundo TIC, posicionando e impulsando el plan estratégico “El Futuro Digital es de Todos”.","OFICINA INTERNACIONAL","2018-11-28","OFICINA INTERNACIONAL","2019-01-02","ESTRATEGICO","COOPERACION_INTERNACIONAL","GESTION INTERNACIONAL","N/A","Interno","Físico","Documentos de Archivo - físicos","Papel","Español","INFORMACIÓN PÚBLICA","Sharepoint y Archivo Físico","N/A","N/A","N/A","N/A","N/A","N/A","N/A","a. Permitir el desarrollo del objeto del Ministerio/Fondo TIC, en los términos de los artículos 1o y 2o del Decreto 1414 de 2017."]
["140-182","INFORMACIÓN","OFICINA INTERNACIONAL","Inforems de gestion ","Los informes de gestión, tienen información oficial y detallada sobre el ejercicio de las funciones de la Oficina Internacional.","OFICINA INTERNACIONAL","2018-11-28","OFICINA INTERNACIONAL","2019-01-02","ESTRATEGICO","COOPERACION_INTERNACIONAL","GESTION INTERNACIONAL","N/A","Interno","Físico","Documentos de Archivo - físicos","Papel","Español","INFORMACIÓN PÚBLICA","Sharepoint y Archivo Físico","N/A","N/A","N/A","N/A","N/A","N/A","N/A","a. Permitir el desarrollo del objeto del Ministerio/Fondo TIC, en los términos de los artículos 1o y 2o del Decreto 1414 de 2017."]
["140-183","INFORMACIÓN","OFICINA INTERNACIONAL","Informes de Cooperación Internacional","La Oficina Internacional realiza la gestión de las actividades de cooperación internacional del Ministerio de Tecnologías y las Comunicaciones de Colombia, en apoyo al diseño e implementación de políticas del sector TIC; bajo el marco de la inserción del Ministerio en distintos organismos internacionales, así como también en el ámbito de las relaciones bilaterales y multilaterales en materia de TIC.","OFICINA INTERNACIONAL","2018-11-28","OFICINA INTERNACIONAL","2019-01-02","ESTRATEGICO","COOPERACION_INTERNACIONAL","GESTION INTERNACIONAL","N/A","Interno","Físico","Documentos de Archivo - físicos","Papel","Español","INFORMACIÓN PÚBLICA","Sharepoint y Archivo Físico","N/A","N/A","N/A","N/A","N/A","N/A","N/A","a. Permitir el desarrollo del objeto del Ministerio/Fondo TIC, en los términos de los artículos 1o y 2o del Decreto 1414 de 2017."]
["160-184","INFORMACIÓN","OFICINA DE CONTROL INTERNO","Actas de Comité de Coordinación del Sistema de Control Interno","Procesos y conclusiones de reuniones establecidas","OFICINA DE CONTROL INTERNO","2018-11-28","OFICINA DE CONTROL INTERNO","2019-01-02","EVALUACION","ANALISIS_MEJORA_GESTION","EVALUACION Y APOYO AL CONTROL DE LA GESTION","Resolución 3212 - 2018","Interno","Físico","Documentos de Archivo - electrónicos","PDF","Español","INFORMACIÓN PÚBLICA","N/A","N/A","N/A","N/A","N/A","N/A","N/A","Dato personal público","g. Conservar evidencia de los eventos de entrenamiento y sensibilización realizados, audiencias de adjudicación de contratos, reuniones internas y externas."]
["160-185","INFORMACIÓN","OFICINA DE CONTROL INTERNO","Informes de Seguimiento  ","Informes de seguimiento  ley de transparencia","OFICINA DE CONTROL INTERNO","2018-11-28","OFICINA DE CONTROL INTERNO","2019-01-02","EVALUACION","ANALISIS_MEJORA_GESTION","EVALUACION Y APOYO AL CONTROL DE LA GESTION","Ley 1712 de 2014","Externo","Físico","Archivos Institucionales - electrónico","PDF","Español","INFORMACIÓN PÚBLICA","https://www.mintic.gov.co/portal/inicio/Ministerio/Ministra/Oficina-Control-Interno/","N/A","N/A","N/A","N/A","N/A","N/A","Dato personal público","i. Efectuar la convocatoria y generar evidencia de la realización de sesiones de rendición de cuentas y participación ciudadana."]
["160-186","INFORMACIÓN","OFICINA DE CONTROL INTERNO","Auditoria de Calidad","Auditoria de Calidad","OFICINA DE CONTROL INTERNO","2018-11-28","OFICINA DE CONTROL INTERNO","2019-01-02","EVALUACION","ANALISIS_MEJORA_GESTION","EVALUACION Y APOYO AL CONTROL DE LA GESTION","Segerido por Funcion Pública","Externo","Digital","Documentos de Archivo - físicos","PDF","Español","INFORMACIÓN PÚBLICA","N/A","N/A","N/A","N/A","N/A","N/A","N/A","N/A","N/A"]
["160-187","INFORMACIÓN","OFICINA DE CONTROL INTERNO","Informes Auditorias de Gestión","Auditorias de Gestión","OFICINA DE CONTROL INTERNO","2018-11-28","OFICINA DE CONTROL INTERNO","2019-01-02","EVALUACION","ANALISIS_MEJORA_GESTION","EVALUACION Y APOYO AL CONTROL DE LA GESTION","Decreto 648 del 2017","Externo","Físico","Documentos de Archivo - físicos","PDF","Español","INFORMACIÓN PÚBLICA","https://mintic.sharepoint.com/Oficina_Control_Interno/SitePages/Inicio.aspx","N/A","N/A","N/A","N/A","N/A","N/A","N/A","N/A"]
["160-188","INFORMACIÓN","OFICINA DE CONTROL INTERNO","Informe Pormenorizado de OCI","Informe Pormenorizado OCI","OFICINA DE CONTROL INTERNO","2018-11-28","OFICINA DE CONTROL INTERNO","2019-01-02","EVALUACION","ANALISIS_MEJORA_GESTION","EVALUACION Y APOYO AL CONTROL DE LA GESTION","Decreto 648 del 2017","Externo","Físico","Documentos de Archivo - físicos","PDF","Español","INFORMACIÓN PÚBLICA","https://www.mintic.gov.co/portal/inicio/Ministerio/Ministra/Oficina-Control-Interno/","N/A","N/A","N/A","N/A","N/A","N/A","N/A","N/A"]
["160-189","INFORMACIÓN","OFICINA DE CONTROL INTERNO","PQRSD (OCI)","Peticiones, Quejas, Reclamos, Solicitudes y Denuncias","OFICINA DE CONTROL INTERNO","2018-11-28","OFICINA DE CONTROL INTERNO","2019-01-02","EVALUACION","ANALISIS_MEJORA_GESTION","EVALUACION Y APOYO AL CONTROL DE LA GESTION","Decreto 1083 de 2015","Externo","Físico","Archivos Institucionales - físicos","PDF","Español","INFORMACIÓN PÚBLICA","N/A","N/A","N/A","N/A","N/A","N/A","N/A","Dato personal privado ","f. Atender y resolver peticiones, quejas, reclamos y sugerencias."]
["160-190","INFORMACIÓN","OFICINA DE CONTROL INTERNO","Planes de Mejoramiento de Calidad y Gestión","Planes de Mejoramiento de Calidad y Gestión","OFICINA DE CONTROL INTERNO","2018-11-28","OFICINA DE CONTROL INTERNO","2019-01-02","EVALUACION","ANALISIS_MEJORA_GESTION","EVALUACION Y APOYO AL CONTROL DE LA GESTION","Decreto 648 del 2017","Externo","Digital","Documentos de Archivo - físicos","PDF","Español","INFORMACIÓN PÚBLICA","https://mintic.sharepoint.com/Oficina_Control_Interno/SitePages/Inicio.aspx","N/A","N/A","N/A","N/A","N/A","N/A","N/A","N/A"]
["160-191","INFORMACIÓN","OFICINA DE CONTROL INTERNO","Planes de Mejoramiento para la Contraloria","Planes de Mejoramiento para la Controloria","OFICINA DE CONTROL INTERNO","2018-11-28","OFICINA DE CONTROL INTERNO","2019-01-02","EVALUACION","ANALISIS_MEJORA_GESTION","EVALUACION Y APOYO AL CONTROL DE LA GESTION","Resolución Organica 7350 de 2013  Contraloria.","Externo","Digital","Documentos de Archivo - físicos","PDF","Español","INFORMACIÓN PÚBLICA","https://mintic.sharepoint.com/Oficina_Control_Interno/SitePages/Inicio.aspx","N/A","N/A","N/A","N/A","N/A","N/A","N/A","N/A"]
["160-192","INFORMACIÓN","OFICINA DE CONTROL INTERNO","Plan Anual de Auditoria (PAAI)","Plan anual de Auditoria","OFICINA DE CONTROL INTERNO","2018-11-28","OFICINA DE CONTROL INTERNO","2019-01-02","EVALUACION","ANALISIS_MEJORA_GESTION","EVALUACION Y APOYO AL CONTROL DE LA GESTION","Ley 1712 de 2014","Externo","Digital","Archivos Institucionales - electrónico","PDF","Español","INFORMACIÓN PÚBLICA","https://www.mintic.gov.co/portal/inicio/Ministerio/Ministra/Oficina-Control-Interno/","N/A","N/A","N/A","N/A","N/A","N/A","N/A","N/A"]
["200-193","INFORMACIÓN","DESPACHO DEL VICEMINISTRO DE CONECTIVIDAD Y DIGITALIZACIÓN","Solicitud","Solicitud al despacho de informes de gestion",{"$f":"IF(C200=\"\",\"\",C200)","v":"DESPACHO DEL VICEMINISTRO DE CONECTIVIDAD Y DIGITALIZACIÓN"},"2018-11-28","DESPACHO DEL VICEMINISTRO DE CONECTIVIDAD Y DIGITALIZACIÓN","2019-01-02","MISIONAL","PLANEACION_FORMULACION_POLITICAS_TIC","PLANEACION Y FORMULACION DE POLITICAS TIC","Ley 951 de 2005","Externo","Físico","Documentos de Archivo - físicos","Papel","Español","INFORMACIÓN PÚBLICA","ALFANET","N/A","N/A","N/A","N/A","N/A","N/A","Dato personal público","N/A"]
["200-194","INFORMACIÓN","DESPACHO DEL VICEMINISTRO DE CONECTIVIDAD Y DIGITALIZACIÓN","Informe","Informe de gestión","DESPACHO DEL VICEMINISTRO DE CONECTIVIDAD Y DIGITALIZACIÓN","2018-11-28","DESPACHO DEL VICEMINISTRO DE CONECTIVIDAD Y DIGITALIZACIÓN","2019-01-02","MISIONAL","PLANEACION_FORMULACION_POLITICAS_TIC","PLANEACION Y FORMULACION DE POLITICAS TIC","Ley 951 de 2005","Externo","Físico","Documentos de Archivo - físicos","Papel","Español","INFORMACIÓN PÚBLICA","ALFANET","N/A","N/A","N/A","N/A","N/A","N/A","Dato personal público","N/A"]
["200-195","INFORMACIÓN","DESPACHO DEL VICEMINISTRO DE CONECTIVIDAD Y DIGITALIZACIÓN","Solicitud","Sollicitud al despacho de respuesta a una PQRSD","DESPACHO DEL VICEMINISTRO DE CONECTIVIDAD Y DIGITALIZACIÓN","2018-11-28","GRUPO INTERNO DE TRABAJO DE FORTALECIMIENTO DE LAS RELACIONES CON LOS GRUPOS DE INTERES","2019-01-02","MISIONAL","PLANEACION_FORMULACION_POLITICAS_TIC","PLANEACION Y FORMULACION DE POLITICAS TIC","Ley 1755 de 2005","Externo","Físico","Documentos de Archivo - físicos","Papel","Español","INFORMACIÓN PÚBLICA","ALFANET","N/A","N/A","N/A","N/A","N/A","N/A","Dato personal privado ","f. Atender y resolver peticiones, quejas, reclamos y sugerencias."]
["200-196","INFORMACIÓN","DESPACHO DEL VICEMINISTRO DE CONECTIVIDAD Y DIGITALIZACIÓN","Respuesta y/o trámite","Respuesta o tramite a la solicitud de PQRSD","DESPACHO DEL VICEMINISTRO DE CONECTIVIDAD Y DIGITALIZACIÓN","2018-11-28","GRUPO INTERNO DE TRABAJO DE FORTALECIMIENTO DE LAS RELACIONES CON LOS GRUPOS DE INTERES","2019-01-02","MISIONAL","PLANEACION_FORMULACION_POLITICAS_TIC","PLANEACION Y FORMULACION DE POLITICAS TIC","Ley 1755 de 2005","Externo","Físico","Documentos de Archivo - físicos","Papel","Español","INFORMACIÓN PÚBLICA","ALFANET","N/A","N/A","N/A","N/A","N/A","N/A","Dato personal privado ","f. Atender y resolver peticiones, quejas, reclamos y sugerencias."]
["200-197","RECURSO HUMANO","DESPACHO DEL VICEMINISTRO DE CONECTIVIDAD Y DIGITALIZACIÓN","Viceministro de Conectividad y Digitalización","Viceministro de Conectividad y Digitalización","DESPACHO DEL VICEMINISTRO DE CONECTIVIDAD Y DIGITALIZACIÓN","2018-11-28","DESPACHO DEL VICEMINISTRO DE CONECTIVIDAD Y DIGITALIZACIÓN","2019-01-02","MISIONAL","PLANEACION_FORMULACION_POLITICAS_TIC","PLANEACION Y FORMULACION DE POLITICAS TIC","N/A","N/A","N/A",null,null,null,"NO CLASIFICADA","N/A","N/A","N/A","N/A","N/A","N/A","N/A","N/A","a. Permitir el desarrollo del objeto del Ministerio/Fondo TIC, en los términos de los artículos 1o y 2o del Decreto 1414 de 2017."]
["210-198","INFORMACIÓN","DIRECCIÓN DE INDUSTRIA DE COMUNICACIONES","CONCEPTOS TECNICOS SOBRE LA INDUSTRIA DE COMUNICACIONES","Conceptos sobre la industria de comunicaciones en todos sus sectores de telecomunicaciones, radiodifusión sonora y postal, con trámite de incluir el sector de televisión - TV","DIRECCIÓN DE INDUSTRIA DE COMUNICACIONES","2018-11-28","DIRECCIÓN DE INDUSTRIA DE COMUNICACIONES","2019-01-31","MISIONAL","ACCESO_USO_APROPIACION_TIC","GESTION DE LA INDUSTRIA DE LAS COMUNICACIONES","Decreto 1414 de 2017 y normas reglamentarias","Externo","Físico","Documentos de Archivo - físicos","Papel","Español","NO CLASIFICADA","Sistema de gestión documental AlfaNet","N/A","N/A","N/A","N/A","N/A","N/A","N/A","N/A"]
["210-199","INFORMACIÓN","DIRECCIÓN DE INDUSTRIA DE COMUNICACIONES","INFORMES DE GESTION Y DE ACUERDOS DE GESTION","Emisión de informes de la gestión de la Dirección respecto a aspectos particulares de su rol en la entidad","DIRECCIÓN DE INDUSTRIA DE COMUNICACIONES","2018-11-28","DIRECCIÓN DE INDUSTRIA DE COMUNICACIONES","2019-01-31","MISIONAL","ACCESO_USO_APROPIACION_TIC","GESTION DE LA INDUSTRIA DE LAS COMUNICACIONES","Decreto 1414 de 2017 y normas reglamentarias","Interno","Físico","Documentos de Archivo - físicos","Papel","Español","INFORMACIÓN PÚBLICA CLASIFICADA","Sistema de gestión documental AlfaNet","SI","Ley 1712 de 2014","Puede contener información comercial que puede afectar la libre competencia","Reserva parcial","2018-11-28","Permanente","N/A","a. Permitir el desarrollo del objeto del Ministerio/Fondo TIC, en los términos de los artículos 1o y 2o del Decreto 1414 de 2017."]
["210-200","INFORMACIÓN","DIRECCIÓN DE INDUSTRIA DE COMUNICACIONES","RESPUESTAS A PQRSD","Respuestas a peticiones,quejas, reclamos, sugerencias y denuncias que tienen que ver con los asuntos directos de la Dirección, salvo lo que compete a conceptos e informes de gestión.","DIRECCIÓN DE INDUSTRIA DE COMUNICACIONES","2018-11-28","GRUPO INTERNO DE TRABAJO DE FORTALECIMIENTO DE LAS RELACIONES CON LOS GRUPOS DE INTERES","2019-01-31","MISIONAL","ACCESO_USO_APROPIACION_TIC","GESTION DE LA INDUSTRIA DE LAS COMUNICACIONES","Decreto 1414 de 2017 y normas reglamentarias","Externo","N/A","Sistemas de Información corporativos","TIFF","Español","INFORMACIÓN PÚBLICA","ALFANET","N/A","N/A","N/A","N/A","N/A","N/A","Dato personal privado ","f. Atender y resolver peticiones, quejas, reclamos y sugerencias."]
["210-201","INFORMACIÓN","DIRECCIÓN DE INDUSTRIA DE COMUNICACIONES","PROCESOS DE SELECCIÓN OBJETIVA DEL ESPECTRO RADIOLÉCTRICO","Procesos por medio del cual se otorgan permisos para uso del espectro radioeléctrico en Colombia luego de la validación administrativa y técnica que hace el Ministerio de TIC con el apoyo técnico de la ANE","DIRECCIÓN DE INDUSTRIA DE COMUNICACIONES","2018-11-28","GRUPO INTERNO DE TRABAJO DE GESTIÓN DE ESPECTRO RADIOÉLECTRICO","2019-01-31","MISIONAL","ACCESO_USO_APROPIACION_TIC","GESTION DE LA INDUSTRIA DE LAS COMUNICACIONES","Decreto 1414 de 2017 y normas reglamentarias","Interno","Digital","Sistemas de Información corporativos","PDF","Español","INFORMACIÓN PÚBLICA CLASIFICADA","Sitio web institucional","SI","ley 1712 e 2014 y 1581 de 2012","Alguno de los datos de la información contiene información sensible que puede afectar la libre competencia ","Reserva parcial","2019-01-31","Permanente","Dato semiprivado","a. Permitir el desarrollo del objeto del Ministerio/Fondo TIC, en los términos de los artículos 1o y 2o del Decreto 1414 de 2017."]
["210-202","INFORMACIÓN","DIRECCIÓN DE INDUSTRIA DE COMUNICACIONES","PROYECTOS DE LA DIRECCIÓN DE INDUSTRIA DE COMUNICACIONES","Proyectos e iniciativas que plantea y desarrolla la Dirección de Industria de Comunicaciones que propenden por mejorar la competitividad de la industria de comunicaciones en sus sectores de telecomunicaciones, audiovisuales (radio y TV) y postal.","DIRECCIÓN DE INDUSTRIA DE COMUNICACIONES","2018-11-28","SUBDIRECCIÓN DE RADIO DIFUSIÓN SONORA","2019-01-02","ESTRATEGICO","MARCO_ESTRATEGICO","DIRECCIONAMIENTO ESTRATEGICO","Decreto 1414 de 2017 y normas reglamentarias","Interno","Digital","Archivos Institucionales - electrónico","Base de datos","Español","INFORMACIÓN PÚBLICA","Sitio web institucional","N/A","N/A","N/A","N/A","N/A","N/A","N/A","N/A"]
["210-203","INFORMACIÓN","DIRECCIÓN DE INDUSTRIA DE COMUNICACIONES","OBLIGACIONES DE HACER","Proceso mediante el cual el Ministerio de TIC recibe de los PRST la expansión de infraestructura para ampliar la cobertura de los servicios como parte de pago de las contraprestaciones que deben cancelar por el uso del espectro","DIRECCIÓN DE INDUSTRIA DE COMUNICACIONES","2018-11-28","DIRECCIÓN DE INDUSTRIA DE COMUNICACIONES","2019-01-02","MISIONAL","ACCESO_USO_APROPIACION_TIC","GESTION DE LA INDUSTRIA DE LAS COMUNICACIONES","Ley 1753 de 2015, ley 1978 de 2019","Externo","Físico","Archivos Institucionales - físicos","Papel","Español","INFORMACIÓN PÚBLICA CLASIFICADA","Intranet institucional","SI","Ley 1712 de 2014","Puede contener información comercial que puede afectar la libre competencia","Reserva parcial","2018-11-28","Permanente","N/A","a. Permitir el desarrollo del objeto del Ministerio/Fondo TIC, en los términos de los artículos 1o y 2o del Decreto 1414 de 2017."]
["211-204","INFORMACIÓN","SUBDIRECCIÓN PARA LA INDUSTRIA DE COMUNICACIONES","Registros documentales de trámites","Datos de usuarios (persona natural o jurídica), expedientes, redes, areas de servicio, informacion tecnica de equipos y antenas (fabricante, modelo, banda de operación, ancho de banda, ancho de haz, polarizacion, potencia de Tx, denominacion de emision, ganancia), azimut, altura torres, informacion de emplazamientos (direccion, coordenadas, nombre, altura sobre el nivel del mar), tipo de servicio, clase de estacion, categoria de estacion, naturaleza de servicio, canales de frecuencia, ocupacion de canal, liquidaciones, correspondencia.","SUBDIRECCIÓN PARA LA INDUSTRIA DE COMUNICACIONES","2018-11-28","SUBDIRECCIÓN PARA LA INDUSTRIA DE COMUNICACIONES","2019-01-02","MISIONAL","ACCESO_USO_APROPIACION_TIC","GESTION DE LA INDUSTRIA DE LAS COMUNICACIONES","Ley 1341 de 2009 y normas que lo modifican, complementan o reglamentan","Interno","Físico","Documentos de Archivo - físicos","Papel","Español","INFORMACIÓN PÚBLICA CLASIFICADA"," Archivo de gestión (físico)","SI","Ley 1712 de 2014","Parte de la información técnica es considerada secreto comercial","Reserva parcial","2019-12-05","Vigencia de la autorización, permiso, concesión o registro más cinco (5) años.","Dato semiprivado","a. Permitir el desarrollo del objeto del Ministerio/Fondo TIC, en los términos de los artículos 1o y 2o del Decreto 1414 de 2017."]
["211-205","INFORMACIÓN","SUBDIRECCIÓN PARA LA INDUSTRIA DE COMUNICACIONES","Registros documentales de trámites","Datos de usuarios (persona natural o jurídica), expedientes, redes, areas de servicio, informacion tecnica de equipos y antenas (fabricante, modelo, banda de operación, ancho de banda, ancho de haz, polarizacion, potencia de Tx, denominacion de emision, ganancia), azimut, altura torres, informacion de emplazamientos (direccion, coordenadas, nombre, altura sobre el nivel del mar), tipo de servicio, clase de estacion, categoria de estacion, naturaleza de servicio, canales de frecuencia, ocupacion de canal, liquidaciones, correspondencia.","SUBDIRECCIÓN PARA LA INDUSTRIA DE COMUNICACIONES","2018-11-28","SUBDIRECCIÓN PARA LA INDUSTRIA DE COMUNICACIONES","2019-01-02","MISIONAL","ACCESO_USO_APROPIACION_TIC","GESTION DE LA INDUSTRIA DE LAS COMUNICACIONES","Ley 1341 de 2009 y normas que lo modifican, complementan o reglamentan","Interno","Digital","Sistemas de Información corporativos","Base de datos","Español","INFORMACIÓN PÚBLICA CLASIFICADA","BDU+, ALFANET, ZAFFIRO, ICS MANAGER, AURAPORTAL","SI","Ley 1712 de 2014","Parte de la información técnica es considerada secreto comercial","Reserva parcial","2019-12-05","Vigencia de la autorización, permiso, concesión o registro más cinco (5) años.","Dato semiprivado","a. Permitir el desarrollo del objeto del Ministerio/Fondo TIC, en los términos de los artículos 1o y 2o del Decreto 1414 de 2017."]
["211-206","INFORMACIÓN","SUBDIRECCIÓN PARA LA INDUSTRIA DE COMUNICACIONES","PQRSD","Peticiones, quejas, reclamos, denuncias hechas por la ciudadanía y direccionadas a la subdirección de industria.","SUBDIRECCIÓN PARA LA INDUSTRIA DE COMUNICACIONES","2018-11-28","SUBDIRECCIÓN PARA LA INDUSTRIA DE COMUNICACIONES","2019-01-02","MISIONAL","ACCESO_USO_APROPIACION_TIC","GESTION DE LA INDUSTRIA DE LAS COMUNICACIONES","Ley 1437 de 2011","Externo","Físico","Documentos de Archivo - físicos","Papel","Español","INFORMACIÓN PÚBLICA","ALFANET","N/A","N/A","N/A","N/A","N/A","N/A","Dato personal privado ","f. Atender y resolver peticiones, quejas, reclamos y sugerencias."]
["211-207","INFORMACIÓN","SUBDIRECCIÓN PARA LA INDUSTRIA DE COMUNICACIONES","Documentación perteneciente a trámites rechazados, denegados.","Documentación de trámites rechazados, denegados, inadmitidos que no pertenecen a expediente alguno existente con anterioridad al trámite.","SUBDIRECCIÓN PARA LA INDUSTRIA DE COMUNICACIONES","2018-11-28","SUBDIRECCIÓN PARA LA INDUSTRIA DE COMUNICACIONES","2019-01-02","MISIONAL","ACCESO_USO_APROPIACION_TIC","GESTION DE LA INDUSTRIA DE LAS COMUNICACIONES","Ley 1341 de 2009 y normas que lo modifican, complementan o reglamentan","Interno","Físico","Documentos de Archivo - físicos","Papel","Español","INFORMACIÓN PÚBLICA"," Archivo de gestión (físico)","N/A","N/A","N/A","N/A","N/A","N/A","Dato semiprivado","a. Permitir el desarrollo del objeto del Ministerio/Fondo TIC, en los términos de los artículos 1o y 2o del Decreto 1414 de 2017."]
["211-208","INFORMACIÓN","SUBDIRECCIÓN PARA LA INDUSTRIA DE COMUNICACIONES","Proyectos técnicos y normativos","Registros relativos a proyectos de tipo técnico o normativo que desarrolle la Subdirección de Industria","SUBDIRECCIÓN PARA LA INDUSTRIA DE COMUNICACIONES","2018-11-28","SUBDIRECCIÓN PARA LA INDUSTRIA DE COMUNICACIONES","2019-01-02","MISIONAL","ACCESO_USO_APROPIACION_TIC","GESTION DE LA INDUSTRIA DE LAS COMUNICACIONES","Ley 1341 de 2009 y normas que lo modifican, complementan o reglamentan","Interno","Físico","Documentos de Archivo - físicos","Papel","Español","INFORMACIÓN PÚBLICA"," Archivo de gestión (físico)","N/A","N/A","N/A","N/A","N/A","N/A","N/A","a. Permitir el desarrollo del objeto del Ministerio/Fondo TIC, en los términos de los artículos 1o y 2o del Decreto 1414 de 2017."]
["211-209","INFORMACIÓN","SUBDIRECCIÓN PARA LA INDUSTRIA DE COMUNICACIONES","Planes de acción, seguimiento y mejora.","Registros relativos a planes de acción, seguimiento y mejora que deba desarrollar la Subdirección de Industria.","SUBDIRECCIÓN PARA LA INDUSTRIA DE COMUNICACIONES","2018-11-28","SUBDIRECCIÓN PARA LA INDUSTRIA DE COMUNICACIONES","2019-01-02","EVALUACION","ANALISIS_MEJORA_GESTION","EVALUACION Y APOYO AL CONTROL DE LA GESTION","Ley 1341 de 2009 y normas que lo modifican, complementan o reglamentan","Interno","Físico","Documentos de Archivo - físicos","Papel","Español","INFORMACIÓN PÚBLICA RESERVADA"," Archivo de gestión (físico)","SI","Ley 1712 de 2014","Parte de la información técnica es considerada secreto comercial","Sin reserva","2019-12-05","Vigencia de la autorización, permiso, concesión o registro más cinco (5) años.","N/A","a. Permitir el desarrollo del objeto del Ministerio/Fondo TIC, en los términos de los artículos 1o y 2o del Decreto 1414 de 2017."]
["211-210","INFORMACIÓN","SUBDIRECCIÓN PARA LA INDUSTRIA DE COMUNICACIONES","Documentación perteneciente a trámites rechazados, denegados.","Documentación de trámites rechazados, denegados, inadmitidos que no pertenecen a expediente alguno existente con anterioridad al trámite.","SUBDIRECCIÓN PARA LA INDUSTRIA DE COMUNICACIONES","2018-11-28","SUBDIRECCIÓN PARA LA INDUSTRIA DE COMUNICACIONES","2019-01-02","MISIONAL","ACCESO_USO_APROPIACION_TIC","GESTION DE LA INDUSTRIA DE LAS COMUNICACIONES","Ley 1341 de 2009 y normas que lo modifican, complementan o reglamentan","Interno","Digital","Sistemas de Información corporativos","Base de datos","Español","INFORMACIÓN PÚBLICA","ALFANET","N/A","N/A","N/A","N/A","N/A","N/A","Dato semiprivado","a. Permitir el desarrollo del objeto del Ministerio/Fondo TIC, en los términos de los artículos 1o y 2o del Decreto 1414 de 2017."]
["211-211","INFORMACIÓN","SUBDIRECCIÓN PARA LA INDUSTRIA DE COMUNICACIONES","Registros de participación en comisiones técnicas o normativas","Documentación relativa a participación de la subdirectora en representación del Ministerio ante otros organismos","SUBDIRECCIÓN PARA LA INDUSTRIA DE COMUNICACIONES","2018-11-28","SUBDIRECCIÓN PARA LA INDUSTRIA DE COMUNICACIONES","2019-01-02","MISIONAL","ACCESO_USO_APROPIACION_TIC","GESTION DE LA INDUSTRIA DE LAS COMUNICACIONES","Resolución 3363 de 2017 (hasta noviembre de 2018)","Interno","Físico","Documentos de Archivo - físicos","Papel","Español","INFORMACIÓN PÚBLICA"," Archivo de gestión (físico)","N/A","N/A","N/A","N/A","N/A","N/A","N/A","a. Permitir el desarrollo del objeto del Ministerio/Fondo TIC, en los términos de los artículos 1o y 2o del Decreto 1414 de 2017."]
["211-212","INFORMACIÓN","SUBDIRECCIÓN PARA LA INDUSTRIA DE COMUNICACIONES","Requerimientos de ajustes en bases de datos","Documentación soporte de los ajustes que se piden a la Oficina TI relativos a bases de datos que son responsabilidad de la Subdirección","SUBDIRECCIÓN PARA LA INDUSTRIA DE COMUNICACIONES","2018-11-28","SUBDIRECCIÓN PARA LA INDUSTRIA DE COMUNICACIONES","2019-01-02","MISIONAL","ACCESO_USO_APROPIACION_TIC","GESTION DE LA INDUSTRIA DE LAS COMUNICACIONES","Decreto 1414 de 2017","Interno","Digital","Sistemas de Información corporativos","HTML (Página Web)","Español","NO CLASIFICADA","Outlook Web","N/A","N/A","N/A","N/A","N/A","N/A","N/A","a. Permitir el desarrollo del objeto del Ministerio/Fondo TIC, en los términos de los artículos 1o y 2o del Decreto 1414 de 2017."]
["211-213","INFORMACIÓN","SUBDIRECCIÓN PARA LA INDUSTRIA DE COMUNICACIONES","Actas del comité de obligaciones de hacer","Documentación de la participación de la subdirección en el comité de obligaciones de hacer","SUBDIRECCIÓN PARA LA INDUSTRIA DE COMUNICACIONES","2018-11-28","SUBDIRECCIÓN PARA LA INDUSTRIA DE COMUNICACIONES","2019-01-02","MISIONAL","ACCESO_USO_APROPIACION_TIC","GESTION DE LA INDUSTRIA DE LAS COMUNICACIONES","Ley 1341 de 2009 y normas que lo modifican, complementan o reglamentan","Interno","Físico","Documentos de Archivo - físicos","Papel","Español","INFORMACIÓN PÚBLICA CLASIFICADA"," Archivo de gestión (físico)","SI","Ley 1712 de 2014","Parte de la información involucra oferta de precios o costos de proyectos de obligaciones de hacer.","Reserva parcial","2019-12-05","Duración de la obligación de hacer y cinco (5) años más.","N/A","a. Permitir el desarrollo del objeto del Ministerio/Fondo TIC, en los términos de los artículos 1o y 2o del Decreto 1414 de 2017."]
["211.1-214","INFORMACIÓN","GRUPO INTERNO DE TRABAJO DE GESTIÓN DE ESPECTRO RADIOÉLECTRICO","Informes de participación en comisiones técnicas o normativas","Documentación relativa a participación de la coordinadora del GGERE en representación del Ministerio ante otros organismos","GRUPO INTERNO DE TRABAJO DE GESTIÓN DE ESPECTRO RADIOÉLECTRICO","2018-11-28","GRUPO INTERNO DE TRABAJO DE GESTIÓN DE ESPECTRO RADIOÉLECTRICO","2019-01-02","MISIONAL","ACCESO_USO_APROPIACION_TIC","GESTION DE LA INDUSTRIA DE LAS COMUNICACIONES","Decreto 1414 de 2017","Interno","Físico","Documentos de Archivo - físicos","Papel","Español","NO CLASIFICADA"," Archivo de gestión (físico)","N/A","N/A","N/A","N/A","N/A","N/A","N/A","a. Permitir el desarrollo del objeto del Ministerio/Fondo TIC, en los términos de los artículos 1o y 2o del Decreto 1414 de 2017."]
["211.1-215","INFORMACIÓN","GRUPO INTERNO DE TRABAJO DE GESTIÓN DE ESPECTRO RADIOÉLECTRICO","PQRSD","Peticiones, quejas, reclamos, denuncias hechas por la ciudadanía y direccionadas a la subdirección de industria.","GRUPO INTERNO DE TRABAJO DE GESTIÓN DE ESPECTRO RADIOÉLECTRICO","2018-11-28","GRUPO INTERNO DE TRABAJO DE GESTIÓN DE ESPECTRO RADIOÉLECTRICO","2019-01-02","MISIONAL","ACCESO_USO_APROPIACION_TIC","GESTION DE LA INDUSTRIA DE LAS COMUNICACIONES","Ley 1437 de 2011","Externo","Físico","Documentos de Archivo - físicos","Papel","Español","INFORMACIÓN PÚBLICA","ARCHIVO DE LA ENTIDAD","N/A","N/A","N/A","N/A","N/A","N/A","Dato personal privado ","f. Atender y resolver peticiones, quejas, reclamos y sugerencias."]
["211.1-216","INFORMACIÓN","GRUPO INTERNO DE TRABAJO DE GESTIÓN DE ESPECTRO RADIOÉLECTRICO","Asignación directa de espectro radioeléctrico","Documentación física relativa a los trámites mediante los cuales se asigna espectro radioeléctrico de manera directa","GRUPO INTERNO DE TRABAJO DE GESTIÓN DE ESPECTRO RADIOÉLECTRICO","2018-11-28","GRUPO INTERNO DE TRABAJO DE GESTIÓN DE ESPECTRO RADIOÉLECTRICO","2019-01-02","MISIONAL","ACCESO_USO_APROPIACION_TIC","GESTION DE LA INDUSTRIA DE LAS COMUNICACIONES","Ley 1341 de 2009 y normas que lo modifican, complementan o reglamentan","Interno","Físico","Documentos de Archivo - físicos","Papel","Español","INFORMACIÓN PÚBLICA CLASIFICADA"," Archivo de gestión (físico)","SI","Ley 1712 de 2014","Parte de la información técnica es considerada secreto comercial","Reserva parcial","2019-12-05","Vigencia de la autorización, permiso, concesión o registro más cinco (5) años.","Dato semiprivado","a. Permitir el desarrollo del objeto del Ministerio/Fondo TIC, en los términos de los artículos 1o y 2o del Decreto 1414 de 2017."]
["211.1-217","INFORMACIÓN","GRUPO INTERNO DE TRABAJO DE GESTIÓN DE ESPECTRO RADIOÉLECTRICO","Asignación directa de espectro radioeléctrico","Documentación digital relativa a los trámites mediante los cuales se asigna espectro radioeléctrico de manera directa","GRUPO INTERNO DE TRABAJO DE GESTIÓN DE ESPECTRO RADIOÉLECTRICO","2018-11-28","GRUPO INTERNO DE TRABAJO DE GESTIÓN DE ESPECTRO RADIOÉLECTRICO","2019-01-02","MISIONAL","ACCESO_USO_APROPIACION_TIC","GESTION DE LA INDUSTRIA DE LAS COMUNICACIONES","Ley 1341 de 2009 y normas que lo modifican, complementan o reglamentan","Interno","Digital","Sistemas de Información corporativos","Base de datos","Español","INFORMACIÓN PÚBLICA CLASIFICADA","BDU+, ALFANET, ZAFFIRO, ICS MANAGER","SI","Ley 1712 de 2014","Parte de la información técnica es considerada secreto comercial","Reserva parcial","2019-12-05","Vigencia de la autorización, permiso, concesión o registro más cinco (5) años.","Dato semiprivado","a. Permitir el desarrollo del objeto del Ministerio/Fondo TIC, en los términos de los artículos 1o y 2o del Decreto 1414 de 2017."]
["211.1-218","INFORMACIÓN","GRUPO INTERNO DE TRABAJO DE GESTIÓN DE ESPECTRO RADIOÉLECTRICO","Procesos de selección objetiva para asignaciónd e espectro radioeléctrico","Datos de usuarios (persona natural o jurídica), expedientes, redes, areas de servicio, informacion tecnica de equipos y antenas (fabricante, modelo, banda de operación, ancho de banda, ancho de haz, polarizacion, potencia de Tx, denominacion de emision, ganancia), azimut, altura torres, informacion de emplazamientos (direccion, coordenadas, nombre, altura sobre el nivel del mar), tipo de servicio, clase de estacion, categoria de estacion, naturaleza de servicio, canales de frecuencia, ocupacion de canal, liquidaciones, correspondencia.","GRUPO INTERNO DE TRABAJO DE GESTIÓN DE ESPECTRO RADIOÉLECTRICO","2018-11-28","GRUPO INTERNO DE TRABAJO DE GESTIÓN DE ESPECTRO RADIOÉLECTRICO","2019-01-02","MISIONAL","ACCESO_USO_APROPIACION_TIC","GESTION DE LA INDUSTRIA DE LAS COMUNICACIONES","Ley 1341 de 2009 y normas que lo modifican, complementan o reglamentan","Interno","Físico","Documentos de Archivo - físicos","Papel","Español","INFORMACIÓN PÚBLICA CLASIFICADA"," Archivo de gestión (físico)","SI","Ley 1712 de 2014","Parte de la información técnica es considerada secreto comercial","Reserva parcial","2019-12-05","Vigencia de la autorización, permiso, concesión o registro más cinco (5) años.","Dato semiprivado","a. Permitir el desarrollo del objeto del Ministerio/Fondo TIC, en los términos de los artículos 1o y 2o del Decreto 1414 de 2017."]
["211.1-219","INFORMACIÓN","GRUPO INTERNO DE TRABAJO DE GESTIÓN DE ESPECTRO RADIOÉLECTRICO","Procesos de selección objetiva para asignaciónd e espectro radioeléctrico","Datos de usuarios (persona natural o jurídica), expedientes, redes, areas de servicio, informacion tecnica de equipos y antenas (fabricante, modelo, banda de operación, ancho de banda, ancho de haz, polarizacion, potencia de Tx, denominacion de emision, ganancia), azimut, altura torres, informacion de emplazamientos (direccion, coordenadas, nombre, altura sobre el nivel del mar), tipo de servicio, clase de estacion, categoria de estacion, naturaleza de servicio, canales de frecuencia, ocupacion de canal, liquidaciones, correspondencia.","GRUPO INTERNO DE TRABAJO DE GESTIÓN DE ESPECTRO RADIOÉLECTRICO","2018-11-28","GRUPO INTERNO DE TRABAJO DE GESTIÓN DE ESPECTRO RADIOÉLECTRICO","2019-01-02","MISIONAL","ACCESO_USO_APROPIACION_TIC","GESTION DE LA INDUSTRIA DE LAS COMUNICACIONES","Ley 1341 de 2009 y normas que lo modifican, complementan o reglamentan","Interno","Digital","Sistemas de Información corporativos","Base de datos","Español","INFORMACIÓN PÚBLICA CLASIFICADA","BDU+, ALFANET, ZAFFIRO, ICS MANAGER, AURAPORTAL","SI","Ley 1712 de 2014","Parte de la información técnica es considerada secreto comercial","Reserva parcial","2019-12-05","Vigencia de la autorización, permiso, concesión o registro más cinco (5) años.","Dato semiprivado","a. Permitir el desarrollo del objeto del Ministerio/Fondo TIC, en los términos de los artículos 1o y 2o del Decreto 1414 de 2017."]
["211.1-220","INFORMACIÓN","GRUPO INTERNO DE TRABAJO DE GESTIÓN DE ESPECTRO RADIOÉLECTRICO","Registro de radioaficionados y radios itinerantes","Documentación relativa a los trámites de licencias para radioaficionado y registro de radios itinerantes","GRUPO INTERNO DE TRABAJO DE GESTIÓN DE ESPECTRO RADIOÉLECTRICO","2018-11-28","GRUPO INTERNO DE TRABAJO DE GESTIÓN DE ESPECTRO RADIOÉLECTRICO","2019-01-02","MISIONAL","ACCESO_USO_APROPIACION_TIC","GESTION DE LA INDUSTRIA DE LAS COMUNICACIONES","Ley 1341 de 2009 y normas que lo modifican, complementan o reglamentan","Interno","Digital","Sistemas de Información corporativos","Base de datos","Español","INFORMACIÓN PÚBLICA CLASIFICADA","AURAPORTAL, ALFANET","SI","Ley 1712 de 2014","El usuario puede proporcionar dirección de residencia, foto","Reserva parcial","2019-12-05","Vigencia de la autorización, permiso, concesión o registro más cinco (5) años.","Dato semiprivado","a. Permitir el desarrollo del objeto del Ministerio/Fondo TIC, en los términos de los artículos 1o y 2o del Decreto 1414 de 2017."]
["211.1-221","INFORMACIÓN","GRUPO INTERNO DE TRABAJO DE GESTIÓN DE ESPECTRO RADIOÉLECTRICO","Registro de asociaciones de radioaficionados y de banda ciudadana","Documentación relativa a los trámites de licencias para asociaciones radioaficionados y banda ciudadana","GRUPO INTERNO DE TRABAJO DE GESTIÓN DE ESPECTRO RADIOÉLECTRICO","2018-11-28","GRUPO INTERNO DE TRABAJO DE GESTIÓN DE ESPECTRO RADIOÉLECTRICO","2019-01-02","MISIONAL","ACCESO_USO_APROPIACION_TIC","GESTION DE LA INDUSTRIA DE LAS COMUNICACIONES","Ley 1341 de 2009 y normas que lo modifican, complementan o reglamentan","Interno","Físico","Documentos de Archivo - físicos","Papel","Español","INFORMACIÓN PÚBLICA CLASIFICADA","BDU+, ALFANET, ZAFFIRO, ICS MANAGER, AURAPORTAL","SI","Ley 1712 de 2014","Las frecuencias de operación no se dan a conocer al público para evitar que les sean interferidas","Reserva parcial","2019-12-05","Vigencia de la autorización, permiso, concesión o registro más cinco (5) años.","Dato semiprivado","a. Permitir el desarrollo del objeto del Ministerio/Fondo TIC, en los términos de los artículos 1o y 2o del Decreto 1414 de 2017."]
["211.1-222","INFORMACIÓN","GRUPO INTERNO DE TRABAJO DE GESTIÓN DE ESPECTRO RADIOÉLECTRICO","Registro de proveedores de capacidad satelital","Documentación relativa al trámite del registro como proveedor de capacidad satelital","GRUPO INTERNO DE TRABAJO DE GESTIÓN DE ESPECTRO RADIOÉLECTRICO","2018-11-28","GRUPO INTERNO DE TRABAJO DE GESTIÓN DE ESPECTRO RADIOÉLECTRICO","2019-01-02","MISIONAL","ACCESO_USO_APROPIACION_TIC","GESTION DE LA INDUSTRIA DE LAS COMUNICACIONES","Ley 1341 de 2009 y normas que lo modifican, complementan o reglamentan","Interno","Físico","Documentos de Archivo - físicos","Papel","Español","INFORMACIÓN PÚBLICA CLASIFICADA"," Archivo de gestión (físico)","SI","Ley 1712 de 2014","Parte de la información técnica es considerada secreto comercial","Reserva parcial","2019-12-05","Vigencia de la autorización, permiso, concesión o registro más cinco (5) años.","Dato semiprivado","a. Permitir el desarrollo del objeto del Ministerio/Fondo TIC, en los términos de los artículos 1o y 2o del Decreto 1414 de 2017."]
["211.1-223","INFORMACIÓN","GRUPO INTERNO DE TRABAJO DE GESTIÓN DE ESPECTRO RADIOÉLECTRICO","Registro de proveedores de capacidad satelital","Documentación relativa al trámite del registro como proveedor de capacidad satelital","GRUPO INTERNO DE TRABAJO DE GESTIÓN DE ESPECTRO RADIOÉLECTRICO","2018-11-28","GRUPO INTERNO DE TRABAJO DE GESTIÓN DE ESPECTRO RADIOÉLECTRICO","2019-01-02","MISIONAL","ACCESO_USO_APROPIACION_TIC","GESTION DE LA INDUSTRIA DE LAS COMUNICACIONES","Ley 1341 de 2009 y normas que lo modifican, complementan o reglamentan","Interno","Digital","Sistemas de Información corporativos","Base de datos","Español","INFORMACIÓN PÚBLICA CLASIFICADA","BDU+, ALFANET, ZAFFIRO, ICS MANAGER, AURAPORTAL","SI","Ley 1712 de 2014","Parte de la información técnica es considerada secreto comercial","Reserva parcial","2019-12-05","Vigencia de la autorización, permiso, concesión o registro más cinco (5) años.","Dato semiprivado","a. Permitir el desarrollo del objeto del Ministerio/Fondo TIC, en los términos de los artículos 1o y 2o del Decreto 1414 de 2017."]
["211.2-224","INFORMACIÓN","GRUPO INTERNO DE TRABAJO DE APOYO A LA GESTIÓN DE COBRO COACTIVO Y GARANTIAS","Informes de gestión.","Documentación relativa a los informes de gestión del grupo interno de trabajo","GRUPO INTERNO DE TRABAJO DE APOYO A LA GESTIÓN DE COBRO COACTIVO Y GARANTIAS","2018-11-28","GRUPO INTERNO DE TRABAJO DE APOYO A LA GESTIÓN DE COBRO COACTIVO Y GARANTIAS","2019-01-02","MISIONAL","ACCESO_USO_APROPIACION_TIC","GESTION DE LA INDUSTRIA DE LAS COMUNICACIONES","Ley 1341 de 2009 y normas que lo modifican, complementan o reglamentan","Interno","Físico","Documentos de Archivo - físicos","Papel","Español","INFORMACIÓN PÚBLICA"," Archivo de gestión (físico)","N/A","N/A","N/A","N/A","N/A","N/A","N/A","a. Permitir el desarrollo del objeto del Ministerio/Fondo TIC, en los términos de los artículos 1o y 2o del Decreto 1414 de 2017."]
["211.2-225","INFORMACIÓN","GRUPO INTERNO DE TRABAJO DE APOYO A LA GESTIÓN DE COBRO COACTIVO Y GARANTIAS","PQRSD","Documentación relativa a los PQRSD de garantías presentadas por los Proveedores de Redes y Servcios de Telecomunicaciones ante la Subdirección","GRUPO INTERNO DE TRABAJO DE APOYO A LA GESTIÓN DE COBRO COACTIVO Y GARANTIAS","2018-11-28","GRUPO INTERNO DE TRABAJO DE APOYO A LA GESTIÓN DE COBRO COACTIVO Y GARANTIAS","2019-01-02","MISIONAL","ACCESO_USO_APROPIACION_TIC","GESTION DE LA INDUSTRIA DE LAS COMUNICACIONES","Ley 1341 de 2009 y normas que lo modifican, complementan o reglamentan","Interno","Físico","Documentos de Archivo - físicos","Papel","Español","INFORMACIÓN PÚBLICA","ARCHIVO DE LA ENTIDAD","N/A","N/A","N/A","N/A","N/A","N/A","Dato personal privado ","f. Atender y resolver peticiones, quejas, reclamos y sugerencias."]
["211.2-226","INFORMACIÓN","GRUPO INTERNO DE TRABAJO DE APOYO A LA GESTIÓN DE COBRO COACTIVO Y GARANTIAS","Proyectos normativos en garantías","Documentación relativa a la preparación de normatividad relativa a las garantías que presentan los Proveedores de Redes y Servicios de Telecomunicaicones a la Subdirección","GRUPO INTERNO DE TRABAJO DE APOYO A LA GESTIÓN DE COBRO COACTIVO Y GARANTIAS","2018-11-28","GRUPO INTERNO DE TRABAJO DE APOYO A LA GESTIÓN DE COBRO COACTIVO Y GARANTIAS","2019-01-02","MISIONAL","ACCESO_USO_APROPIACION_TIC","GESTION DE LA INDUSTRIA DE LAS COMUNICACIONES","Ley 1341 de 2009 y normas que lo modifican, complementan o reglamentan","Interno","Físico","Documentos de Archivo - físicos","Papel","Español","INFORMACIÓN PÚBLICA"," Archivo de gestión (físico)","N/A","N/A","N/A","N/A","N/A","N/A","N/A","a. Permitir el desarrollo del objeto del Ministerio/Fondo TIC, en los términos de los artículos 1o y 2o del Decreto 1414 de 2017."]
["211.2-227","INFORMACIÓN","GRUPO INTERNO DE TRABAJO DE APOYO A LA GESTIÓN DE COBRO COACTIVO Y GARANTIAS","Registros de la gestión de garantías y cobro coactivo","Documentación del trámite de presentación y aprobación de garantías  prsentadas por los proveedores de redes y servicios de telecomunicaciones y de conformación de títulos complejos para cobro coactivo relacionado con las obligaciones pecuniarias de los proveedores de redes y servicios de telecomunicaciones.","GRUPO INTERNO DE TRABAJO DE APOYO A LA GESTIÓN DE COBRO COACTIVO Y GARANTIAS","2018-11-28","GRUPO INTERNO DE TRABAJO DE APOYO A LA GESTIÓN DE COBRO COACTIVO Y GARANTIAS","2019-01-02","MISIONAL","ACCESO_USO_APROPIACION_TIC","GESTION DE LA INDUSTRIA DE LAS COMUNICACIONES","Ley 1341 de 2009 y normas que lo modifican, complementan o reglamentan","Interno","Físico","Documentos de Archivo - físicos","Papel","Español","INFORMACIÓN PÚBLICA"," Archivo de gestión (físico)","N/A","N/A","N/A","N/A","N/A","N/A","N/A","a. Permitir el desarrollo del objeto del Ministerio/Fondo TIC, en los términos de los artículos 1o y 2o del Decreto 1414 de 2017."]
["211.2-228","INFORMACIÓN","GRUPO INTERNO DE TRABAJO DE APOYO A LA GESTIÓN DE COBRO COACTIVO Y GARANTIAS","Registros de la gestión de garantías y cobro coactivo","Documentación del trámite de presentación y aprobación de garantías  prsentadas por los proveedores de redes y servicios de telecomunicaciones y de conformación de títulos complejos para cobro coactivo relacionado con las obligaciones pecuniarias de los proveedores de redes y servicios de telecomunicaciones.","GRUPO INTERNO DE TRABAJO DE APOYO A LA GESTIÓN DE COBRO COACTIVO Y GARANTIAS","2018-11-28","GRUPO INTERNO DE TRABAJO DE APOYO A LA GESTIÓN DE COBRO COACTIVO Y GARANTIAS","2019-01-02","MISIONAL","ACCESO_USO_APROPIACION_TIC","GESTION DE LA INDUSTRIA DE LAS COMUNICACIONES","Ley 1341 de 2009 y normas que lo modifican, complementan o reglamentan","Interno","Digital","Sistemas de Información corporativos","Base de datos","Español","INFORMACIÓN PÚBLICA","BDU+ (módulo garantías), ALFANET.","N/A","N/A","N/A","N/A","N/A","N/A","N/A","a. Permitir el desarrollo del objeto del Ministerio/Fondo TIC, en los términos de los artículos 1o y 2o del Decreto 1414 de 2017."]
["212-229","INFORMACIÓN","SUBDIRECCIÓN DE RADIO DIFUSIÓN SONORA","Acta del comité consultivo de radio comunitaria","Documentos soporte de la realización de los comités consultivos de radio comunitaria","SUBDIRECCIÓN DE RADIO DIFUSIÓN SONORA","2018-11-28","GRUPO INTERNO DE TRABAJO DE FORTALECIMIENTO DE LAS RELACIONES CON LOS GRUPOS DE INTERES","2019-01-02","MISIONAL","ACCESO_USO_APROPIACION_TIC","GESTION DE LA INDUSTRIA DE LAS COMUNICACIONES","Resolución 53 de 2015","Externo","Físico","Archivos Institucionales - físicos","Papel","Español","INFORMACIÓN PÚBLICA CLASIFICADA","Archivo Mintic","SI","Ley 1712 de 2014 artículo 18","Ley 1341 de 2009 modificada por la Ley 1978 de 2019,  Resolución 415 de 2010, la Resolución 2235 de 2008 modificada por la Resolución 53 de 2015","Reserva total","2009-07-30","No aplica","Dato personal privado ","a. Permitir el desarrollo del objeto del Ministerio/Fondo TIC, en los términos de los artículos 1o y 2o del Decreto 1414 de 2017."]
["212-230","INFORMACIÓN","SUBDIRECCIÓN DE RADIO DIFUSIÓN SONORA","Expedientes de emisoras de interés público","Documentación de expedientes de emisoras de interés público","SUBDIRECCIÓN DE RADIO DIFUSIÓN SONORA","2018-11-28","GRUPO INTERNO DE TRABAJO DE FORTALECIMIENTO DE LAS RELACIONES CON LOS GRUPOS DE INTERES","2019-01-02","MISIONAL","ACCESO_USO_APROPIACION_TIC","GESTION DE LA INDUSTRIA DE LAS COMUNICACIONES","Ley 1341 de 2010 modificada por la Ley 1978 de 2019","Externo","Físico","Archivos Institucionales - físicos","Papel","Español","INFORMACIÓN PÚBLICA CLASIFICADA","Zaffiro","SI","Ley 1712 de 2014 artículo 18","Ley 1341 de 2009 modificada por la Ley 1978 de 2019,  Resolución 415 de 2010","Reserva total","2009-07-30","No aplica","Dato personal privado ","a. Permitir el desarrollo del objeto del Ministerio/Fondo TIC, en los términos de los artículos 1o y 2o del Decreto 1414 de 2017."]
["212-231","INFORMACIÓN","SUBDIRECCIÓN DE RADIO DIFUSIÓN SONORA","Expedientes de emisoras comerciales","Documentación de expedientes de emisoras comerciales","SUBDIRECCIÓN DE RADIO DIFUSIÓN SONORA","2018-11-28","GRUPO INTERNO DE TRABAJO DE FORTALECIMIENTO DE LAS RELACIONES CON LOS GRUPOS DE INTERES","2019-01-02","MISIONAL","ACCESO_USO_APROPIACION_TIC","GESTION DE LA INDUSTRIA DE LAS COMUNICACIONES","Ley 1341 de 2010 modificada por la Ley 1978 de 2019, Resolución 415 de 2010","Externo","Físico","Archivos Institucionales - físicos","Papel","Español","INFORMACIÓN PÚBLICA CLASIFICADA","Zaffiro","SI","Ley 1712 de 2014 artículo 18","Ley 1341 de 2009 modificada por la Ley 1978 de 2019,  Resolución 415 de 2010","Reserva total","2009-07-30","No aplica","Dato personal privado ","a. Permitir el desarrollo del objeto del Ministerio/Fondo TIC, en los términos de los artículos 1o y 2o del Decreto 1414 de 2017."]
["212-232","INFORMACIÓN","SUBDIRECCIÓN DE RADIO DIFUSIÓN SONORA","Expedientes de emisoras comunitarias","Documentación de expedientes de emisoras comunitarias","SUBDIRECCIÓN DE RADIO DIFUSIÓN SONORA","2018-11-28","GRUPO INTERNO DE TRABAJO DE FORTALECIMIENTO DE LAS RELACIONES CON LOS GRUPOS DE INTERES","2019-01-02","MISIONAL","ACCESO_USO_APROPIACION_TIC","GESTION DE LA INDUSTRIA DE LAS COMUNICACIONES","Ley 1341 de 2010 modificada por la Ley 1978 de 2019, Resolución 415 de 2010","Externo","Físico","Archivos Institucionales - físicos","Papel","Español","INFORMACIÓN PÚBLICA CLASIFICADA","Zaffiro","SI","Ley 1712 de 2014 artículo 18","Ley 1341 de 2009 modificada por la Ley 1978 de 2019,  Resolución 415 de 2010","Reserva total","2009-07-30","No aplica","Dato personal privado ","a. Permitir el desarrollo del objeto del Ministerio/Fondo TIC, en los términos de los artículos 1o y 2o del Decreto 1414 de 2017."]
["212-233","INFORMACIÓN","SUBDIRECCIÓN DE RADIO DIFUSIÓN SONORA","Expedientes de cadenas radiales","Documentación de expedientes de cadenas radiales","SUBDIRECCIÓN DE RADIO DIFUSIÓN SONORA","2018-11-28","GRUPO INTERNO DE TRABAJO DE FORTALECIMIENTO DE LAS RELACIONES CON LOS GRUPOS DE INTERES","2019-01-02","MISIONAL","ACCESO_USO_APROPIACION_TIC","GESTION DE LA INDUSTRIA DE LAS COMUNICACIONES","Ley 1341 de 2010 modificada por la Ley 1978 de 2019, Resolución 415 de 2010","Externo","Físico","Archivos Institucionales - físicos","Papel","Español","INFORMACIÓN PÚBLICA CLASIFICADA","Archivo Mintic","SI","Ley 1712 de 2014 artículo 18","Ley 1341 de 2009 modificada por la Ley 1978 de 2019,  Resolución 415 de 2010","Reserva total","2009-07-30","No aplica","Dato personal privado ","a. Permitir el desarrollo del objeto del Ministerio/Fondo TIC, en los términos de los artículos 1o y 2o del Decreto 1414 de 2017."]
["212-234","INFORMACIÓN","SUBDIRECCIÓN DE RADIO DIFUSIÓN SONORA","PQRS por año","Expedientes físicos de Peticiones, quejas, reclamos, sugerencias y denunicas relacionadas con el servicio de radiodifusión sonora","SUBDIRECCIÓN DE RADIO DIFUSIÓN SONORA","2018-11-28","GRUPO INTERNO DE TRABAJO DE FORTALECIMIENTO DE LAS RELACIONES CON LOS GRUPOS DE INTERES","2019-01-02","MISIONAL","ACCESO_USO_APROPIACION_TIC","GESTION DE LA INDUSTRIA DE LAS COMUNICACIONES","Ley 1341 de 2010 modificada por la Ley 1978 de 2019, Resolución 415 de 2010","Externo","Físico","Archivos Institucionales - físicos","Papel","Español","INFORMACIÓN PÚBLICA","ARCHIVO DE LA ENTIDAD","N/A","N/A","N/A","N/A","N/A","N/A","Dato personal privado ","f)         Atender y resolver peticiones, quejas, reclamos y sugerencias."]
["212-235","INFORMACIÓN","SUBDIRECCIÓN DE RADIO DIFUSIÓN SONORA","Estudios de radiodifusión sonora","Información de estudios relacionados con el servicio de radiodifusión sonora","SUBDIRECCIÓN DE RADIO DIFUSIÓN SONORA","2018-11-28","GRUPO INTERNO DE TRABAJO DE FORTALECIMIENTO DE LAS RELACIONES CON LOS GRUPOS DE INTERES","2019-01-02","MISIONAL","ACCESO_USO_APROPIACION_TIC","GESTION DE LA INDUSTRIA DE LAS COMUNICACIONES","Ley 1341 de 2010 modificada por la Ley 1978 de 2019, Resolución 415 de 2010","Externo","Físico","Archivos Institucionales - físicos","Papel","Español","INFORMACIÓN PÚBLICA CLASIFICADA","Archivo Mintic","SI","Ley 1712 de 2014 artículo 18","Ley 1341 de 2009 modificada por la Ley 1978 de 2019,  Resolución 415 de 2010","Reserva total","2009-07-30","No aplica","N/A","a. Permitir el desarrollo del objeto del Ministerio/Fondo TIC, en los términos de los artículos 1o y 2o del Decreto 1414 de 2017."]
["212-236","INFORMACIÓN","SUBDIRECCIÓN DE RADIO DIFUSIÓN SONORA","Planes Técnicos nacionales de radiodifusión sonora","Documentación de los planes técnicos de radiodifusión sonora","SUBDIRECCIÓN DE RADIO DIFUSIÓN SONORA","2018-11-28","GRUPO INTERNO DE TRABAJO DE FORTALECIMIENTO DE LAS RELACIONES CON LOS GRUPOS DE INTERES","2019-01-02","MISIONAL","ACCESO_USO_APROPIACION_TIC","GESTION DE LA INDUSTRIA DE LAS COMUNICACIONES","Ley 1341 de 2010 modificada por la Ley 1978 de 2019, Resolución 415 de 2010","Externo","Físico","Archivos Institucionales - físicos","Papel","Español","INFORMACIÓN PÚBLICA CLASIFICADA","Archivo Mintic","SI","Ley 1712 de 2014 artículo 18","Ley 1341 de 2009 modificada por la Ley 1978 de 2019,  Resolución 415 de 2010","Reserva total","2009-07-30","No aplica","N/A","a. Permitir el desarrollo del objeto del Ministerio/Fondo TIC, en los términos de los artículos 1o y 2o del Decreto 1414 de 2017."]
["212-237","INFORMACIÓN","SUBDIRECCIÓN DE RADIO DIFUSIÓN SONORA","Politica nacional de radiodifusión Sonora","Documentos relacionados con la Política nacional de radiodifusión sonora","SUBDIRECCIÓN DE RADIO DIFUSIÓN SONORA","2018-11-28","GRUPO INTERNO DE TRABAJO DE FORTALECIMIENTO DE LAS RELACIONES CON LOS GRUPOS DE INTERES","2019-01-02","MISIONAL","ACCESO_USO_APROPIACION_TIC","GESTION DE LA INDUSTRIA DE LAS COMUNICACIONES","Ley 1341 de 2010 modificada por la Ley 1978 de 2019, Resolución 415 de 2010","Externo","Físico","Archivos Institucionales - físicos","Papel","Español","INFORMACIÓN PÚBLICA CLASIFICADA","Archivo Mintic","SI","Ley 1712 de 2014 artículo 18","Ley 1341 de 2009 modificada por la Ley 1978 de 2019,  Resolución 415 de 2010","Reserva total","2009-07-30","No aplica","N/A","a. Permitir el desarrollo del objeto del Ministerio/Fondo TIC, en los términos de los artículos 1o y 2o del Decreto 1414 de 2017."]
["212-238","INFORMACIÓN","SUBDIRECCIÓN DE RADIO DIFUSIÓN SONORA","Procesos de selección objetiva Radiodifisión Sonora","Documentos relacionados con los procesos de selección objetiva de radiodifusión sonora","SUBDIRECCIÓN DE RADIO DIFUSIÓN SONORA","2018-11-28","GRUPO INTERNO DE TRABAJO DE FORTALECIMIENTO DE LAS RELACIONES CON LOS GRUPOS DE INTERES","2019-01-02","MISIONAL","ACCESO_USO_APROPIACION_TIC","GESTION DE LA INDUSTRIA DE LAS COMUNICACIONES","Ley 1341 de 2010 modificada por la Ley 1978 de 2019, Resolución 415 de 2010","Externo","Físico","Archivos Institucionales - físicos","Papel","Español","INFORMACIÓN PÚBLICA CLASIFICADA","Archivo Mintic","SI","Ley 1712 de 2014 artículo 18","Ley 1341 de 2009 modificada por la Ley 1978 de 2019,  Resolución 415 de 2010","Reserva total","2009-07-30","No aplica","Dato personal privado ","a. Permitir el desarrollo del objeto del Ministerio/Fondo TIC, en los términos de los artículos 1o y 2o del Decreto 1414 de 2017."]
["213-239","INFORMACIÓN","SUBDIRECCIÓN DE ASUNTOS POSTALES","INFORMES","TIENEN INFORMACIÓN DETALLADA Y OFICIAL SOBRE EL EJERCICIO DE LAS FUNCIONES DE LA DEPENDENCIA ","SUBDIRECCIÓN DE ASUNTOS POSTALES","2018-11-28","DIRECCIÓN DE INDUSTRIA DE COMUNICACIONES","2019-01-02","MISIONAL","SEGUIMIENTO_CONTROL_POLITICAS_TIC","COMUNICACION ESTRATEGICA",null,"Interno","Digital","Archivos Institucionales - electrónico","PDF","Español","NO CLASIFICADA","N/A","N/A","N/A","N/A","N/A","N/A","N/A","Dato personal público","N/A"]
["213-240","INFORMACIÓN","SUBDIRECCIÓN DE ASUNTOS POSTALES","INSCRIPCIÓN DE OPERADORES EN EL REGISTRO POSTAL","INFORMACION ADMINISTRATIVA REFERENTE A LAS EMPRESAS DE MENSAJERIA Y POSTALES DE PAGO ","SUBDIRECCIÓN DE ASUNTOS POSTALES","2018-11-28","DIRECCIÓN DE INDUSTRIA DE COMUNICACIONES","2019-01-02","MISIONAL","GESTION_ATENCION_GRUPOS_INTERES","GESTION DE ATENCION A GRUPOS DE INTERES","LEY 1712 DE 2014","Interno","Digital","Archivos Institucionales - electrónico","XML","Español","INFORMACIÓN PÚBLICA","N/A","N/A","N/A","N/A","N/A","N/A","N/A","N/A","N/A"]
["213-241","INFORMACIÓN","SUBDIRECCIÓN DE ASUNTOS POSTALES","INVENTARIOS DEL MUSEO DE TECNOLOGIAS DE LA INFORMACIÓN Y LAS COMUNICACIONES","INVENTARIOS DEL MUSEO DE TECNOLOGIAS DE LA INFORMACIÓN Y LAS COMUNICACIONES","SUBDIRECCIÓN DE ASUNTOS POSTALES","2018-11-28","SUBDIRECCIÓN DE ASUNTOS POSTALES","2019-01-02","MISIONAL","ACCESO_USO_APROPIACION_TIC","GESTION DE LA INDUSTRIA DE LAS COMUNICACIONES",null,null,null,null,null,"Español","INFORMACIÓN PÚBLICA","N/A","N/A","N/A","N/A","N/A","N/A","N/A","N/A","a. Permitir el desarrollo del objeto del Ministerio/Fondo TIC, en los términos de los artículos 1o y 2o del Decreto 1414 de 2017."]
["213-242","INFORMACIÓN","SUBDIRECCIÓN DE ASUNTOS POSTALES","POLITICA DE SERVICIOS POSTALES","ES LA NORMATIVIDAD APLICABLE PARA EL SECTOR POSTAL EN LA REPUBLICA DE COLOMBIA","SUBDIRECCIÓN DE ASUNTOS POSTALES","2018-11-28","DIRECCIÓN DE INDUSTRIA DE COMUNICACIONES","2019-01-02","MISIONAL","PLANEACION_FORMULACION_POLITICAS_TIC","PLANEACION Y FORMULACION DE POLITICAS TIC","LEY 1369 DE 2009 Y LEY 1712 DE 2014","Interno","Digital","Archivos Institucionales - electrónico","PDF","Español","INFORMACIÓN PÚBLICA","http://www.mintic.gov.co/portal/604/w3-propertyvalue-1523.html","N/A","N/A","N/A","N/A","N/A","N/A","N/A","N/A"]
["213-243","INFORMACIÓN","SUBDIRECCIÓN DE ASUNTOS POSTALES","RESOLUCIONES DE A HABILITACION DE LOS OPERADORES POSTALES","ACTOS ADMINISTRATIVOS DE OTORGAMIENTO, PRORROGA, TERMINACIONES, AUTO DE ARCHIVO ENTRE OTROS","SUBDIRECCIÓN DE ASUNTOS POSTALES","2018-11-28","DIRECCIÓN DE INDUSTRIA DE COMUNICACIONES","2019-01-02","MISIONAL","ACCESO_USO_APROPIACION_TIC","FORTALECIMIENTO DE LA INDUSTRIA TIC","LEY 1712 DE 2014","Interno","Físico","Archivos Institucionales - físicos","Papel","Español","INFORMACIÓN PÚBLICA RESERVADA","DISPONIBLE (SE ENCUENTRA EN EL SISTEMA DE INFORMACION BDU)","SI","LEY 1712 DE 2014","Art 18 literal c. Art 19 literales  a y b Los formatos actualmente tienen tanto información jurídica, administrativa y técnica, en concordancia con el art 31  parrafo 2do del Decreto 103 de 2015 se ensombrece la información reservada de los mismos.","Reserva parcial","2016-12-30","15 AÑOS","Dato personal público","N/A"]
["213-244","INFORMACIÓN","SUBDIRECCIÓN DE ASUNTOS POSTALES","SOLICITUDES DE EMISIONES FILATELICAS","SOLICITUD DE EMISIONES FILATELICAS QUE SON APROBADAS POR LA SEÑORA MINISTRA","SUBDIRECCIÓN DE ASUNTOS POSTALES","2018-11-28","DIRECCIÓN DE INDUSTRIA DE COMUNICACIONES","2019-01-02","MISIONAL","GESTION_ATENCION_GRUPOS_INTERES","GESTION DE ATENCION A GRUPOS DE INTERES","DECRETO 1414","Interno","Físico","Documentos de Archivo - físicos","Papel","Español","INFORMACIÓN PÚBLICA","N/A","N/A","N/A","N/A","N/A","N/A","N/A","N/A","N/A"]
["220-245","INFORMACIÓN","DIRECCIÓN DE VIGILANCIA Y CONTROL","INFORMES DE GESTIÓN","Los informes de gestión tienen información oficial y detallada sobre el ejercicio de las funciones de las dependencias y de la entidad misma.","DIRECCIÓN DE VIGILANCIA Y CONTROL","2018-11-28","DIRECCIÓN DE VIGILANCIA Y CONTROL","2019-01-02","MISIONAL","SEGUIMIENTO_CONTROL_POLITICAS_TIC","VIGILANCIA Y CONTROL","DECRETO 1414","Interno","Físico","Documentos de Archivo - físicos","Papel","Español","INFORMACIÓN PÚBLICA","ARCHIVO","N/A","N/A","N/A","N/A","N/A","N/A","N/A","a. Permitir el desarrollo del objeto del Ministerio/Fondo TIC, en los términos de los artículos 1o y 2o del Decreto 1414 de 2017."]
["220-246","INFORMACIÓN","DIRECCIÓN DE VIGILANCIA Y CONTROL","INFORMES DE PRESUNTO INCUMPLIMIENTO  ","Quejas o denuncias de operadores, informes, actas de visita y de decomiso a los vigilados.","DIRECCIÓN DE VIGILANCIA Y CONTROL","2018-11-28","DIRECCIÓN DE VIGILANCIA Y CONTROL","2019-01-02","MISIONAL","SEGUIMIENTO_CONTROL_POLITICAS_TIC","VIGILANCIA Y CONTROL","DECRETO 1414","Interno","Físico","Documentos de Archivo - físicos","Papel","Español","INFORMACIÓN PÚBLICA","ARCHIVO","N/A","N/A","N/A","N/A","N/A","N/A","N/A","a. Permitir el desarrollo del objeto del Ministerio/Fondo TIC, en los términos de los artículos 1o y 2o del Decreto 1414 de 2017."]
["220-247","INFORMACIÓN","DIRECCIÓN DE VIGILANCIA Y CONTROL","PQRSD","Hace referencia a las Peticiones, Quejas, Reclamos y Sugerencias interpuestas por los ciudadanos","DIRECCIÓN DE VIGILANCIA Y CONTROL","2018-11-28","DIRECCIÓN DE VIGILANCIA Y CONTROL","2019-01-02","MISIONAL","SEGUIMIENTO_CONTROL_POLITICAS_TIC","VIGILANCIA Y CONTROL","Ley 1755 de 2015","Externo","Físico","Documentos de Archivo - físicos","Papel","Español","INFORMACIÓN PÚBLICA","ALFANET","N/A","N/A","N/A","N/A","N/A","N/A","Dato personal privado ","f. Atender y resolver peticiones, quejas, reclamos y sugerencias."]
["220-248","INFORMACIÓN","DIRECCIÓN DE VIGILANCIA Y CONTROL","PROCESOS ADMINISTRATIVOS CONTRA LOS PROVEEDORES","Son los procesos que se adelantan en contra de los vigilados, relacionados con posibles incumplimientos a la normatividad legal vigente.","DIRECCIÓN DE VIGILANCIA Y CONTROL","2018-11-28","DIRECCIÓN DE VIGILANCIA Y CONTROL","2019-01-02","MISIONAL","SEGUIMIENTO_CONTROL_POLITICAS_TIC","VIGILANCIA Y CONTROL","Ley 1341, Decreto 1414 de 2017, Código de Procedimiento Administrativo y de lo Contencioso Administrativo (Ley 1437 de 2011).","Interno","Físico","Documentos de Archivo - físicos","Papel","Español","INFORMACIÓN PÚBLICA","ARCHIVO","N/A","N/A","N/A","N/A","N/A","N/A","N/A","a. Permitir el desarrollo del objeto del Ministerio/Fondo TIC, en los términos de los artículos 1o y 2o del Decreto 1414 de 2017."]
["220-249","INFORMACIÓN","DIRECCIÓN DE VIGILANCIA Y CONTROL","PROGRAMAS DE VIGILANCIA Y CONTROL PREVENTIVOS","Son todos los programas encaminados a evitar el incumplimiento de la normatividad legal vigente en materia de vigilanvia y control como capacitaciones, divulgaciones, acompañamientos, etc.","DIRECCIÓN DE VIGILANCIA Y CONTROL","2018-11-28","DIRECCIÓN DE VIGILANCIA Y CONTROL","2019-01-02","MISIONAL","SEGUIMIENTO_CONTROL_POLITICAS_TIC","VIGILANCIA Y CONTROL","Decreto 1414 de 2017, Resolución 3160 de 2017.","Interno","Físico","Documentos de Archivo - físicos","Papel","Español","INFORMACIÓN PÚBLICA","ARCHIVO","N/A","N/A","N/A","N/A","N/A","N/A","N/A","a. Permitir el desarrollo del objeto del Ministerio/Fondo TIC, en los términos de los artículos 1o y 2o del Decreto 1414 de 2017."]
["221-250","INFORMACIÓN","SUBDIRECCIÓN DE VIGILANCIA Y CONTROL DE COMUNICACIONES","ACTUACIONES DE VIGILANCIA Y CONTROL ","Informes de visitas, requerimientos, comunicaciones internas o externas traslados,  respuestas al Prestador","SUBDIRECCIÓN DE VIGILANCIA Y CONTROL DE COMUNICACIONES","2018-11-28","SUBDIRECCIÓN DE VIGILANCIA Y CONTROL DE COMUNICACIONES","2019-01-02","MISIONAL","SEGUIMIENTO_CONTROL_POLITICAS_TIC","VIGILANCIA Y CONTROL","Decreto 1414 de 2017, Resolución 3160 de 2017.","Interno","Físico","Documentos de Archivo - físicos","Papel","Español","INFORMACIÓN PÚBLICA","ARCHIVO","N/A","N/A","N/A","N/A","N/A","N/A","N/A","a. Permitir el desarrollo del objeto del Ministerio/Fondo TIC, en los términos de los artículos 1o y 2o del Decreto 1414 de 2017."]
["221-251","INFORMACIÓN","SUBDIRECCIÓN DE VIGILANCIA Y CONTROL DE COMUNICACIONES","INFORMES DE GESTIÓN","Los informes de gestión tienen información oficial y detallada sobre el ejercicio de las funciones de la dependencia y de la entidad misma.","SUBDIRECCIÓN DE VIGILANCIA Y CONTROL DE COMUNICACIONES","2018-11-28","SUBDIRECCIÓN DE VIGILANCIA Y CONTROL DE COMUNICACIONES","2019-01-02","MISIONAL","SEGUIMIENTO_CONTROL_POLITICAS_TIC","VIGILANCIA Y CONTROL","Decreto 1414 de 2017, Resolución 3160 de 2017.","Interno","Físico","Documentos de Archivo - físicos","Papel","Español","INFORMACIÓN PÚBLICA","ARCHIVO","N/A","N/A","N/A","N/A","N/A","N/A","N/A","a. Permitir el desarrollo del objeto del Ministerio/Fondo TIC, en los términos de los artículos 1o y 2o del Decreto 1414 de 2017."]
["221-252","INFORMACIÓN","SUBDIRECCIÓN DE VIGILANCIA Y CONTROL DE COMUNICACIONES","PQRSD","Hace referencia a las Peticiones, Quejas, Reclamos, Derechos de petición y Sugerencias interpuestas por la ciudadania.","SUBDIRECCIÓN DE VIGILANCIA Y CONTROL DE COMUNICACIONES","2018-11-28","SUBDIRECCIÓN DE VIGILANCIA Y CONTROL DE COMUNICACIONES","2019-01-02","MISIONAL","SEGUIMIENTO_CONTROL_POLITICAS_TIC","VIGILANCIA Y CONTROL","Ley 1755 de 2015","Externo","Físico","Documentos de Archivo - físicos","Papel","Español","INFORMACIÓN PÚBLICA","ALFANET","N/A","N/A","N/A","N/A","N/A","N/A","Dato personal privado ","f. Atender y resolver peticiones, quejas, reclamos y sugerencias."]
["221-253","INFORMACIÓN","SUBDIRECCIÓN DE VIGILANCIA Y CONTROL DE COMUNICACIONES","PROCESOS ADMINISTRATIVOS SANCIONATORIOS","Corresponde a los procesos que adelantan la SVCC en contra de los Prestadores de Redes y Servicios de Comunicaciones relacionados con posibles incumplimientos a la normatividad legal vigente.","SUBDIRECCIÓN DE VIGILANCIA Y CONTROL DE COMUNICACIONES","2018-11-28","SUBDIRECCIÓN DE VIGILANCIA Y CONTROL DE COMUNICACIONES","2019-01-02","MISIONAL","SEGUIMIENTO_CONTROL_POLITICAS_TIC","VIGILANCIA Y CONTROL","Ley 1341, Ley 1978, Decreto 1414 de 2017, Código de Procedimiento Administrativo y de lo Contencioso Administrativo (Ley 1437 de 2011).","Interno","Físico","Documentos de Archivo - físicos","Papel","Español","INFORMACIÓN PÚBLICA","ARCHIVO","N/A","N/A","N/A","N/A","N/A","N/A","N/A","a. Permitir el desarrollo del objeto del Ministerio/Fondo TIC, en los términos de los artículos 1o y 2o del Decreto 1414 de 2017."]
["221-254","INFORMACIÓN","SUBDIRECCIÓN DE VIGILANCIA Y CONTROL DE COMUNICACIONES","PROGRAMAS PREVENTIVOS DE COMUNICACIONES","Son todos los programas encaminados a evitar el incumplimiento de la normatividad legal vigente en materia de comunicaciones como capacitaciones, divulgación, acompañamientos, etc.","SUBDIRECCIÓN DE VIGILANCIA Y CONTROL DE COMUNICACIONES","2018-11-28","SUBDIRECCIÓN DE VIGILANCIA Y CONTROL DE COMUNICACIONES","2019-01-02","MISIONAL","SEGUIMIENTO_CONTROL_POLITICAS_TIC","SEGUIMIENTO Y EVALUACION DE POLITICAS TIC","Decreto 1414 de 2017, Resolución 3160 de 2017.","Interno","Físico","Documentos de Archivo - físicos","Papel","Español","INFORMACIÓN PÚBLICA","ARCHIVO","N/A","N/A","N/A","N/A","N/A","N/A","N/A","a. Permitir el desarrollo del objeto del Ministerio/Fondo TIC, en los términos de los artículos 1o y 2o del Decreto 1414 de 2017."]
["222-255","INFORMACIÓN","SUBDIRECCIÓN DE VIGILANCIA Y CONTROL DE RADIODIFUSIÓN SONORA","CONCEPTOS DE NO PROCEDIBILIDAD","Son opiniones, apreciaciones o juicios emitidos por la dependencia, con el fin de orientar sobre temas específicos en materia jurídica.  En dicho concepto se explican las razones por las cuales se recomienda no abrir investigación administrativa en contra de un concesionario.","SUBDIRECCIÓN DE VIGILANCIA Y CONTROL DE RADIODIFUSIÓN SONORA","2018-11-28","SUBDIRECCIÓN DE VIGILANCIA Y CONTROL DE RADIODIFUSIÓN SONORA","2019-01-02","MISIONAL","SEGUIMIENTO_CONTROL_POLITICAS_TIC","VIGILANCIA Y CONTROL","Decreto 1414 de 2017, Resolución 3160 de 2017.","Interno","Físico","Documentos de Archivo - físicos","Papel","Español","INFORMACIÓN PÚBLICA","Archivo","N/A","N/A","N/A","N/A","N/A","N/A","N/A","a. Permitir el desarrollo del objeto del Ministerio/Fondo TIC, en los términos de los artículos 1o y 2o del Decreto 1414 de 2017."]
["222-256","INFORMACIÓN","SUBDIRECCIÓN DE VIGILANCIA Y CONTROL DE RADIODIFUSIÓN SONORA","INFORMES DE GESTIÓN","Los informes de gestión tienen información oficial y detallada sobre el ejercicio de las funciones de las dependencias y de la entidad misma.","SUBDIRECCIÓN DE VIGILANCIA Y CONTROL DE RADIODIFUSIÓN SONORA","2018-11-28","SUBDIRECCIÓN DE VIGILANCIA Y CONTROL DE RADIODIFUSIÓN SONORA","2019-01-02","MISIONAL","SEGUIMIENTO_CONTROL_POLITICAS_TIC","VIGILANCIA Y CONTROL","Decreto 1414 de 2017, Resolución 3160 de 2017.","Interno","Físico","Documentos de Archivo - físicos","Papel","Español","INFORMACIÓN PÚBLICA","Archivo","N/A","N/A","N/A","N/A","N/A","N/A","N/A","a. Permitir el desarrollo del objeto del Ministerio/Fondo TIC, en los términos de los artículos 1o y 2o del Decreto 1414 de 2017."]
["222-257","INFORMACIÓN","SUBDIRECCIÓN DE VIGILANCIA Y CONTROL DE RADIODIFUSIÓN SONORA","PQRS","Hace referencia a las Peticiones, Quejas, Reclamos y Sugerencias interpuestas por los ciudadanos",{"$f":"IF(C264=\"\",\"\",C264)","v":"SUBDIRECCIÓN DE VIGILANCIA Y CONTROL DE RADIODIFUSIÓN SONORA"},"2018-11-28","SUBDIRECCIÓN DE VIGILANCIA Y CONTROL DE RADIODIFUSIÓN SONORA","2019-01-02","MISIONAL","SEGUIMIENTO_CONTROL_POLITICAS_TIC","VIGILANCIA Y CONTROL","Ley 1755 de 2015","Externo","Físico","Documentos de Archivo - físicos","Papel","Español","INFORMACIÓN PÚBLICA","ARCHIVO DE LA ENTIDAD","N/A","N/A","N/A","N/A","N/A","N/A","Dato personal privado ","f. Atender y resolver peticiones, quejas, reclamos y sugerencias."]
["222-258","INFORMACIÓN","SUBDIRECCIÓN DE VIGILANCIA Y CONTROL DE RADIODIFUSIÓN SONORA","PROCESOS ADMINISTRATIVOS SANCIONATORIOS","Son los procesos que se adelantan en contra de los concesionarios de radiodifusión sonora relacionados con posibles incumplimientos a la normatividad legal vigente.","SUBDIRECCIÓN DE VIGILANCIA Y CONTROL DE RADIODIFUSIÓN SONORA","2018-11-28","SUBDIRECCIÓN DE VIGILANCIA Y CONTROL DE RADIODIFUSIÓN SONORA","2019-01-02","MISIONAL","SEGUIMIENTO_CONTROL_POLITICAS_TIC","VIGILANCIA Y CONTROL","Ley 1341, Decreto 1414 de 2017, Código de Procedimiento Administrativo y de lo Contencioso Administrativo (Ley 1437 de 2011).","Interno","Físico","Documentos de Archivo - físicos","Papel","Español","INFORMACIÓN PÚBLICA","Archivo","N/A","N/A","N/A","N/A","N/A","N/A","N/A","a. Permitir el desarrollo del objeto del Ministerio/Fondo TIC, en los términos de los artículos 1o y 2o del Decreto 1414 de 2017."]
["222-259","INFORMACIÓN","SUBDIRECCIÓN DE VIGILANCIA Y CONTROL DE RADIODIFUSIÓN SONORA","PROGRAMAS PREVENTIVOS DE RDS","Son todos los programas encaminados a evitar el incumplimiento de la normatividad legal vigente en materia de radiodifusión sonora como capacitaciones, divulgaciones, acompañamientos, etc.","SUBDIRECCIÓN DE VIGILANCIA Y CONTROL DE RADIODIFUSIÓN SONORA","2018-11-28","SUBDIRECCIÓN DE VIGILANCIA Y CONTROL DE RADIODIFUSIÓN SONORA","2019-01-02","MISIONAL","SEGUIMIENTO_CONTROL_POLITICAS_TIC","VIGILANCIA Y CONTROL","Decreto 1414 de 2017, Resolución 3160 de 2017.","Interno","Físico","Documentos de Archivo - físicos","Papel","Español","INFORMACIÓN PÚBLICA","Archivo","N/A","N/A","N/A","N/A","N/A","N/A","N/A","a. Permitir el desarrollo del objeto del Ministerio/Fondo TIC, en los términos de los artículos 1o y 2o del Decreto 1414 de 2017."]
["223-260","INFORMACIÓN","SUBDIRECCIÓN DE VIGILANCIA Y CONTROL DE SERVICIOS POSTALES","CONCEPTOS DE NO PROCEDIBILIDAD","Los conceptos de no Procedibilidad, son opiniones, apreciaciones o juicios emitidos por la dependencia con el fin de orientar sobre temas específicos en materia jurídica. Esta serie documental posee un alto contenido de información oficial que se convertirá en el futuro en valiosa fuente para la investigación histórica, y el control político y ciudadano, por tal motivo debe ser conservado en su totalidad y al terminar los tiempos de retención, ser transferido al archivo histórico de la nación.","SUBDIRECCIÓN DE VIGILANCIA Y CONTROL DE SERVICIOS POSTALES","2018-11-28","SUBDIRECCIÓN DE VIGILANCIA Y CONTROL DE SERVICIOS POSTALES","2019-01-02","MISIONAL","SEGUIMIENTO_CONTROL_POLITICAS_TIC","VIGILANCIA Y CONTROL","Decreto 1414 de 2017, Resolución 3160 de 2017.","Interno","Físico","Documentos de Archivo - físicos","Papel","Español","INFORMACIÓN PÚBLICA","Archivo","N/A","N/A","N/A","N/A","N/A","N/A","N/A","a. Permitir el desarrollo del objeto del Ministerio/Fondo TIC, en los términos de los artículos 1o y 2o del Decreto 1414 de 2017."]
["223-261","INFORMACIÓN","SUBDIRECCIÓN DE VIGILANCIA Y CONTROL DE SERVICIOS POSTALES","INFORMES DE GESTIÓN","Los informes de gestión tienen información oficial y detallada sobre el ejercicio de las funciones de las dependencias y de la entidad misma. Esta información en el futuro será material propicio para ser usado como insumo por parte de investigaciones o ciudadanos. Por tal razón, una vez terminados los tiempos de retención de la agrupación documental, esta podrá ser transferida en su totalidad al archivo histórico de la Nación.","SUBDIRECCIÓN DE VIGILANCIA Y CONTROL DE SERVICIOS POSTALES","2018-11-28","SUBDIRECCIÓN DE VIGILANCIA Y CONTROL DE SERVICIOS POSTALES","2019-01-02","MISIONAL","SEGUIMIENTO_CONTROL_POLITICAS_TIC","VIGILANCIA Y CONTROL","Decreto 1414 de 2017, Resolución 3160 de 2017.","Interno","Físico","Documentos de Archivo - físicos","Papel","Español","INFORMACIÓN PÚBLICA","Archivo","N/A","N/A","N/A","N/A","N/A","N/A","N/A","a. Permitir el desarrollo del objeto del Ministerio/Fondo TIC, en los términos de los artículos 1o y 2o del Decreto 1414 de 2017."]
["223-262","INFORMACIÓN","SUBDIRECCIÓN DE VIGILANCIA Y CONTROL DE SERVICIOS POSTALES","N/A","Teniendo en cuenta el altísimo volumen documental de la serie, y que terminados los tiempos de retención su contenido no es susceptible de considerarse insumo para investigaciones históricas o científicas, además de que ha perdido todos sus valores administrativos. AL terminar los tiempos de retención en el archivo central, la serie se eliminará siguiendo los protocolos establecidos por la entidad para tal fin.","SUBDIRECCIÓN DE VIGILANCIA Y CONTROL DE SERVICIOS POSTALES","2018-11-28","SUBDIRECCIÓN DE VIGILANCIA Y CONTROL DE SERVICIOS POSTALES","2019-01-02","MISIONAL","SEGUIMIENTO_CONTROL_POLITICAS_TIC","VIGILANCIA Y CONTROL","Ley 1755 de 2015","Interno","Físico","Documentos de Archivo - físicos","Papel","Español","INFORMACIÓN PÚBLICA","ARCHIVO DE LA ENTIDAD","N/A","N/A","N/A","N/A","N/A","N/A","Dato personal privado ","f. Atender y resolver peticiones, quejas, reclamos y sugerencias."]
["223-263","INFORMACIÓN","SUBDIRECCIÓN DE VIGILANCIA Y CONTROL DE SERVICIOS POSTALES","PROCESOS ADMINISTRATIVOS SANCIONATORIOS","Los Procesos Administrativos Sancionatorios que se adelanten en el MINTIC, poseen información única con características patrimoniales y potencial investigativo desde distintas disciplinas, razón por la cual se debe conservar en su totalidad y transferir al archivo histórico de la nación al terminar los tiempos de su retención.","SUBDIRECCIÓN DE VIGILANCIA Y CONTROL DE SERVICIOS POSTALES","2018-11-28","SUBDIRECCIÓN DE VIGILANCIA Y CONTROL DE SERVICIOS POSTALES","2019-01-02","MISIONAL","SEGUIMIENTO_CONTROL_POLITICAS_TIC","VIGILANCIA Y CONTROL","Ley 1369 de 2009, Decreto 1414 de 2017, Código de Procedimiento Administrativo y de lo Contencioso Administrativo (Ley 1437 de 2011).","Interno","Físico","Documentos de Archivo - físicos","Papel","Español","INFORMACIÓN PÚBLICA","Archivo","N/A","N/A","N/A","N/A","N/A","N/A","N/A","a. Permitir el desarrollo del objeto del Ministerio/Fondo TIC, en los términos de los artículos 1o y 2o del Decreto 1414 de 2017."]
["223-264","INFORMACIÓN","SUBDIRECCIÓN DE VIGILANCIA Y CONTROL DE SERVICIOS POSTALES","PROGRAMAS PREVENTIVOS DE SERVICIOS POSTALES","Los documentos contenidos en la agrupación documental poseen características propias y únicas de la entidad. Puede ser considerado un insumo adecuado para investigaciones históricas, por tal razón debe conservarse en su totalidad y ser transferido, una vez terminen los tiempos de retención, al archivo histórico de la nación.","SUBDIRECCIÓN DE VIGILANCIA Y CONTROL DE SERVICIOS POSTALES","2018-11-28","SUBDIRECCIÓN DE VIGILANCIA Y CONTROL DE SERVICIOS POSTALES","2019-01-02","MISIONAL","SEGUIMIENTO_CONTROL_POLITICAS_TIC","VIGILANCIA Y CONTROL","Decreto 1414 de 2017, Resolución 3160 de 2017.","Interno","Físico","Documentos de Archivo - físicos","Papel","Español","INFORMACIÓN PÚBLICA","Archivo","N/A","N/A","N/A","N/A","N/A","N/A","N/A","a. Permitir el desarrollo del objeto del Ministerio/Fondo TIC, en los términos de los artículos 1o y 2o del Decreto 1414 de 2017."]
["230-265","INFORMACIÓN","DIRECCIÓN DE INFRAESTUCTURA","Carpeta de Mejora","Contiene informacion de las acciones de mejora, indicadores, pqrs, auditorias de calidad internas y externas, riesgos, controles, control de producto no conforme, satisfaccion del usuario ","DIRECCIÓN DE INFRAESTUCTURA","2018-11-28","OFICINA ASESORA DE PLANEACIÓN Y ESTUDIOS SECTORIALES","2019-11-27","MISIONAL","ACCESO_USO_APROPIACION_TIC","ACCESO A LAS TIC","N/A","N/A","Digital","Archivos Institucionales - electrónico","PDF","Español","INFORMACIÓN PÚBLICA RESERVADA","https://mintic.sharepoint.com/sites/mig","N/A","N/A","N/A","Sin reserva","N/A","N/A","N/A","N/A"]
["230-266","INFORMACIÓN","DIRECCIÓN DE INFRAESTUCTURA","Informes A Entes Externos","Informes para el congreso","DIRECCIÓN DE INFRAESTUCTURA","2018-11-28","DIRECCIÓN DE INFRAESTUCTURA","2019-11-27","MISIONAL","ACCESO_USO_APROPIACION_TIC","ACCESO A LAS TIC","N/A","N/A","Digital","Documentos de Archivo - electrónicos","PDF","Español","INFORMACIÓN PÚBLICA","En instalaciones MINTIC/Dirección de Infraestructura","N/A","N/A","N/A","Sin reserva","N/A","N/A","N/A","N/A"]
["230-267","INFORMACIÓN","DIRECCIÓN DE INFRAESTUCTURA","Modelo Financiero De Licitaciones Públicas ","Los modelos financieros constituyen el marco de referencia respecto de las variables financieras iniciales de cada proyecto. Los modelos elaborados por la entidad gozan de reserva legal, ","DIRECCIÓN DE INFRAESTUCTURA","2018-11-28","DIRECCIÓN DE INFRAESTUCTURA","2019-11-28","MISIONAL","ACCESO_USO_APROPIACION_TIC","ACCESO A LAS TIC","DECRETO 1510 DE 2013\n(Julio 17) ","Externo","Digital","Documentos de Archivo - electrónicos","PDF","Español","INFORMACIÓN PÚBLICA","N/A","N/A","N/A","N/A","N/A","N/A","N/A","N/A","N/A"]
["230-268","INFORMACIÓN","DIRECCIÓN DE INFRAESTUCTURA","Modelo Financiero De Concurso De Méritos","Los modelos financieros constituyen el marco de referencia respecto de las variables financieras iniciales de cada contrato. Los modelos elaborados por la entidad gozan de reserva legal, en primer lugar porque son parámetros financieros no establecidos contractualmente y además porque de su confidencialidad depende la correcta adjudicación de los contratos y la eficacia del negocio financiero.","DIRECCIÓN DE INFRAESTUCTURA","2018-11-28","DIRECCIÓN DE INFRAESTUCTURA","2019-11-28","MISIONAL","ACCESO_USO_APROPIACION_TIC","ACCESO A LAS TIC","DECRETO 1510 DE 2013\n(Julio 17) ","Externo","Digital","Documentos de Archivo - electrónicos","PDF","Español","INFORMACIÓN PÚBLICA RESERVADA","N/A","SI","DECRETO 1510 DE 2013\n(Julio 17) ","decreto 1510","Reserva total","2013-07-17","ILIMITADA","N/A","N/A"]
["230-269","SOFTWARE","DIRECCIÓN DE INFRAESTUCTURA","SISTEMA DE INFORMACIÓN - SAC PUNTOS VIVE DIGITAL","CONSOLIDAR Y MANTENER LA BASE DE DATOS DE BENEFICIARIOS DEL PROYECTO","DIRECCIÓN DE INFRAESTUCTURA","2018-11-28","DIRECCIÓN DE INFRAESTUCTURA","2019-01-02","MISIONAL","ACCESO_USO_APROPIACION_TIC","ACCESO A LAS TIC","Del artículo 18 de la Ley 1712 de 2014","Externo","Digital","Sistemas de Información corporativos","Base de datos","Español","INFORMACIÓN PÚBLICA","N/A","SI","Del artículo 18 de la Ley 1712 de 2014","decreto 1510","Reserva total","2013-07-17","ILIMITADA","N/A","N/A"]
["230-270","INFORMACIÓN","DIRECCIÓN DE INFRAESTUCTURA","BASE DE BENEFICIARIOS DE DIRECCIÓN DE INFRAESTRUCTURA","REGISTRO Y MANTENIMIENTO DE LOS BENEFICIARIOS DE LOS PROYECTOS DE LA DIRECION DE CONECTIVIDAD (KISOSCOS DIGITALES, PUNTOS, ALTA VELOCIDAD, CONEXIONES 1Y2, FIBRA OPTICA, CABLE SUBMARINO, CONEXIONES DE ULTIMA MILLA)","DIRECCIÓN DE INFRAESTUCTURA","2018-11-28","DIRECCIÓN DE INFRAESTUCTURA","2019-01-02","MISIONAL","ACCESO_USO_APROPIACION_TIC","ACCESO A LAS TIC","Del artículo 18 de la Ley 1712 de 2014","Externo","Digital","Sistemas de Trabajo colaborativo","Base de datos","Español","INFORMACIÓN PÚBLICA","N/A","SI","Del artículo 18 de la Ley 1712 de 2014","decreto 1510","Reserva total","2013-07-17","ILIMITADA","N/A","N/A"]
["230-271","INFORMACIÓN","DIRECCIÓN DE INFRAESTUCTURA","BASE DE DATOS DE CONTRATISTAS Y PERSONAL DE PLANTA","ESTADISTICAS Y CONTACTO","DIRECCIÓN DE INFRAESTUCTURA","2018-11-28","DIRECCIÓN DE INFRAESTUCTURA","2019-01-02","MISIONAL","ACCESO_USO_APROPIACION_TIC","ACCESO A LAS TIC","Del artículo 18 de la Ley 1712 de 2014","Externo","Digital","Sistemas de Trabajo colaborativo","Base de datos","Español","INFORMACIÓN PÚBLICA","N/A","SI","Del artículo 18 de la Ley 1712 de 2014","decreto 1510","Reserva total","2013-07-17","ILIMITADA","N/A","N/A"]
["230-272","INFORMACIÓN","DIRECCIÓN DE INFRAESTUCTURA","BASE DE MARCO DE GASTO DE MEDIANO PLAZO","ESTIMAR Y ORGANIZAR EL PRESUPUESTO DE LOS PROXIMOS 4 AÑOS","DIRECCIÓN DE INFRAESTUCTURA","2018-11-28","DIRECCIÓN DE INFRAESTUCTURA","2019-01-02","MISIONAL","ACCESO_USO_APROPIACION_TIC","ACCESO A LAS TIC","N/A","N/A","Digital","Sistemas de Trabajo colaborativo","Base de datos","Español","INFORMACIÓN PÚBLICA","N/A","N/A","N/A","N/A","N/A","N/A","N/A","N/A","N/A"]
["230-273","INFORMACIÓN","DIRECCIÓN DE INFRAESTUCTURA","BASE DE PRESUPUESTO DE LA DIRECCION","CONTROL DE DESEMBOLSOS DESDE 2011 A HOY.\nSEGUIMIENTO DE LOS CONTRATOS VIGENTES Y SUS DESEMBOLSOS\nCONTROL DE EJECUCION, RECURSOS DISPONIBLES, RECURSOS POR COMPROMETER Y LA APROPIACION PRESUPUESTAL VIGENTE.","DIRECCIÓN DE INFRAESTUCTURA","2018-11-28","DIRECCIÓN DE INFRAESTUCTURA","2019-01-02","MISIONAL","ACCESO_USO_APROPIACION_TIC","ACCESO A LAS TIC","N/A","N/A","Digital","Sistemas de Trabajo colaborativo","Base de datos","Español","INFORMACIÓN PÚBLICA","N/A","N/A","N/A","N/A","N/A","N/A","N/A","N/A","N/A"]
["230-274","INFORMACIÓN","DIRECCIÓN DE INFRAESTUCTURA","BASE CONTROL DE TRAMITES PRESUPUESTALES","CONTROL DE APROBACION DE VIGENCIAS FUTURAS Y EL USO DE LAS MISMAS","DIRECCIÓN DE INFRAESTUCTURA","2018-11-28","DIRECCIÓN DE INFRAESTUCTURA","2019-01-02","MISIONAL","ACCESO_USO_APROPIACION_TIC","ACCESO A LAS TIC","N/A","N/A","Digital","Sistemas de Trabajo colaborativo","Base de datos","Español","INFORMACIÓN PÚBLICA","N/A","N/A","N/A","N/A","N/A","N/A","N/A","N/A","N/A"]
["230-275","INFORMACIÓN","DIRECCIÓN DE INFRAESTUCTURA","PRESENTACIÓN DE INDICADORES","CONTROL DE LA ACTUALIZACION DE LOS INDICADORES ","DIRECCIÓN DE INFRAESTUCTURA","2018-11-28","DIRECCIÓN DE INFRAESTUCTURA","2019-01-02","MISIONAL","ACCESO_USO_APROPIACION_TIC","ACCESO A LAS TIC","N/A","N/A","Digital","Sistemas de Trabajo colaborativo","Base de datos","Español","INFORMACIÓN PÚBLICA","N/A","N/A","N/A","N/A","N/A","N/A","N/A","N/A","N/A"]
["230-276","INFORMACIÓN","DIRECCIÓN DE INFRAESTUCTURA","BASE EJECUCION POR INICIATIVA","CONTROL DE EJECUCION POR INICIATIVA","DIRECCIÓN DE INFRAESTUCTURA","2018-11-28","DIRECCIÓN DE INFRAESTUCTURA","2019-01-02","MISIONAL","ACCESO_USO_APROPIACION_TIC","ACCESO A LAS TIC","N/A","N/A","Digital","Sistemas de Trabajo colaborativo","Base de datos","Español","INFORMACIÓN PÚBLICA","N/A","N/A","N/A","N/A","N/A","N/A","N/A","N/A","N/A"]
["230-277","INFORMACIÓN","DIRECCIÓN DE INFRAESTUCTURA","BASE DE LEGALIZACIONES","CONTROL DE LAS LEGALIZACIONES DE TODOS LOS CONTRATOS DE LA DIRECCION DE INFRAESTRUCTURA","DIRECCIÓN DE INFRAESTUCTURA","2018-11-28","DIRECCIÓN DE INFRAESTUCTURA","2019-01-02","MISIONAL","ACCESO_USO_APROPIACION_TIC","ACCESO A LAS TIC","N/A","N/A","Digital","Sistemas de Trabajo colaborativo","Base de datos","Español","INFORMACIÓN PÚBLICA","N/A","N/A","N/A","N/A","N/A","N/A","N/A","N/A","N/A"]
["230-278","INFORMACIÓN","DIRECCIÓN DE INFRAESTUCTURA","BASE DE PQRS","ASIGNACIÓN Y SEGUIMIENTO A LAS PQRS ASOCIADAS A LA DIRECCION DE INFRAESTRUCTURA","DIRECCIÓN DE INFRAESTUCTURA","2018-11-28","DIRECCIÓN DE INFRAESTUCTURA","2019-01-02","MISIONAL","ACCESO_USO_APROPIACION_TIC","ACCESO A LAS TIC","N/A","N/A","Digital","Sistemas de Trabajo colaborativo","Base de datos","Español","INFORMACIÓN PÚBLICA","N/A","N/A","N/A","N/A","N/A","N/A","N/A","N/A","N/A"]
["230-279","SOFTWARE","DIRECCIÓN DE INFRAESTUCTURA","SISTEMA DE INFORMACION CONTRATISTA SKYNET DE COLOMBIA SAS PROYECTO KVD F3","CONTROL Y SEGUIMIENTO DE LAS OBLIGACIONES CONTRACTUALES, SEGUIMIENTO DE INDICADORES Y ENTRGABLES ASOCIADOS AL PROYECTO","DIRECCIÓN DE INFRAESTUCTURA","2018-11-28","DIRECCIÓN DE INFRAESTUCTURA","2019-01-02","MISIONAL","ACCESO_USO_APROPIACION_TIC","ACCESO A LAS TIC","Del artículo 18 de la Ley 1712 de 2014","Externo","Digital","Sistemas de Información corporativos","Base de datos","Español","INFORMACIÓN PÚBLICA","N/A","SI","Del artículo 18 de la Ley 1712 de 2014","decreto 1510","Reserva total","2013-07-17","ILIMITADA","N/A","N/A"]
["230-280","SOFTWARE","DIRECCIÓN DE INFRAESTUCTURA","SISTEMA DE INFORMACION CONTRATISTA UT BT-INRED PROYECTO KVD F3","CONTROL Y SEGUIMIENTO DE LAS OBLIGACIONES CONTRACTUALES, SEGUIMIENTO DE INDICADORES Y ENTRGABLES ASOCIADOS AL PROYECTO","DIRECCIÓN DE INFRAESTUCTURA","2018-11-28","DIRECCIÓN DE INFRAESTUCTURA","2019-01-02","MISIONAL","ACCESO_USO_APROPIACION_TIC","ACCESO A LAS TIC","Del artículo 18 de la Ley 1712 de 2014","Externo","Digital","Sistemas de Información corporativos","Base de datos","Español","INFORMACIÓN PÚBLICA","N/A","SI","Del artículo 18 de la Ley 1712 de 2014","decreto 1510","Reserva total","2013-07-17","ILIMITADA","N/A","N/A"]
["230-281","SOFTWARE","DIRECCIÓN DE INFRAESTUCTURA","SISTEMA DE INFORMACION CONTRATISTA UTANDIRED PROYECTO CONECTIVIDAD ALTA VELOCIDAD","CONTROL Y SEGUIMIENTO DE LAS OBLIGACIONES CONTRACTUALES, SEGUIMIENTO DE INDICADORES Y ENTRGABLES ASOCIADOS AL PROYECTO","DIRECCIÓN DE INFRAESTUCTURA","2018-11-28","DIRECCIÓN DE INFRAESTUCTURA","2019-01-02","MISIONAL","ACCESO_USO_APROPIACION_TIC","ACCESO A LAS TIC","Del artículo 18 de la Ley 1712 de 2014","Externo","Digital","Sistemas de Información corporativos","Base de datos","Español","INFORMACIÓN PÚBLICA","N/A","SI","Del artículo 18 de la Ley 1712 de 2014","decreto 1510","Reserva total","2013-07-17","ILIMITADA","N/A","N/A"]
["230-282","SOFTWARE","DIRECCIÓN DE INFRAESTUCTURA","SISTEMA DE INFORMACION CONTRATISTA UTFO PROYECTO FIBRA OPTICA","CONTROL Y SEGUIMIENTO DE LAS OBLIGACIONES CONTRACTUALES, SEGUIMIENTO DE INDICADORES Y ENTRGABLES ASOCIADOS AL PROYECTO","DIRECCIÓN DE INFRAESTUCTURA","2018-11-28","DIRECCIÓN DE INFRAESTUCTURA","2019-01-02","MISIONAL","ACCESO_USO_APROPIACION_TIC","ACCESO A LAS TIC","Del artículo 18 de la Ley 1712 de 2014","Externo","Digital","Sistemas de Información corporativos","Base de datos","Español","INFORMACIÓN PÚBLICA","N/A","SI","Del artículo 18 de la Ley 1712 de 2014","decreto 1510","Reserva total","2013-07-17","ILIMITADA","N/A","N/A"]
["230-283","SOFTWARE","DIRECCIÓN DE INFRAESTUCTURA","SISTEMA DE INFORMACION CONTRATISTA UTCD PROYECTO CONEXIONES 1","CONTROL Y SEGUIMIENTO DE LAS OBLIGACIONES CONTRACTUALES, SEGUIMIENTO DE INDICADORES Y ENTRGABLES ASOCIADOS AL PROYECTO","DIRECCIÓN DE INFRAESTUCTURA","2018-11-28","DIRECCIÓN DE INFRAESTUCTURA","2019-01-02","MISIONAL","ACCESO_USO_APROPIACION_TIC","ACCESO A LAS TIC","Del artículo 18 de la Ley 1712 de 2014","Externo","Digital","Sistemas de Información corporativos","Base de datos","Español","INFORMACIÓN PÚBLICA","N/A","SI","Del artículo 18 de la Ley 1712 de 2014","decreto 1510","Reserva total","2013-07-17","ILIMITADA","N/A","N/A"]
["300-284","INFORMACIÓN","DESPACHO DEL VICEMINISTRO DE ECONOMIA DIGITAL","Informe","Informes de gestión de los cargos directivos y asesores del Viceministerio de Economía Digital ","DESPACHO DEL VICEMINISTRO DE ECONOMIA DIGITAL","2018-11-28","DESPACHO DEL VICEMINISTRO DE ECONOMIA DIGITAL","2019-01-02","MISIONAL","SEGUIMIENTO_CONTROL_POLITICAS_TIC","SEGUIMIENTO Y EVALUACION DE POLITICAS TIC","Ley 951 de 2005","Externo","Físico","Archivos Institucionales - físicos","Papel","Español","INFORMACIÓN PÚBLICA",null,"N/A","N/A","N/A","N/A","N/A","N/A",null,"a. Permitir el desarrollo del objeto del Ministerio/Fondo TIC, en los términos de los artículos 1o y 2o del Decreto 1414 de 2017."]
["300-285","INFORMACIÓN","DESPACHO DEL VICEMINISTRO DE ECONOMIA DIGITAL","Comunicaciones","Comunicaciones con diretrices a las direcciones del Viceministerio de Economía Digital","DESPACHO DEL VICEMINISTRO DE ECONOMIA DIGITAL","2018-11-28","DESPACHO DEL VICEMINISTRO DE CONECTIVIDAD Y DIGITALIZACIÓN","2019-01-02","MISIONAL","SEGUIMIENTO_CONTROL_POLITICAS_TIC","SEGUIMIENTO Y EVALUACION DE POLITICAS TIC","N/A","N/A","Físico","Archivos Institucionales - físicos","Papel","Español","INFORMACIÓN PÚBLICA","ALFANET","N/A","N/A","N/A","N/A","N/A","N/A","Dato personal público","e)       Mantener actualizada la historia laboral y registros de nómina de funcionarios del Ministerio/Fondo TIC."]
["300-286","INFORMACIÓN","DESPACHO DEL VICEMINISTRO DE ECONOMIA DIGITAL","Solicitud","Correspondencia entrante (interna y externa)","DESPACHO DEL VICEMINISTRO DE ECONOMIA DIGITAL","2018-11-28","GRUPO INTERNO DE TRABAJO DE FORTALECIMIENTO DE LAS RELACIONES CON LOS GRUPOS DE INTERES","2019-01-02","MISIONAL","SEGUIMIENTO_CONTROL_POLITICAS_TIC","SEGUIMIENTO Y EVALUACION DE POLITICAS TIC","Ley 1775 de 2015","Externo","Físico","Archivos Institucionales - físicos","Papel","Español","INFORMACIÓN PÚBLICA","ALFANET","N/A","N/A","N/A","N/A","N/A","N/A","Dato personal privado ","f. Atender y resolver peticiones, quejas, reclamos y sugerencias."]
["300-287","INFORMACIÓN","DESPACHO DEL VICEMINISTRO DE ECONOMIA DIGITAL","Respuesta y/o trámite","Correspondencia saliente (interna y externa)","DESPACHO DEL VICEMINISTRO DE ECONOMIA DIGITAL","2018-11-28","GRUPO INTERNO DE TRABAJO DE FORTALECIMIENTO DE LAS RELACIONES CON LOS GRUPOS DE INTERES","2019-01-02","MISIONAL","SEGUIMIENTO_CONTROL_POLITICAS_TIC","SEGUIMIENTO Y EVALUACION DE POLITICAS TIC","Ley 1775 de 2015","Externo","Físico","Documentos de Archivo - físicos","Papel","Español","INFORMACIÓN PÚBLICA","ALFANET","N/A","N/A","N/A","N/A","N/A","N/A","Dato personal privado ","f. Atender y resolver peticiones, quejas, reclamos y sugerencias."]
["300-288","INFORMACIÓN","DESPACHO DEL VICEMINISTRO DE ECONOMIA DIGITAL","Programa ciudades y territorios inteligentes","Archivo correspondiente al programa ciudades y territorios inteligentes.","DESPACHO DEL VICEMINISTRO DE ECONOMIA DIGITAL","2018-11-28","DESPACHO DEL VICEMINISTRO DE ECONOMIA DIGITAL","2019-01-02","MISIONAL","SEGUIMIENTO_CONTROL_POLITICAS_TIC","SEGUIMIENTO Y EVALUACION DE POLITICAS TIC","N/A","N/A","Físico","Archivos Institucionales - electrónico","Papel","Español","INFORMACIÓN PÚBLICA","ALFANET","N/A","N/A","N/A","N/A","N/A","N/A","N/A","a. Permitir el desarrollo del objeto del Ministerio/Fondo TIC, en los términos de los artículos 1o y 2o del Decreto 1414 de 2017."]
["300-289","INFORMACIÓN","DESPACHO DEL VICEMINISTRO DE ECONOMIA DIGITAL","Programa de empresarios digitales","Archivo correspondiente al programa de emprendimiento digital","DESPACHO DEL VICEMINISTRO DE ECONOMIA DIGITAL","2018-11-28","DESPACHO DEL VICEMINISTRO DE ECONOMIA DIGITAL","2019-01-02","MISIONAL","SEGUIMIENTO_CONTROL_POLITICAS_TIC","SEGUIMIENTO Y EVALUACION DE POLITICAS TIC","N/A","N/A","Físico","Documentos de Archivo - electrónicos","Papel","Español","INFORMACIÓN PÚBLICA","Archivo de gestión V.E.D.","N/A","N/A","N/A","N/A","N/A","N/A","N/A","a. Permitir el desarrollo del objeto del Ministerio/Fondo TIC, en los términos de los artículos 1o y 2o del Decreto 1414 de 2017."]
["300-290","INFORMACIÓN","DESPACHO DEL VICEMINISTRO DE ECONOMIA DIGITAL","Proyectos de inversión del Viceministerio de Economía Digital","Archivo correspondiente a los proyectos del Viceministerio de Economía Digital","DESPACHO DEL VICEMINISTRO DE ECONOMIA DIGITAL","2018-11-28","DESPACHO DEL VICEMINISTRO DE ECONOMIA DIGITAL","2019-01-02","MISIONAL","SEGUIMIENTO_CONTROL_POLITICAS_TIC","SEGUIMIENTO Y EVALUACION DE POLITICAS TIC","N/A","N/A","Físico","Documentos de Archivo - electrónicos","Papel","Español","INFORMACIÓN PÚBLICA","Archivo de gestión V.E.D.","N/A","N/A","N/A","N/A","N/A","N/A","N/A","a. Permitir el desarrollo del objeto del Ministerio/Fondo TIC, en los términos de los artículos 1o y 2o del Decreto 1414 de 2017."]
["201-291","INFORMACIÓN","GRUPO INTERNO DE TRABAJO ESPECIALIZADO DE RECURSOS Y ACTUACIONES ADMINISTRATIVAS","INFORME","INFORMES TRIMESTRALES DE GESTION OCT- NOV- DIC 2019","GRUPO INTERNO DE TRABAJO ESPECIALIZADO DE RECURSOS Y ACTUACIONES ADMINISTRATIVAS","2018-11-28","GRUPO INTERNO DE TRABAJO ESPECIALIZADO DE RECURSOS Y ACTUACIONES ADMINISTRATIVAS","2019-01-02","MISIONAL","SEGUIMIENTO_CONTROL_POLITICAS_TIC","VIGILANCIA Y CONTROL","norma que sustenta el tipo documental","N/A","Físico","Documentos de Archivo - físicos","papel","Español","NO CLASIFICADA","N/A","N/A","N/A","N/A","N/A","N/A","N/A","Dato personal público","N/A"]
["201-292","INFORMACIÓN","GRUPO INTERNO DE TRABAJO ESPECIALIZADO DE RECURSOS Y ACTUACIONES ADMINISTRATIVAS","CONTROL DE RESOLUCIONES","RESOLUCIONES QUE RESULEVEN RECURSOS DE APELACIÓN","GRUPO INTERNO DE TRABAJO ESPECIALIZADO DE RECURSOS Y ACTUACIONES ADMINISTRATIVAS","2018-11-28","GRUPO INTERNO DE TRABAJO ESPECIALIZADO DE RECURSOS Y ACTUACIONES ADMINISTRATIVAS","2019-01-02","MISIONAL","SEGUIMIENTO_CONTROL_POLITICAS_TIC","VIGILANCIA Y CONTROL","norma que sustenta el tipo documental","Interno","Físico","Archivos Institucionales - físicos","Papel","Español","INFORMACIÓN PÚBLICA","ALFANET, PLUS, NOTIFICACIONES ","N/A","N/A","N/A","N/A","N/A","N/A","Dato personal público","h. Atender requerimientos de información de entes de control tanto internos como externos."]
["201-293","INFORMACIÓN","GRUPO INTERNO DE TRABAJO ESPECIALIZADO DE RECURSOS Y ACTUACIONES ADMINISTRATIVAS","RESPUESTA Y/O TRAMITE ","RESPUESTA A PQRSD","GRUPO INTERNO DE TRABAJO ESPECIALIZADO DE RECURSOS Y ACTUACIONES ADMINISTRATIVAS","2018-11-28","GRUPO INTERNO DE TRABAJO ESPECIALIZADO DE RECURSOS Y ACTUACIONES ADMINISTRATIVAS","2019-01-02","MISIONAL","SEGUIMIENTO_CONTROL_POLITICAS_TIC","VIGILANCIA Y CONTROL","norma que sustenta el tipo documental","Interno","Físico","Documentos de Archivo - físicos","Papel","Español","INFORMACIÓN PÚBLICA","ALFANET","N/A","N/A","N/A","N/A","N/A","N/A","Dato personal privado ","f. Atender y resolver peticiones, quejas, reclamos y sugerencias."]
["310-294","INFORMACIÓN","DIRECCIÓN DE APROPIACIÓN DE TECNOLOGÍAS DE LA INFORMACIÓN Y LAS COMUNICACIONES","ACUERDOS DE GESTIÓN","Es el formato mediante el cual el gerente público acuerda con su superior jerárquico, las metas a cumplir durante el semestre y durante el año","DIRECCIÓN DE APROPIACIÓN DE TECNOLOGÍAS DE LA INFORMACIÓN Y LAS COMUNICACIONES","2018-11-28","SUBDIRECCIÓN ADMINISTRATIVA Y DE GESTIÓN HUMANA","2019-01-02","MISIONAL","ACCESO_USO_APROPIACION_TIC","USO Y APROPIACION DE LAS TIC","Decreto 1414 de 2017","Interno","Físico","Documentos de Archivo - físicos","Papel","Español","INFORMACIÓN PÚBLICA RESERVADA","Archivo físico DATIC","SI","Del artículo 18 Y 19 de la Ley 1712 de 2014","literal A\nParágrafo","Reserva parcial","2018-11-22","4 AÑOS","N/A","N/A"]
["310-295","INFORMACIÓN","DIRECCIÓN DE APROPIACIÓN DE TECNOLOGÍAS DE LA INFORMACIÓN Y LAS COMUNICACIONES","Oficio de respuesta a PQR'S","Fomato de oficio para dar respuesta a los distintos PQR's que llegan a la Dirección","DIRECCIÓN DE APROPIACIÓN DE TECNOLOGÍAS DE LA INFORMACIÓN Y LAS COMUNICACIONES","2018-11-28","DIRECCIÓN DE APROPIACIÓN DE TECNOLOGÍAS DE LA INFORMACIÓN Y LAS COMUNICACIONES","2019-01-02","MISIONAL","ACCESO_USO_APROPIACION_TIC","USO Y APROPIACION DE LAS TIC","Decreto 1414 de 2017","Externo","Digital","Documentos de Archivo - electrónicos","PDF","Español","INFORMACIÓN PÚBLICA","ALFANET","N/A","N/A","N/A","N/A","N/A","N/A","N/A","N/A"]
["310-296","INFORMACIÓN","DIRECCIÓN DE APROPIACIÓN DE TECNOLOGÍAS DE LA INFORMACIÓN Y LAS COMUNICACIONES","Formato agenda internacional","Formato mediante el cual la Oficina Internacional recoge la información relativa a la agenda internacional de la Dirección","DIRECCIÓN DE APROPIACIÓN DE TECNOLOGÍAS DE LA INFORMACIÓN Y LAS COMUNICACIONES","2018-11-28","OFICINA INTERNACIONAL","2019-01-02","MISIONAL","ACCESO_USO_APROPIACION_TIC","USO Y APROPIACION DE LAS TIC","Decreto 1414 de 2017","Interno","Digital","Documentos de Archivo - electrónicos","PDF","Español","NO CLASIFICADA","Archivo digital DATIC","N/A","N/A","N/A","N/A","N/A","N/A","N/A","N/A"]
["310-297","INFORMACIÓN","DIRECCIÓN DE APROPIACIÓN DE TECNOLOGÍAS DE LA INFORMACIÓN Y LAS COMUNICACIONES","Actas de grupos primarios","Formato de acta de grupo primario que se rellena en el sahrepoint, en el siguiente link: ","DIRECCIÓN DE APROPIACIÓN DE TECNOLOGÍAS DE LA INFORMACIÓN Y LAS COMUNICACIONES","2018-11-28","OFICINA ASESORA DE PLANEACIÓN Y ESTUDIOS SECTORIALES","2019-01-02","MISIONAL","ACCESO_USO_APROPIACION_TIC","USO Y APROPIACION DE LAS TIC","Decreto 1414 de 2017","Interno","Digital","Documentos de Archivo - electrónicos","PDF","Español","NO CLASIFICADA","Sharepoint","N/A","N/A","N/A","N/A","N/A","N/A","N/A","N/A"]
["310-298","INFORMACIÓN","DIRECCIÓN DE APROPIACIÓN DE TECNOLOGÍAS DE LA INFORMACIÓN Y LAS COMUNICACIONES","Memorando de legalización de comisiones de servicios al exterior","Formato de memorando remisorio de documentación requerida para las legalizaciones de las comisiones de la Directora de Apropiación de TIC","DIRECCIÓN DE APROPIACIÓN DE TECNOLOGÍAS DE LA INFORMACIÓN Y LAS COMUNICACIONES","2018-11-28","DIRECCIÓN DE APROPIACIÓN DE TECNOLOGÍAS DE LA INFORMACIÓN Y LAS COMUNICACIONES","2019-01-02","MISIONAL","ACCESO_USO_APROPIACION_TIC","USO Y APROPIACION DE LAS TIC","Decreto 1414 de 2017","Interno","Físico","Documentos de Archivo - físicos","PDF","Español","NO CLASIFICADA","Archivo físico DATIC","N/A","N/A","N/A","N/A","N/A","N/A","N/A","N/A"]
["310-299","INFORMACIÓN","DIRECCIÓN DE APROPIACIÓN DE TECNOLOGÍAS DE LA INFORMACIÓN Y LAS COMUNICACIONES","Ficha de caracterización de la cooperación internacional","Formato que recoge la oferta y demanda de cooperación internacional de la Dirección de Apropiación de TIC","DIRECCIÓN DE APROPIACIÓN DE TECNOLOGÍAS DE LA INFORMACIÓN Y LAS COMUNICACIONES","2018-11-28","OFICINA INTERNACIONAL","2019-01-02","MISIONAL","ACCESO_USO_APROPIACION_TIC","USO Y APROPIACION DE LAS TIC","Decreto 1414 de 2017","Interno","Digital","Documentos de Archivo - electrónicos","PDF","Español","NO CLASIFICADA","Archivo digital DATIC","N/A","N/A","N/A","N/A","N/A","N/A","N/A","N/A"]
["310-300","INFORMACIÓN","DIRECCIÓN DE APROPIACIÓN DE TECNOLOGÍAS DE LA INFORMACIÓN Y LAS COMUNICACIONES","Informe de legalización de comisiones de servicios al exterior","Formato de informe de legalización que expide el aplicativo de comisiones al exterior","DIRECCIÓN DE APROPIACIÓN DE TECNOLOGÍAS DE LA INFORMACIÓN Y LAS COMUNICACIONES","2018-11-28","SUBDIRECCIÓN FINANCIERA","2019-01-02","MISIONAL","ACCESO_USO_APROPIACION_TIC","USO Y APROPIACION DE LAS TIC","Decreto 1414 de 2017","Interno","Digital","Documentos de Archivo - electrónicos","PDF","Español","NO CLASIFICADA","Aplicativo comisiones al exterior","N/A","N/A","N/A","N/A","N/A","N/A","N/A","N/A"]
["310-301","INFORMACIÓN","DIRECCIÓN DE APROPIACIÓN DE TECNOLOGÍAS DE LA INFORMACIÓN Y LAS COMUNICACIONES","Plan estratégico - Plan de Acción","Seguimiento a indicadores del Plan Estratégico y  Plan de Acción de la Dirección de Apropiación TIC  - registrados en el ASPA","DIRECCIÓN DE APROPIACIÓN DE TECNOLOGÍAS DE LA INFORMACIÓN Y LAS COMUNICACIONES","2018-11-28","OFICINA ASESORA DE PLANEACIÓN Y ESTUDIOS SECTORIALES","2019-01-02","MISIONAL","ACCESO_USO_APROPIACION_TIC","USO Y APROPIACION DE LAS TIC","LEY 1955 DE 2019\nPlan nacional de Desarrollo","Externo","Digital","Sistemas de Información corporativos","PDF","Español","INFORMACIÓN PÚBLICA RESERVADA","www.mintic.gov.co","SI","Del artículo 18 Y 19 de la Ley 1712 de 2014","literal A\nParágrafo","Reserva parcial","2018-11-22","4 AÑOS","N/A","N/A"]
["310-302","INFORMACIÓN","DIRECCIÓN DE APROPIACIÓN DE TECNOLOGÍAS DE LA INFORMACIÓN Y LAS COMUNICACIONES","Informes de gestión ","Informes de gestión de la DATIC - Rendición de Cuentas  - Informes al congreso de la República","DIRECCIÓN DE APROPIACIÓN DE TECNOLOGÍAS DE LA INFORMACIÓN Y LAS COMUNICACIONES","2018-11-28","DIRECCIÓN DE APROPIACIÓN DE TECNOLOGÍAS DE LA INFORMACIÓN Y LAS COMUNICACIONES","2019-01-02","MISIONAL","ACCESO_USO_APROPIACION_TIC","USO Y APROPIACION DE LAS TIC","Ley 1474 de 2011","Externo","Digital","Documentos de Archivo - electrónicos","PDF","Español","INFORMACIÓN PÚBLICA","www.mintic.gov.co","N/A","N/A","N/A","N/A","N/A","N/A","N/A","N/A"]
["310-303","INFORMACIÓN","DIRECCIÓN DE APROPIACIÓN DE TECNOLOGÍAS DE LA INFORMACIÓN Y LAS COMUNICACIONES","Documentos de Control presupuestal","Informes de ejecución presupuestal de la Dirección de Apropiación","DIRECCIÓN DE APROPIACIÓN DE TECNOLOGÍAS DE LA INFORMACIÓN Y LAS COMUNICACIONES","2018-11-28","DIRECCIÓN DE APROPIACIÓN DE TECNOLOGÍAS DE LA INFORMACIÓN Y LAS COMUNICACIONES","2019-01-02","MISIONAL","ACCESO_USO_APROPIACION_TIC","USO Y APROPIACION DE LAS TIC","Decreto 111 de1996","Externo","Digital","Documentos de Archivo - electrónicos","XLS","Español","INFORMACIÓN PÚBLICA","Splicativo SPI del DNP\nhttps://sts.dnp.gov.co/","N/A","N/A","N/A","N/A","N/A","N/A","N/A","N/A"]
["310-304","INFORMACIÓN","DIRECCIÓN DE APROPIACIÓN DE TECNOLOGÍAS DE LA INFORMACIÓN Y LAS COMUNICACIONES","Bases de datos de los proyectos","Bases de datos del número de beneficiarios de los proyectos de la Dirección de Apropiación TIC","DIRECCIÓN DE APROPIACIÓN DE TECNOLOGÍAS DE LA INFORMACIÓN Y LAS COMUNICACIONES","2018-11-28","DIRECCIÓN DE APROPIACIÓN DE TECNOLOGÍAS DE LA INFORMACIÓN Y LAS COMUNICACIONES","2019-01-02","MISIONAL","ACCESO_USO_APROPIACION_TIC","USO Y APROPIACION DE LAS TIC","Decreto 1414 de 2017","Interno","Digital","Documentos de Archivo - electrónicos","XLS","Español","NO CLASIFICADA","Sharepoint","N/A","N/A","N/A","N/A","N/A","N/A","N/A","N/A"]
["310.1-305","INFORMACIÓN","GRUPO INTERNO DE TRABAJO TÉCNICO DE INNOVACIÓN SOCIAL Y APROPIACIÓN EN COMUNIDADES","Promoción del Teletrabajo"," Página Web de la iniciativa \"Teletrabajo\"","GRUPO INTERNO DE TRABAJO TÉCNICO DE INNOVACIÓN SOCIAL Y APROPIACIÓN EN COMUNIDADES","2018-11-28","GRUPO INTERNO DE TRABAJO TÉCNICO DE INNOVACIÓN SOCIAL Y APROPIACIÓN EN COMUNIDADES","2019-12-05","MISIONAL","ACCESO_USO_APROPIACION_TIC","USO Y APROPIACION DE LAS TIC","Ley 221 de 2008","Externo","Digital","Portales, Intranet y Extranet","HTML (Página Web)","Español","INFORMACIÓN PÚBLICA","www.teletrabajo.gov.co","N/A","N/A","N/A","N/A","N/A","N/A","N/A","N/A"]
["310.1-306","INFORMACIÓN","GRUPO INTERNO DE TRABAJO TÉCNICO DE INNOVACIÓN SOCIAL Y APROPIACIÓN EN COMUNIDADES","Promoción del Teletrabajo"," Cuenta Twitter de la iniciativa \"Teletrabajo\"","GRUPO INTERNO DE TRABAJO TÉCNICO DE INNOVACIÓN SOCIAL Y APROPIACIÓN EN COMUNIDADES","2018-11-28","GRUPO INTERNO DE TRABAJO TÉCNICO DE INNOVACIÓN SOCIAL Y APROPIACIÓN EN COMUNIDADES","2019-12-05","MISIONAL","ACCESO_USO_APROPIACION_TIC","USO Y APROPIACION DE LAS TIC","Ley 221 de 2008","Externo","Digital","Portales, Intranet y Extranet","HTML (Página Web)","Español","INFORMACIÓN PÚBLICA","TeletrabajoCo/twitter","N/A","N/A","N/A","N/A","N/A","N/A","N/A","N/A"]
["311-307","INFORMACIÓN","SUBDIRECCIÓN DE PROCESOS DE APROPIACIÓN DE TECNOLOGÍAS DE LA INFORMACIÓN Y LAS COMUNICACIONES","Informe de Legalización","Se hace una descripción del objetivo de la comisión y de las actividades realizadas","SUBDIRECCIÓN DE PROCESOS DE APROPIACIÓN DE TECNOLOGÍAS DE LA INFORMACIÓN Y LAS COMUNICACIONES","2018-11-28","SUBDIRECCIÓN ADMINISTRATIVA Y DE GESTIÓN HUMANA","2019-01-02","MISIONAL","ACCESO_USO_APROPIACION_TIC","USO Y APROPIACION DE LAS TIC","Ley 1341 de 2009","Interno","Digital","Archivos Institucionales - electrónico","PDF","Inglés y Español","INFORMACIÓN PÚBLICA","Red intranet","N/A","N/A","N/A","N/A","N/A","N/A","N/A","N/A"]
["311-308","INFORMACIÓN","SUBDIRECCIÓN DE PROCESOS DE APROPIACIÓN DE TECNOLOGÍAS DE LA INFORMACIÓN Y LAS COMUNICACIONES","Memorando","Envío de los documentos físico soporte de la comisión","SUBDIRECCIÓN DE PROCESOS DE APROPIACIÓN DE TECNOLOGÍAS DE LA INFORMACIÓN Y LAS COMUNICACIONES","2018-11-28","SUBDIRECCIÓN ADMINISTRATIVA Y DE GESTIÓN HUMANA","2019-01-02","MISIONAL","ACCESO_USO_APROPIACION_TIC","USO Y APROPIACION DE LAS TIC","Ley 1341 de 2009","Interno","Físico","Archivos Institucionales - físicos","N/A","Inglés y Español","INFORMACIÓN PÚBLICA","Archivo interno de la subdirección","N/A","N/A","N/A","N/A","N/A","N/A","N/A","N/A"]
["311-309","INFORMACIÓN","SUBDIRECCIÓN DE PROCESOS DE APROPIACIÓN DE TECNOLOGÍAS DE LA INFORMACIÓN Y LAS COMUNICACIONES","Oficios de respuesta","Contenido que da contestación a la PQRS","SUBDIRECCIÓN DE PROCESOS DE APROPIACIÓN DE TECNOLOGÍAS DE LA INFORMACIÓN Y LAS COMUNICACIONES","2018-11-28","GRUPO INTERNO DE TRABAJO DE FORTALECIMIENTO DE LAS RELACIONES CON LOS GRUPOS DE INTERES","2019-01-02","MISIONAL","ACCESO_USO_APROPIACION_TIC","USO Y APROPIACION DE LAS TIC","Ley 1341 de 2009","Interno","Físico","Archivos Institucionales - electrónico","PDF","Inglés y Español","INFORMACIÓN PÚBLICA","Carpeta contractual, sharepoint, nube y página web del programa","N/A","N/A","N/A","N/A","N/A","N/A","Dato personal privado ","f. Atender y resolver peticiones, quejas, reclamos y sugerencias."]
["311-310","INFORMACIÓN","SUBDIRECCIÓN DE PROCESOS DE APROPIACIÓN DE TECNOLOGÍAS DE LA INFORMACIÓN Y LAS COMUNICACIONES","Ciudadanía Digital","Carpeta de Ejecución de la iniciativa Ciudadanía Digital","SUBDIRECCIÓN DE PROCESOS DE APROPIACIÓN DE TECNOLOGÍAS DE LA INFORMACIÓN Y LAS COMUNICACIONES","2018-11-28","GRUPO INTERNO DE TRABAJO DE FORTALECIMIENTO DE LAS RELACIONES CON LOS GRUPOS DE INTERES","2019-01-02","MISIONAL","ACCESO_USO_APROPIACION_TIC","USO Y APROPIACION DE LAS TIC","Ley 1341 de 2009","Interno","Físico","Documentos de Archivo - físicos","N/A","Inglés y Español","INFORMACIÓN PÚBLICA","Carpeta contractual, sharepoint, nube y página web del programa","N/A","N/A","N/A","N/A","N/A","N/A","Datos sensibles","a)       Permitir el desarrollo del objeto del Ministerio/Fondo TIC, en los términos de los artículos 1o y 2o del Decreto 1414 de 2017."]
["311-311","INFORMACIÓN","SUBDIRECCIÓN DE PROCESOS DE APROPIACIÓN DE TECNOLOGÍAS DE LA INFORMACIÓN Y LAS COMUNICACIONES","ConVerTic","Carpeta de Ejecución de la iniciativa ConVerTIC","SUBDIRECCIÓN DE PROCESOS DE APROPIACIÓN DE TECNOLOGÍAS DE LA INFORMACIÓN Y LAS COMUNICACIONES","2018-11-28","GRUPO INTERNO DE TRABAJO DE FORTALECIMIENTO DE LAS RELACIONES CON LOS GRUPOS DE INTERES","2019-01-02","MISIONAL","ACCESO_USO_APROPIACION_TIC","USO Y APROPIACION DE LAS TIC","Ley 1341 de 2009","Interno","Físico","Documentos de Archivo - físicos","N/A","Inglés y Español","INFORMACIÓN PÚBLICA","Carpeta contractual, sharepoint, nube y página web del programa","N/A","N/A","N/A","N/A","N/A","N/A","Datos sensibles","a)       Permitir el desarrollo del objeto del Ministerio/Fondo TIC, en los términos de los artículos 1o y 2o del Decreto 1414 de 2017."]
["311-312","INFORMACIÓN","SUBDIRECCIÓN DE PROCESOS DE APROPIACIÓN DE TECNOLOGÍAS DE LA INFORMACIÓN Y LAS COMUNICACIONES","Cine para Todos","Carpeta de Ejecución de la iniciativa Cine para Todos","SUBDIRECCIÓN DE PROCESOS DE APROPIACIÓN DE TECNOLOGÍAS DE LA INFORMACIÓN Y LAS COMUNICACIONES","2018-11-28","GRUPO INTERNO DE TRABAJO DE FORTALECIMIENTO DE LAS RELACIONES CON LOS GRUPOS DE INTERES","2019-01-02","MISIONAL","ACCESO_USO_APROPIACION_TIC","USO Y APROPIACION DE LAS TIC","Ley 1341 de 2009","Interno","Físico","Documentos de Archivo - físicos","N/A","Inglés y Español","INFORMACIÓN PÚBLICA","Carpeta contractual, sharepoint, nube y página web del programa","N/A","N/A","N/A","N/A","N/A","N/A","Datos sensibles","a)       Permitir el desarrollo del objeto del Ministerio/Fondo TIC, en los términos de los artículos 1o y 2o del Decreto 1414 de 2017."]
["311-313","INFORMACIÓN","SUBDIRECCIÓN DE PROCESOS DE APROPIACIÓN DE TECNOLOGÍAS DE LA INFORMACIÓN Y LAS COMUNICACIONES","Centro de Relevo","Carpeta de Ejecución de la iniciativa Centro de Relevo","SUBDIRECCIÓN DE PROCESOS DE APROPIACIÓN DE TECNOLOGÍAS DE LA INFORMACIÓN Y LAS COMUNICACIONES","2018-11-28","GRUPO INTERNO DE TRABAJO DE FORTALECIMIENTO DE LAS RELACIONES CON LOS GRUPOS DE INTERES","2019-01-02","MISIONAL","ACCESO_USO_APROPIACION_TIC","USO Y APROPIACION DE LAS TIC","Ley 1341 de 2009","Interno","Físico","Documentos de Archivo - físicos","N/A","Inglés y Español","INFORMACIÓN PÚBLICA","Carpeta contractual, sharepoint, nube y página web del programa","N/A","N/A","N/A","N/A","N/A","N/A","Datos sensibles","a)       Permitir el desarrollo del objeto del Ministerio/Fondo TIC, en los términos de los artículos 1o y 2o del Decreto 1414 de 2017."]
["312-314","INFORMACIÓN","SUBDIRECCIÓN DE CULTURA DIGITAL",null,null,"SUBDIRECCIÓN DE CULTURA DIGITAL","2018-11-28","SUBDIRECCIÓN DE CULTURA DIGITAL","2019-01-02","MISIONAL","ACCESO_USO_APROPIACION_TIC","USO Y APROPIACION DE LAS TIC","Ley 1341 de 2009","Interno","Físico","Documentos de Archivo - físicos","Papel","Español","INFORMACIÓN PÚBLICA","https://mintic.sharepoint.com/Dir_Apropiacion/SitePages/Inicio.aspx?RootFolder=%2FDir%5FApropiacion%2FDocumentos%20compartidos%2FCONVENIOS%20SUBDIRECCION%20CULTURA&FolderCTID=0x012000BFF1DDD4E38820408F534FCA5B18F8C3&View=%7BA4F92D51%2D6BA6%2D4706%2D97BB%2D1391DD742264%7D","N/A","N/A","N/A","N/A","N/A","N/A","Dato personal público","h)       Atender requerimientos de información de entes de control tanto internos como externos."]
["312-315","INFORMACIÓN","SUBDIRECCIÓN DE CULTURA DIGITAL","Oficios de respuesta a peticiones, quejas, sugerencias y denuncias ","Trámite de respuesta oficial a las solicitudes recibidas por parte de los ciudadanos PQRS","SUBDIRECCIÓN DE CULTURA DIGITAL","2018-11-28","SUBDIRECCIÓN DE CULTURA DIGITAL","2019-01-02","MISIONAL","ACCESO_USO_APROPIACION_TIC","USO Y APROPIACION DE LAS TIC","Ley 1755 de 2015","Interno","Físico","Documentos de Archivo - físicos","Papel","Español","INFORMACIÓN PÚBLICA","N/A","N/A","N/A","N/A","N/A","N/A","N/A","Dato personal privado ","f. Atender y resolver peticiones, quejas, reclamos y sugerencias."]
["312-316","SERVICIOS","SUBDIRECCIÓN DE CULTURA DIGITAL","Uso responsable de las TIC"," Página facebook de la iniciativa de uso responsable de las TIC \"En TIC Confío\"","SUBDIRECCIÓN DE CULTURA DIGITAL","2018-11-28","DIRECCIÓN DE APROPIACIÓN DE TECNOLOGÍAS DE LA INFORMACIÓN Y LAS COMUNICACIONES","2019-01-02","MISIONAL","ACCESO_USO_APROPIACION_TIC","USO Y APROPIACION DE LAS TIC","Ley 1755 de 2015","Interno","Digital","Portales, Intranet y Extranet","HTML (Página Web)","Español","INFORMACIÓN PÚBLICA","enticconfio/facebook","N/A","N/A","N/A","N/A","N/A","N/A","N/A","N/A"]
["312-317","SERVICIOS","SUBDIRECCIÓN DE CULTURA DIGITAL","Uso responsable de las TIC","Página Instagram de la iniciativa de uso responsable de las TIC \"En TIC Confio\"","SUBDIRECCIÓN DE CULTURA DIGITAL","2018-11-28","DIRECCIÓN DE APROPIACIÓN DE TECNOLOGÍAS DE LA INFORMACIÓN Y LAS COMUNICACIONES","2019-01-02","MISIONAL","ACCESO_USO_APROPIACION_TIC","USO Y APROPIACION DE LAS TIC","Ley 1755 de 2015","Interno","Digital","Portales, Intranet y Extranet","HTML (Página Web)","Español","INFORMACIÓN PÚBLICA","enticconfio/instragram","N/A","N/A","N/A","N/A","N/A","N/A","N/A","N/A"]
["312-318","SERVICIOS","SUBDIRECCIÓN DE CULTURA DIGITAL","Uso responsable de las TIC","Página Twitter de la iniciativa de uso responsable de las TIC \"En TIC Confío\"","SUBDIRECCIÓN DE CULTURA DIGITAL","2018-11-28","DIRECCIÓN DE APROPIACIÓN DE TECNOLOGÍAS DE LA INFORMACIÓN Y LAS COMUNICACIONES","2019-01-02","MISIONAL","ACCESO_USO_APROPIACION_TIC","USO Y APROPIACION DE LAS TIC","Ley 1755 de 2015","Interno","Digital","Portales, Intranet y Extranet","HTML (Página Web)","Español","INFORMACIÓN PÚBLICA","enticconfio/twitter","N/A","N/A","N/A","N/A","N/A","N/A","N/A","N/A"]
["312-319","SERVICIOS","SUBDIRECCIÓN DE CULTURA DIGITAL","Uso responsable de las TIC"," Página  Web de la iniciativa de uso responsable de las TIC \"En TIC Confío\"","SUBDIRECCIÓN DE CULTURA DIGITAL","2018-11-28","DIRECCIÓN DE APROPIACIÓN DE TECNOLOGÍAS DE LA INFORMACIÓN Y LAS COMUNICACIONES","2019-01-02","MISIONAL","ACCESO_USO_APROPIACION_TIC","USO Y APROPIACION DE LAS TIC","Ley 1755 de 2015","Interno","Digital","Portales, Intranet y Extranet","HTML (Página Web)","Español","INFORMACIÓN PÚBLICA","www.enticconfio.gov.co","N/A","N/A","N/A","N/A","N/A","N/A","N/A","N/A"]
["312-320","SERVICIOS","SUBDIRECCIÓN DE CULTURA DIGITAL","Inspiración en el uso de Internet","Página Twitter de la iniciativa de inspiración en el uso de Internet \"Redvolución\"","SUBDIRECCIÓN DE CULTURA DIGITAL","2018-11-28","DIRECCIÓN DE APROPIACIÓN DE TECNOLOGÍAS DE LA INFORMACIÓN Y LAS COMUNICACIONES","2019-01-02","MISIONAL","ACCESO_USO_APROPIACION_TIC","USO Y APROPIACION DE LAS TIC","Ley 1755 de 2015","Interno","Digital","Portales, Intranet y Extranet","HTML (Página Web)","Español","INFORMACIÓN PÚBLICA","RedvolucionCo/Twitter","N/A","N/A","N/A","N/A","N/A","N/A","N/A","N/A"]
["312-321","SERVICIOS","SUBDIRECCIÓN DE CULTURA DIGITAL","Inspiración en el uso de Internet"," Página Web de la iniciativa de inspiración en el uso de Internet \"Redvolución\"",{"$f":"IF(C328=\"\",\"\",C328)","v":"SUBDIRECCIÓN DE CULTURA DIGITAL"},"2018-11-28","DIRECCIÓN DE APROPIACIÓN DE TECNOLOGÍAS DE LA INFORMACIÓN Y LAS COMUNICACIONES","2019-01-02","MISIONAL","ACCESO_USO_APROPIACION_TIC","USO Y APROPIACION DE LAS TIC","Ley 1755 de 2015","Interno","Digital","Portales, Intranet y Extranet","HTML (Página Web)","Español","INFORMACIÓN PÚBLICA","www.redvolucion.gov.co","N/A","N/A","N/A","N/A","N/A","N/A","N/A","N/A"]
["312-322","SOFTWARE","SUBDIRECCIÓN DE CULTURA DIGITAL","Inspiración y uso responsable del internet y las TIC","Página Web de la promoción del plan de formación de \"Escuela Tic Familia\".","SUBDIRECCIÓN DE CULTURA DIGITAL","2018-11-28","DIRECCIÓN DE APROPIACIÓN DE TECNOLOGÍAS DE LA INFORMACIÓN Y LAS COMUNICACIONES","2019-01-02","MISIONAL","ACCESO_USO_APROPIACION_TIC","USO Y APROPIACION DE LAS TIC","Ley 1755 de 2015","Interno","Digital","Portales, Intranet y Extranet","HTML (Página Web)","Español","INFORMACIÓN PÚBLICA","www.escuelaticfamilia.gov.co","N/A","N/A","N/A","N/A","N/A","N/A","N/A","N/A"]
["312-323","SERVICIOS","SUBDIRECCIÓN DE CULTURA DIGITAL","Uso responsable de las TIC","Página Web del legado de Gabriel Garcia Marquez \"Fundación Nuevo Periodismo\".","SUBDIRECCIÓN DE CULTURA DIGITAL","2018-11-28","DIRECCIÓN DE APROPIACIÓN DE TECNOLOGÍAS DE LA INFORMACIÓN Y LAS COMUNICACIONES","2019-01-02","MISIONAL","ACCESO_USO_APROPIACION_TIC","USO Y APROPIACION DE LAS TIC","Ley 1755 de 2015","Interno","Digital","Portales, Intranet y Extranet","HTML (Página Web)","Español","INFORMACIÓN PÚBLICA","www.centrogabo.org","N/A","N/A","N/A","N/A","N/A","N/A","N/A","N/A"]
["322-324","INFORMACIÓN","SUBDIRECCIÓN DE ESTANDARES Y ARQUITECTURA DE TECNOLOGÍA DE LA INFORMACIÓN","Documentos técnicos de apoyo para la generación de Instrumentos de Agregación de Demanda de TI","Documentación técnica de apoyo para la generación de los anexos y formatos que hacen parte de los instrumentos de agregación de demanda de TI.","SUBDIRECCIÓN DE ESTANDARES Y ARQUITECTURA DE TECNOLOGÍA DE LA INFORMACIÓN","2018-11-28","SUBDIRECCIÓN DE ESTANDARES Y ARQUITECTURA DE TECNOLOGÍA DE LA INFORMACIÓN","2019-11-28","MISIONAL","ACCESO_USO_APROPIACION_TIC","USO Y APROPIACION DE LAS TIC","Ley 1712 de 2014 ","Interno","Digital","Portales, Intranet y Extranet","HTML (Página Web)","Español","INFORMACIÓN PÚBLICA","https://mintic-my.sharepoint.com/personal/morjuela_mintic_gov_co/_layouts/15/onedrive.aspx?id=%2fpersonal%2fmorjuela_mintic_gov_co%2fDocuments%2fOptimizaci%c3%b3n_Compras_P%c3%bablicas_de_TI&FolderCTID=0x01200015A5EC908225574DA9B40FA8C4124080","N/A","N/A","N/A","N/A","N/A","N/A","N/A","a. Permitir el desarrollo del objeto del Ministerio/Fondo TIC, en los términos de los artículos 1o y 2o del Decreto 1414 de 2017."]
["320-325","INFORMACIÓN","DIRECCIÓN DE GOBIERNO DIGITAL","Informes de escucha activa para Presidencia de la República","Informes de análisis de la percepción ciudadana en las redes sociales sobre el Gobierno Nacional o el Presidente de la República.","DIRECCIÓN DE GOBIERNO DIGITAL","2018-11-28","DIRECCIÓN DE GOBIERNO DIGITAL","2019-11-28","MISIONAL","ACCESO_USO_APROPIACION_TIC","USO Y APROPIACION DE LAS TIC","Ley 1712 de 2014 ","Interno","Digital","Portales, Intranet y Extranet","HTML (Página Web)","Español","NO CLASIFICADA","https://docs.google.com/spreadsheets/d/10q19Q3BlwANn2UqtU9F8JcheiXy69Ptln9Es5NMPu1w/edit#gid=1638201057","N/A","N/A","N/A","N/A","N/A","N/A","N/A","a. Permitir el desarrollo del objeto del Ministerio/Fondo TIC, en los términos de los artículos 1o y 2o del Decreto 1414 de 2017."]
["322-326","INFORMACIÓN","SUBDIRECCIÓN DE ESTANDARES Y ARQUITECTURA DE TECNOLOGÍA DE LA INFORMACIÓN","Documentos de lineamientos y políticas","Documentos de lineamientos técnicos asociados a la Política de Gobierno Digital","SUBDIRECCIÓN DE ESTANDARES Y ARQUITECTURA DE TECNOLOGÍA DE LA INFORMACIÓN","2018-11-28","SUBDIRECCIÓN DE ESTANDARES Y ARQUITECTURA DE TECNOLOGÍA DE LA INFORMACIÓN","2019-01-15","MISIONAL","ACCESO_USO_APROPIACION_TIC","USO Y APROPIACION DE LAS TIC","Ley 1712 de 2014 ","Interno","Digital","Portales, Intranet y Extranet","HTML (Página Web)","Español","INFORMACIÓN PÚBLICA","https://mintic-my.sharepoint.com/personal/morjuela_mintic_gov_co/_layouts/15/onedrive.aspx?id=%2fpersonal%2fmorjuela_mintic_gov_co%2fDocuments%2fOptimizaci%c3%b3n_Compras_P%c3%bablicas_de_TI&FolderCTID=0x01200015A5EC908225574DA9B40FA8C4124080","N/A","N/A","N/A","N/A","N/A","N/A","N/A","a. Permitir el desarrollo del objeto del Ministerio/Fondo TIC, en los términos de los artículos 1o y 2o del Decreto 1414 de 2017."]
["320-327","INFORMACIÓN","DIRECCIÓN DE GOBIERNO DIGITAL","Informes de gestión","Informes de gestión oficiales de funcionarios y directivos","DIRECCIÓN DE GOBIERNO DIGITAL","2018-11-28","DIRECCIÓN DE GOBIERNO DIGITAL","2019-01-15","MISIONAL","ACCESO_USO_APROPIACION_TIC","USO Y APROPIACION DE LAS TIC","Ley 1712 de 2014 ","Interno","Digital","Portales, Intranet y Extranet","HTML (Página Web)","Español","INFORMACIÓN PÚBLICA","https://docs.google.com/spreadsheets/d/10q19Q3BlwANn2UqtU9F8JcheiXy69Ptln9Es5NMPu1w/edit#gid=1638201057","N/A","N/A","N/A","N/A","N/A","N/A","N/A","a. Permitir el desarrollo del objeto del Ministerio/Fondo TIC, en los términos de los artículos 1o y 2o del Decreto 1414 de 2017."]
["321-328","INFORMACIÓN","SUBDIRECCIÓN DE GOBIERNO EN LINEA","Documentos técnicos de apoyo a la implementación de la iniciativa de datos abiertos ","Lineamientos, vídeos, guías, manuales, presentaciones, tutoriales y preguntas frecuentes  asociados a la iniciativa de datos abiertos ","SUBDIRECCIÓN DE GOBIERNO EN LINEA","2018-11-28","SUBDIRECCIÓN DE GOBIERNO EN LINEA","2019-11-28","MISIONAL","ACCESO_USO_APROPIACION_TIC","USO Y APROPIACION DE LAS TIC","Ley 1712 de 2014 ","Interno","Digital","Portales, Intranet y Extranet","PDF","Inglés y Español","INFORMACIÓN PÚBLICA","https://herramientas.datos.gov.co/es/content/tools","N/A","N/A","N/A","N/A","N/A","N/A","N/A","a. Permitir el desarrollo del objeto del Ministerio/Fondo TIC, en los términos de los artículos 1o y 2o del Decreto 1414 de 2017."]
["321-329","SOFTWARE","SUBDIRECCIÓN DE GOBIERNO EN LINEA","Portal de Datos Abiertos del Estado Colombiano ","Solicitud de creación de serie y subserie documental - Portal de Datos Abiertos del Estado Colombiano ","SUBDIRECCIÓN DE GOBIERNO EN LINEA","2018-11-28","DIRECCIÓN DE GOBIERNO DIGITAL","2019-11-28","MISIONAL","ACCESO_USO_APROPIACION_TIC","ACCESO A LAS TIC","Ley 1712 de 2014 ","Externo","Digital","Portales, Intranet y Extranet","HTML (Página Web)","Inglés y Español","INFORMACIÓN PÚBLICA","www.datos.gov.co","N/A","N/A","N/A","N/A","N/A","N/A","N/A","a. Permitir el desarrollo del objeto del Ministerio/Fondo TIC, en los términos de los artículos 1o y 2o del Decreto 1414 de 2017."]
["321-330","INFORMACIÓN","SUBDIRECCIÓN DE GOBIERNO EN LINEA","Investigación teorica de: \"Soluciones para resolver necesidades en Gobierno Digital a través del uso de inteligencia artificial\" ","Soluciones a partir de laaplicación de la  Inteligencia Artificial, destinadas  a -como  la  que  está  detrás  del funcionamiento  de  los  vehículos  autónomos-,  aumentar  la  eficiencia  de la  administración   pública  en cinco sectores impulsados  desde  los criterios  de la  política  de  gobierno  digital,  a  saber:(i) educación, (ii) sanidad, (iii)agricultura, (iv)movilidad; y, (v)seguridad, a partir de la identificación de necesidades y objetivos estratégico","SUBDIRECCIÓN DE GOBIERNO EN LINEA","2018-11-28","SUBDIRECCIÓN DE GOBIERNO EN LINEA","2019-11-28","MISIONAL","ACCESO_USO_APROPIACION_TIC","USO Y APROPIACION DE LAS TIC","Ley 1712 de 2014, CONPES 3920 DE 2018 ","Interno","Digital","Uso de tecnologías en la nube","PDF","Español","INFORMACIÓN PÚBLICA","https://mintic.sharepoint.com/gel/9_transversales/Forms/AllItems.aspx?FolderCTID=0x0120009F295C54E9DD204FB48C234F9B95BA5B&id=%2Fgel%2F9%5Ftransversales%2F9%2E%20GestionComprasContratacion%2F2017%5F820%5FBIOS%2F2%2E%20EjecucionContractual%2FEntregables%20Adici%C3%B3n%2F12%2E%20Doc%2E%20soluciones%20a%20traves%20de%20IA%2FDoc%2E%20Soluciones%20de%20IA%20para%20sector%20estrat%C3%A9gico%2Epdf&parent=%2Fgel%2F9%5Ftransversales%2F9%2E%20GestionComprasContratacion%2F2017%5F820%5FBIOS%2F2%2E%20EjecucionContractual%2FEntregables%20Adici%C3%B3n%2F12%2E%20Doc%2E%20soluciones%20a%20traves%20de%20IA","N/A","N/A","N/A","N/A","N/A","N/A","N/A","a. Permitir el desarrollo del objeto del Ministerio/Fondo TIC, en los términos de los artículos 1o y 2o del Decreto 1414 de 2017."]
["321-331","INFORMACIÓN","SUBDIRECCIÓN DE GOBIERNO EN LINEA","Investigación teorica de: \"Investigación teorica de: Inventario de herramientas libres de análisis y resolución de problemas de analítica\"","Principales herramientas de código libre utilizadas para hacer analítica y uso de datos","SUBDIRECCIÓN DE GOBIERNO EN LINEA","2018-11-28","SUBDIRECCIÓN DE GOBIERNO EN LINEA","2019-11-28","MISIONAL","ACCESO_USO_APROPIACION_TIC","USO Y APROPIACION DE LAS TIC","Ley 1712 de 2014, CONPES 3920 DE 2019","Interno","Digital","Uso de tecnologías en la nube","PDF","Español","INFORMACIÓN PÚBLICA","https://mintic.sharepoint.com/gel/9_transversales/Forms/AllItems.aspx?FolderCTID=0x0120009F295C54E9DD204FB48C234F9B95BA5B&viewid=efba5a7f%2Dc67a%2D4258%2Daa06%2D88e95fca96be&id=%2Fgel%2F9%5Ftransversales%2F9%2E%20GestionComprasContratacion%2F2017%5F820%5FBIOS%2F2%2E%20EjecucionContractual%2FEntregables%20Adici%C3%B3n%2F6%2E%20Doc%2E%20inventario%20herramientas%20libres","N/A","N/A","N/A","N/A","N/A","N/A","N/A","a. Permitir el desarrollo del objeto del Ministerio/Fondo TIC, en los términos de los artículos 1o y 2o del Decreto 1414 de 2017."]
["321-332","INFORMACIÓN","SUBDIRECCIÓN DE GOBIERNO EN LINEA","Investigación teorica de: \"Estudio sobre uso de analítica de datos\"","Estudio indaga sobre qué son los Datos, que es la Analítica de Datos y el Big Data; cuál es el papel del Estado colombiano","SUBDIRECCIÓN DE GOBIERNO EN LINEA","2018-11-28","SUBDIRECCIÓN DE GOBIERNO EN LINEA","2019-11-28","MISIONAL","ACCESO_USO_APROPIACION_TIC","USO Y APROPIACION DE LAS TIC","Ley 1712 de 2014, CONPES 3920 DE 2020","Interno","Digital","Uso de tecnologías en la nube","PDF","Español","INFORMACIÓN PÚBLICA","https://mintic.sharepoint.com/gel/9_transversales/Forms/AllItems.aspx?FolderCTID=0x0120009F295C54E9DD204FB48C234F9B95BA5B&viewid=efba5a7f%2Dc67a%2D4258%2Daa06%2D88e95fca96be&id=%2Fgel%2F9%5Ftransversales%2F9%2E%20GestionComprasContratacion%2F2017%5F820%5FBIOS%2F2%2E%20EjecucionContractual%2FEntregables%20Adici%C3%B3n%2F13%2E%20Doc%2E%20aplicaciones%20de%20anal%C3%ADtica","N/A","N/A","N/A","N/A","N/A","N/A","N/A","a. Permitir el desarrollo del objeto del Ministerio/Fondo TIC, en los términos de los artículos 1o y 2o del Decreto 1414 de 2017."]
["322-333","INFORMACIÓN","SUBDIRECCIÓN DE ESTANDARES Y ARQUITECTURA DE TECNOLOGÍA DE LA INFORMACIÓN","Portal del Marco de Referencia de Arquitectura Empresarial","Información del Portal del Marco de Referencia de Arquitectura Empresarial","SUBDIRECCIÓN DE ESTANDARES Y ARQUITECTURA DE TECNOLOGÍA DE LA INFORMACIÓN","2018-11-28","SUBDIRECCIÓN DE ESTANDARES Y ARQUITECTURA DE TECNOLOGÍA DE LA INFORMACIÓN","2019-11-27","MISIONAL","ACCESO_USO_APROPIACION_TIC","USO Y APROPIACION DE LAS TIC","Decreto 1008 de 2018\nDecreto 415 de 2016","Interno","Digital","Portales, Intranet y Extranet","HTML (Página Web)","Español","INFORMACIÓN PÚBLICA","https://www.mintic.gov.co/marcodereferencia/","N/A","N/A","N/A","N/A","N/A","N/A","N/A","N/A"]
["320-334","SOFTWARE","DIRECCIÓN DE GOBIERNO DIGITAL","Licencia de acceso a Gartner","Membresía de acceso a recursos de la consultora de Gartner","DIRECCIÓN DE GOBIERNO DIGITAL","2018-11-28","DIRECCIÓN DE GOBIERNO DIGITAL","2019-11-27","MISIONAL","ACCESO_USO_APROPIACION_TIC","USO Y APROPIACION DE LAS TIC","N/A","N/A","N/A","N/A","HTML (Página Web)","Ingles","INFORMACIÓN PÚBLICA","https://www.gartner.com/","N/A","N/A","N/A","N/A","N/A","N/A","N/A","N/A"]
["320.1-335","INFORMACIÓN","GRUPO INTERNO DE TRABAJO DE SEGURIDAD Y PRIVACIDAD DE LA INFORMACIÓN","Modelo de seguridad y privacidad de la información","Documentos del modelo de seguridad y privacidad de la información","GRUPO INTERNO DE TRABAJO DE SEGURIDAD Y PRIVACIDAD DE LA INFORMACIÓN","2018-11-28","GRUPO INTERNO DE TRABAJO DE SEGURIDAD Y PRIVACIDAD DE LA INFORMACIÓN","2019-01-02","MISIONAL","PLANEACION_FORMULACION_POLITICAS_TIC","PLANEACION Y FORMULACION DE POLITICAS TIC","Decreto 1078 de 2018","Interno","Digital","N/A","PDF","Español","INFORMACIÓN PÚBLICA","https://www.mintic.gov.co/gestion-ti/Seguridad-TI/Modelo-de-Seguridad/","N/A","N/A","N/A","N/A","N/A","N/A","N/A","N/A"]
["322-336","INFORMACIÓN","SUBDIRECCIÓN DE ESTANDARES Y ARQUITECTURA DE TECNOLOGÍA DE LA INFORMACIÓN","Documentos técnicos de apoyo para la generación de Instrumentos de Agregación de Demanda de TI","Documentación técnica de apoyo para la generación de los anexos y formatos que hacen parte de los instrumentos de agregación de demanda de TI.","SUBDIRECCIÓN DE ESTANDARES Y ARQUITECTURA DE TECNOLOGÍA DE LA INFORMACIÓN","2018-11-28","SUBDIRECCIÓN DE ESTANDARES Y ARQUITECTURA DE TECNOLOGÍA DE LA INFORMACIÓN","2019-11-28","MISIONAL","ACCESO_USO_APROPIACION_TIC","USO Y APROPIACION DE LAS TIC","1078 decreto de gobierno digital","Interno","Digital","Portales, Intranet y Extranet","HTML (Página Web)","Español","INFORMACIÓN PÚBLICA","https://mintic-my.sharepoint.com/personal/morjuela_mintic_gov_co/_layouts/15/onedrive.aspx?id=%2fpersonal%2fmorjuela_mintic_gov_co%2fDocuments%2fOptimizaci%c3%b3n_Compras_P%c3%bablicas_de_TI&FolderCTID=0x01200015A5EC908225574DA9B40FA8C4124080","N/A","N/A","N/A","N/A","N/A","N/A","N/A","N/A"]
["320-337","SOFTWARE","DIRECCIÓN DE GOBIERNO DIGITAL","Portal Gobierno Digital","Portal abierto al público - ciudadanos que resume eventos, convocatorias y todo lo que concierne a la Dirección de Gobierno Digital.","DIRECCIÓN DE GOBIERNO DIGITAL","2018-11-28","DIRECCIÓN DE GOBIERNO DIGITAL","2019-11-25","MISIONAL","ACCESO_USO_APROPIACION_TIC","ACCESO A LAS TIC","1078 decreto de gobierno digital","Interno","Digital","Documentos de Archivo - electrónicos","PDF","Español","INFORMACIÓN PÚBLICA","https://www.gobiernodigital.gov.co/623/w3-channel.html","N/A","N/A","N/A","N/A","N/A","N/A","N/A","N/A"]
["320-338","SERVICIOS","DIRECCIÓN DE GOBIERNO DIGITAL","Redes Sociales (Twitter, Facebook)","Redes Sociales de la Dirección de Gobierno Digital abierta a la ciudadanía","DIRECCIÓN DE GOBIERNO DIGITAL","2018-11-28","DIRECCIÓN DE GOBIERNO DIGITAL","2019-11-25","ESTRATEGICO","COMUNICACION_ESTRATEGICA","COMUNICACION ESTRATEGICA","1078 decreto de gobierno digital","Interno","Digital","Documentos de Archivo - electrónicos","PDF","Español","INFORMACIÓN PÚBLICA","https://mintic-my.sharepoint.com/:b:/r/personal/smorenoc_mintic_gov_co/Documents/Activos%20de%20Informaci%C3%B3n/Canales%20de%20comunicaci%C3%B3n.pdf?csf=1&e=XC2dJM","N/A","N/A","N/A","N/A","N/A","N/A","N/A","N/A"]
["320-339","INFORMACIÓN","DIRECCIÓN DE GOBIERNO DIGITAL","Estrategias de Comunicaciones","Estrategias de Comunicación dentro de la Dirección de Gobierno Digital en el MinTIC","DIRECCIÓN DE GOBIERNO DIGITAL","2018-11-28","DIRECCIÓN DE GOBIERNO DIGITAL","2019-11-25","ESTRATEGICO","COMUNICACION_ESTRATEGICA","COMUNICACION ESTRATEGICA","1078 decreto de gobierno digital","Interno","Digital","Documentos de Archivo - electrónicos","Base de datos","Español","INFORMACIÓN PÚBLICA","https://mintic-my.sharepoint.com/:b:/r/personal/smorenoc_mintic_gov_co/Documents/Activos%20de%20Informaci%C3%B3n/Estrategias%20de%20comunicaciones.pdf?csf=1&e=RPML3s","N/A","N/A","N/A","N/A","N/A","N/A","Datos sensibles","N/A"]
["320-340","SOFTWARE","DIRECCIÓN DE GOBIERNO DIGITAL","Bases de Datos","Bases de datos de entidades, CIOs y colaboradores de la Dirección de Gobierno Digital a las cuales se les envía correo electrónico con fines informativos","DIRECCIÓN DE GOBIERNO DIGITAL","2018-11-28","DIRECCIÓN DE GOBIERNO DIGITAL","2019-11-25","ESTRATEGICO","COMUNICACION_ESTRATEGICA","COMUNICACION ESTRATEGICA","1078 decreto de gobierno digital","Interno","Digital","Documentos de Archivo - electrónicos","N/A","Español","INFORMACIÓN PÚBLICA","https://mintic-my.sharepoint.com/:f:/r/personal/smorenoc_mintic_gov_co/Documents/Activos%20de%20Informaci%C3%B3n/Bases%20de%20datos?csf=1&e=u05GxT","N/A","N/A","N/A","N/A","N/A","N/A","N/A","N/A"]
["320-341","INFORMACIÓN","DIRECCIÓN DE GOBIERNO DIGITAL","Procedimientos internos","Requerimientos sobre divulgación, procesos a tener en cuenta dentro de la Dirección y manejo de los mismos.","DIRECCIÓN DE GOBIERNO DIGITAL","2018-11-28","DIRECCIÓN DE GOBIERNO DIGITAL","2019-11-25","ESTRATEGICO","COMUNICACION_ESTRATEGICA","COMUNICACION ESTRATEGICA","1078 decreto de gobierno digital","Interno","Digital","Documentos de Archivo - electrónicos","N/A","Español","INFORMACIÓN PÚBLICA","https://mintic-my.sharepoint.com/:w:/r/personal/smorenoc_mintic_gov_co/Documents/Activos%20de%20Informaci%C3%B3n/Procedimientos%20internos.docx?d=waef5ecd6ae1241df86dc4d80f9cb7feb&csf=1&e=5b2vNO","N/A","N/A","N/A","N/A","N/A","N/A","N/A","N/A"]
["330-342","INFORMACIÓN","DIRECCIÓN DE TRANSFORMACIÓN DIGITAL","Informe de Gestión DTD","Registra la información sobre el avance y control sobre las funciones de la dependencia ","DIRECCIÓN DE TRANSFORMACIÓN DIGITAL","2018-11-28","OFICINA ASESORA DE PLANEACIÓN Y ESTUDIOS SECTORIALES","2019-01-31","ESTRATEGICO","COMUNICACION_ESTRATEGICA","COMUNICACION ESTRATEGICA","Aarticulo 74 de la Ley 1474 de 2011","Interno","Digital","Archivos Institucionales - electrónico","PDF","Español","INFORMACIÓN PÚBLICA","https://www.mintic.gov.co/portal/604/articles-1785_informe_gestion_plan_accion_fontic_mintic_2018_v20190131.pdf","N/A","N/A","N/A","N/A","N/A","N/A","N/A","N/A"]
["330-343","INFORMACIÓN","DIRECCIÓN DE TRANSFORMACIÓN DIGITAL","Peticiones, Quejas, Reclamos, Sugerencias y Denuncias","Solicitudes, Respuesta y/o Trámites","DIRECCIÓN DE TRANSFORMACIÓN DIGITAL","2018-11-28","GRUPO INTERNO DE TRABAJO DE FORTALECIMIENTO DE LAS RELACIONES CON LOS GRUPOS DE INTERES","2019-01-02","APOYO","GESTION_RECURSOS","GESTION DE ATENCION A GRUPOS DE INTERES","Articulo 23 CPC, Ley 1437 de 2011 y Ley 1755 de 2015","Externo","Físico","Sistema de Administración de Documentos","N/A","Español","INFORMACIÓN PÚBLICA","ALFANET","N/A","N/A","N/A","N/A","N/A","N/A","Dato personal privado ","f. Atender y resolver peticiones, quejas, reclamos y sugerencias."]
["330-344","INFORMACIÓN","DIRECCIÓN DE TRANSFORMACIÓN DIGITAL","Informe al Congreso","Registra la información de gestión de la DTD al congreso","DIRECCIÓN DE TRANSFORMACIÓN DIGITAL","2018-11-28","DIRECCIÓN DE TRANSFORMACIÓN DIGITAL","2019-01-02","ESTRATEGICO","COMUNICACION_ESTRATEGICA","COMUNICACION ESTRATEGICA","Articulo 206 de la constitución política de colombia","Externo","Físico","Archivos Institucionales - electrónico","PDF","Español","INFORMACIÓN PÚBLICA","https://mintic.sharepoint.com/sites/DirecciondeTransformacionDigital/Documentos%20compartidos/Forms/AllItems.aspx?id=%2Fsites%2FDirecciondeTransformacionDigital%2FDocumentos%20compartidos%2F01%5FGESTI%C3%93N%2F04%5FInformes%2FINF%2E%20DIRECTOR%20TD%2FInf%20al%20Congreso%2Epdf&parent=%2Fsites%2FDirecciondeTransformacionDigital%2FDocumentos%20compartidos%2F01%5FGESTI%C3%93N%2F04%5FInformes%2FINF%2E%20DIRECTOR%20TD","N/A","N/A","N/A","N/A","N/A","N/A","N/A","N/A"]
["331-345","INFORMACIÓN","SUBDIRECCIÓN DE COMERCIO ELECTRÓNICO","Informe de Gestión SCE","Registra la información sobre el avance y control sobre las funciones de la dependencia ","SUBDIRECCIÓN DE COMERCIO ELECTRÓNICO","2018-11-28","OFICINA ASESORA DE PLANEACIÓN Y ESTUDIOS SECTORIALES","2019-01-31","ESTRATEGICO","COMUNICACION_ESTRATEGICA","COMUNICACION ESTRATEGICA","Aarticulo 74 de la Ley 1474 de 2011","Interno","Digital","Archivos Institucionales - electrónico","PDF","Español","INFORMACIÓN PÚBLICA","https://www.mintic.gov.co/portal/604/articles-1785_informe_gestion_plan_accion_fontic_mintic_2018_v20190131.pdf","N/A","N/A","N/A","N/A","N/A","N/A","N/A","N/A"]
["331-346","INFORMACIÓN","SUBDIRECCIÓN DE COMERCIO ELECTRÓNICO","Peticiones, Quejas, Reclamos, Sugerencias y Denuncias","Solicitudes, Respuesta y/o Trámites","SUBDIRECCIÓN DE COMERCIO ELECTRÓNICO","2018-11-28","GRUPO INTERNO DE TRABAJO DE FORTALECIMIENTO DE LAS RELACIONES CON LOS GRUPOS DE INTERES","2019-01-02","APOYO","GESTION_RECURSOS","GESTION DE ATENCION A GRUPOS DE INTERES","Articulo 23 CPC, Ley 1437 de 2011 y Ley 1755 de 2015","Externo","Físico","Sistema de Administración de Documentos","N/A","Español","INFORMACIÓN PÚBLICA","ALFANET","N/A","N/A","N/A","N/A","N/A","N/A","Dato personal privado ","f. Atender y resolver peticiones, quejas, reclamos y sugerencias."]
["332-347","INFORMACIÓN","SUBDIRECCIÓN DE DIGITALIZACIÓN SECTORIAL","Peticiones,quejas, reclamos, sugerencias y denuncias","Solicitud,respuesta y/o trámite","SUBDIRECCIÓN DE DIGITALIZACIÓN SECTORIAL","2018-11-28","GRUPO INTERNO DE TRABAJO DE FORTALECIMIENTO DE LAS RELACIONES CON LOS GRUPOS DE INTERES","2019-01-02","APOYO","GESTION_RECURSOS","GESTION DE ATENCION A GRUPOS DE INTERES","Art 23 - CPC , ley 1437 de 2011, y ley 1755 de 2015","Externo","Físico","Sistema de Administración de Documentos","N/A","Español","INFORMACIÓN PÚBLICA","ALFANET","N/A","N/A","N/A","N/A","N/A","N/A","Dato personal privado ","f. Atender y resolver peticiones, quejas, reclamos y sugerencias."]
["332-348","INFORMACIÓN","SUBDIRECCIÓN DE DIGITALIZACIÓN SECTORIAL","Informes  de gestión","Registra la información sobre el avance y control de las funciones de la dependencia","SUBDIRECCIÓN DE DIGITALIZACIÓN SECTORIAL","2018-11-28","OFICINA ASESORA DE PLANEACIÓN Y ESTUDIOS SECTORIALES","2019-01-31","ESTRATEGICO","COMUNICACION_ESTRATEGICA","COMUNICACION ESTRATEGICA","Art 74 - Ley 1474 del 2011","Interno","Digital","Archivos Institucionales - electrónico","PDF","Español","INFORMACIÓN PÚBLICA","https://www.mintic.gov.co/portal/604/articles-1785_informes_gestion_lan_accion_fontic_mintic_2018","N/A","N/A","N/A","N/A","N/A","N/A","N/A","N/A"]
["340-349","INFORMACIÓN","DIRECCIÓN DE DESARROLLO DE LA INDUSTRIA DE TECNOLOGIAS DE LA INFORMACIÓN","Convenios y contratos","Actas de juntas y reuniones de seguimiento que se desarrollan en el contexto de avance de convenios  y contratos.","DIRECCIÓN DE DESARROLLO DE LA INDUSTRIA DE TECNOLOGIAS DE LA INFORMACIÓN","2018-11-28","DIRECCIÓN DE DESARROLLO DE LA INDUSTRIA DE TECNOLOGIAS DE LA INFORMACIÓN","2019-11-26","MISIONAL","ACCESO_USO_APROPIACION_TIC","FORTALECIMIENTO DE LA INDUSTRIA TIC","Del artículo 18 Y 19 de la Ley 1712 de 2014","Interno","Digital","Documentos de Archivo - electrónicos","PDF","Español","INFORMACIÓN PÚBLICA RESERVADA","APLICATIVO FONDO UNICO TIC","SI","Del artículo 18 Y 19 de la Ley 1712 de 2014","literal A\nParágrafo","Reserva parcial","2018-11-22","4 AÑOS","N/A","N/A"]
["340-350","INFORMACIÓN","DIRECCIÓN DE DESARROLLO DE LA INDUSTRIA DE TECNOLOGIAS DE LA INFORMACIÓN","Actas de grupo comité primario","Seguimiento a la gestión de las Subdirecciones y la Dirección de acuerdo a los compromisos pactados","DIRECCIÓN DE DESARROLLO DE LA INDUSTRIA DE TECNOLOGIAS DE LA INFORMACIÓN","2018-11-28","DIRECCIÓN DE DESARROLLO DE LA INDUSTRIA DE TECNOLOGIAS DE LA INFORMACIÓN","2019-11-26","MISIONAL","ACCESO_USO_APROPIACION_TIC","FORTALECIMIENTO DE LA INDUSTRIA TIC","Del artículo 18 Y 19 de la Ley 1712 de 2014","Interno","Digital","Documentos de Archivo - electrónicos","PDF","Español","INFORMACIÓN PÚBLICA RESERVADA","APLICATIVO FONDO UNICO TIC","SI","Del artículo 18 Y 19 de la Ley 1712 de 2014","literal A\nParágrafo","Reserva parcial","2018-11-22","4 AÑOS","N/A","N/A"]
["340-351","INFORMACIÓN","DIRECCIÓN DE DESARROLLO DE LA INDUSTRIA DE TECNOLOGIAS DE LA INFORMACIÓN","Evidencias de los procesos de contratación","Los Documentos que se generan:\nEstudios Previos\nEvaluaciones de Procesos\nSolicitudes de CDP\nInformes de Supervisión\nActas de Seguimiento\nDocumentos de vigencias futuras","DIRECCIÓN DE DESARROLLO DE LA INDUSTRIA DE TECNOLOGIAS DE LA INFORMACIÓN","2018-11-28","DIRECCIÓN DE DESARROLLO DE LA INDUSTRIA DE TECNOLOGIAS DE LA INFORMACIÓN","2019-11-26","MISIONAL","ACCESO_USO_APROPIACION_TIC","FORTALECIMIENTO DE LA INDUSTRIA TIC","Del artículo 18 Y 19 de la Ley 1712 de 2014","Interno","Físico","Documentos de Archivo - físicos","Papel","Español","INFORMACIÓN PÚBLICA","APLICATIVO FONDO UNICO TIC","SI","Del artículo 18 Y 19 de la Ley 1712 de 2014","literal A\nParágrafo","Reserva parcial","2016-12-22","ILIMITADA","N/A","N/A"]
["340-352","INFORMACIÓN","DIRECCIÓN DE DESARROLLO DE LA INDUSTRIA DE TECNOLOGIAS DE LA INFORMACIÓN"," Respuestas a  peticiones, quejas, reclamos, sugerencias y denuncias - pqrsd","Respuestas a  peticiones, quejas, reclamos, sugerencias y denuncias - pqrsd","DIRECCIÓN DE DESARROLLO DE LA INDUSTRIA DE TECNOLOGIAS DE LA INFORMACIÓN","2018-11-28","DIRECCIÓN DE DESARROLLO DE LA INDUSTRIA DE TECNOLOGIAS DE LA INFORMACIÓN","2019-11-26","MISIONAL","ACCESO_USO_APROPIACION_TIC","FORTALECIMIENTO DE LA INDUSTRIA TIC","N/A","N/A","Digital","Documentos de Archivo - electrónicos","XLS","Español","INFORMACIÓN PÚBLICA","ALFANET","N/A","N/A","N/A","N/A","N/A","N/A","Dato personal público","f. Atender y resolver peticiones, quejas, reclamos y sugerencias."]
["340-353","INFORMACIÓN","DIRECCIÓN DE DESARROLLO DE LA INDUSTRIA DE TECNOLOGIAS DE LA INFORMACIÓN","Informe de supervisión","Reportes de seguimiento a los contratos y/o convenios de la Dirección ","DIRECCIÓN DE DESARROLLO DE LA INDUSTRIA DE TECNOLOGIAS DE LA INFORMACIÓN","2018-11-28","DIRECCIÓN DE DESARROLLO DE LA INDUSTRIA DE TECNOLOGIAS DE LA INFORMACIÓN","2019-11-26","MISIONAL","ACCESO_USO_APROPIACION_TIC","FORTALECIMIENTO DE LA INDUSTRIA TIC","Del artículo 18 Y 19 de la Ley 1712 de 2014","Interno","Digital","Documentos de Archivo - electrónicos","PDF","Español","INFORMACIÓN PÚBLICA","SECOP","SI","Del artículo 18 Y 19 de la Ley 1712 de 2014","literal A Paragrafo ","Reserva parcial","2016-12-22","ILIMITADA","N/A","N/A"]
["340-354","INFORMACIÓN","DIRECCIÓN DE DESARROLLO DE LA INDUSTRIA DE TECNOLOGIAS DE LA INFORMACIÓN","Planes de Acción y Proyecto de Inversión","En estos documentos se contempla la lista de acciones a desarrollar en la propuesta TI con presupuesto, metas e indicadores. ","DIRECCIÓN DE DESARROLLO DE LA INDUSTRIA DE TECNOLOGIAS DE LA INFORMACIÓN","2018-11-28","DIRECCIÓN DE DESARROLLO DE LA INDUSTRIA DE TECNOLOGIAS DE LA INFORMACIÓN","2019-11-26","MISIONAL","ACCESO_USO_APROPIACION_TIC","FORTALECIMIENTO DE LA INDUSTRIA TIC","N/A","Interno","Digital","Sistemas de Información corporativos","XLS","Español","INFORMACIÓN PÚBLICA","WWW.MINTIC.GOV.CO","N/A","N/A","N/A","Sin reserva","N/A","N/A","N/A","N/A"]
["340-355","SOFTWARE","DIRECCIÓN DE DESARROLLO DE LA INDUSTRIA DE TECNOLOGIAS DE LA INFORMACIÓN","Micrositios de los GIT de la dirección","Micrositios de Apps.co y Talento Digital","DIRECCIÓN DE DESARROLLO DE LA INDUSTRIA DE TECNOLOGIAS DE LA INFORMACIÓN","2018-11-28","DIRECCIÓN DE DESARROLLO DE LA INDUSTRIA DE TECNOLOGIAS DE LA INFORMACIÓN","2019-11-26","MISIONAL","ACCESO_USO_APROPIACION_TIC","FORTALECIMIENTO DE LA INDUSTRIA TIC","N/A","Interno","Digital","Portales, Intranet y Extranet","HTML (Página Web)","Español","INFORMACIÓN PÚBLICA","https://www.mintic.gov.co/portal/inicio/Ministerio/Direccion-de-Promocion-TIC/Oferta-TIC/","N/A","N/A","N/A","N/A","N/A","N/A","N/A","N/A"]
["320.3-356","INFORMACIÓN","GRUPO INTERNO DE TRABAJO DE POLITICA","Politica de Gobierno Digital (Manual)","Documento que establece los lineamientos y estándares para la implementación de la política de Gobierno Digital","GRUPO INTERNO DE TRABAJO DE POLITICA","2018-11-28","GRUPO INTERNO DE TRABAJO DE POLITICA","2019-01-02","MISIONAL","PLANEACION_FORMULACION_POLITICAS_TIC","PLANEACION Y FORMULACION DE POLITICAS TIC","Decreto 1008 de 2018","Interno","Digital","Portales, Intranet y Extranet","PDF","Español","INFORMACIÓN PÚBLICA","https://www.gobiernodigital.gov.co/623/articles-81473_recurso_1.pdf","N/A","N/A","N/A","Sin reserva","N/A","N/A","N/A","N/A"]
["320.3-357","INFORMACIÓN","GRUPO INTERNO DE TRABAJO DE POLITICA","Portal de Gobierno Digital","Sitio web donde se publica y almacena la información relacionada con la política de Gobierno Digital, guías y lineamientos para su implementación","GRUPO INTERNO DE TRABAJO DE POLITICA","2018-11-28","GRUPO INTERNO DE TRABAJO DE POLITICA","2019-06-01","MISIONAL","PLANEACION_FORMULACION_POLITICAS_TIC","PLANEACION Y FORMULACION DE POLITICAS TIC","Decreto 1008 de 2018","Interno","Digital","Portales, Intranet y Extranet","HTML (Página Web)","Español","INFORMACIÓN PÚBLICA","https://www.gobiernodigital.gov.co/623/w3-channel.html","N/A","N/A","N/A","N/A","N/A","N/A","N/A","N/A"]
["320.3-358","INFORMACIÓN","GRUPO INTERNO DE TRABAJO DE POLITICA","Portal del Centro de Innovación Pública Digital","Sitio web del Centro de innovación pública digital con documentos sobre ejercicios de innovación, experiencias, investigaciones aplicadas e instrumentos de innovación para las entidades publicas","GRUPO INTERNO DE TRABAJO DE POLITICA","2018-11-28","GRUPO INTERNO DE TRABAJO DE POLITICA","2019-01-02","MISIONAL","GESTION_CONOCIMIENTO_SECTOR_TIC","I+D+I","Decreto 1414 de 2017 - Funciones Dirección de Gobierno Digital","Interno","Digital","Portales, Intranet y Extranet","HTML (Página Web)","Español","INFORMACIÓN PÚBLICA","http://centrodeinnovacion.gobiernoenlinea.gov.co/es","N/A","N/A","N/A","N/A","N/A","N/A","N/A","N/A"]
["320.3-359","INFORMACIÓN","GRUPO INTERNO DE TRABAJO DE POLITICA","Indices Internacionales (información para cuestionarios)","Diligenciamiento de cuestionarios de índices Internacionales (OURData Index, Digital Government Indicators)","GRUPO INTERNO DE TRABAJO DE POLITICA","2018-11-28","GRUPO INTERNO DE TRABAJO DE POLITICA","2019-08-23","MISIONAL","PLANEACION_FORMULACION_POLITICAS_TIC","PLANEACION Y FORMULACION DE POLITICAS TIC","Decreto 1414 de 2017 - Funciones Dirección de Gobierno Digital","Interno","Digital","Documentos de Archivo - electrónicos","PDF","Ingles","INFORMACIÓN PÚBLICA","https://mintic-my.sharepoint.com/:b:/g/personal/hnino_mintic_gov_co/EQHKw2wo1WRHjNp2DhaQlEoBcGBctDjX1QNVyojTRKIhMA?e=RJlC3T","N/A","N/A","N/A","N/A","N/A","N/A","N/A","N/A"]
["320.3-360","INFORMACIÓN","GRUPO INTERNO DE TRABAJO DE POLITICA","Herramienta de autodiagnostico","Instrumento de autogestion para medicion del cumplimiento y  avance en la implementacion de la politica de gobierno digital dirigida a entitdas publicas nacionales y territoriales ","GRUPO INTERNO DE TRABAJO DE POLITICA","2018-11-28","GRUPO INTERNO DE TRABAJO DE POLITICA","2019-03-30","MISIONAL","SEGUIMIENTO_CONTROL_POLITICAS_TIC","SEGUIMIENTO Y EVALUACION DE POLITICAS TIC","Decreto 1008 de 2018","Interno","Digital","Disco duros, servidores, discos o medios portables, cintas o medios de video y audio (análogo o digital), etc.","HTML (Página Web)","Español","INFORMACIÓN PÚBLICA","https//:autodiagnosticogobdigital.gov.co","N/A","N/A","N/A","N/A","N/A","N/A","N/A","N/A"]
["320.3-361","INFORMACIÓN","GRUPO INTERNO DE TRABAJO DE POLITICA","Sección de mediciones Gobierno Digital","Sitio web en donde se publican resultados y  analisis de la medicion de gobierno digital en formato excel, power point, reporte interactivo power BI y PDF","GRUPO INTERNO DE TRABAJO DE POLITICA","2018-11-28","GRUPO INTERNO DE TRABAJO DE POLITICA","2019-01-02","MISIONAL","SEGUIMIENTO_CONTROL_POLITICAS_TIC","SEGUIMIENTO Y EVALUACION DE POLITICAS TIC","Decreto 1008 de 2018","Interno","Digital","Portales, Intranet y Extranet","HTML (Página Web)","Español","INFORMACIÓN PÚBLICA","https://www.gobiernodigital.gov.co/623/w3-propertyvalue-7651.html","N/A","N/A","N/A","N/A","N/A","N/A","N/A","N/A"]
["320.3-362","INFORMACIÓN","GRUPO INTERNO DE TRABAJO DE POLITICA","Estudios en materia de Gobierno Digital","Estudios e investigaciones sobre instrumentos, resultados o impactos de la implementación política de Gobierno Digital en Colombia","GRUPO INTERNO DE TRABAJO DE POLITICA","2018-11-28","GRUPO INTERNO DE TRABAJO DE POLITICA","2019-01-02","MISIONAL","PLANEACION_FORMULACION_POLITICAS_TIC","PLANEACION Y FORMULACION DE POLITICAS TIC","Decreto 1008 de 2018","Interno","Digital","Documentos de Archivo - electrónicos","PDF","Español","INFORMACIÓN PÚBLICA","https://www.gobiernodigital.gov.co/623/w3-propertyvalue-7654.html","N/A","N/A","N/A","N/A","N/A","N/A","N/A","N/A"]
["320.3-363","INFORMACIÓN","GRUPO INTERNO DE TRABAJO DE POLITICA","Documento con índice e indicadores de Gobierno Digital","Documento donde se presentan los resultados del indice de gobierno digital de las entidades publicas nacionales y territoriales","GRUPO INTERNO DE TRABAJO DE POLITICA","2018-11-28","GRUPO INTERNO DE TRABAJO DE POLITICA","2019-01-02","MISIONAL","SEGUIMIENTO_CONTROL_POLITICAS_TIC","SEGUIMIENTO Y EVALUACION DE POLITICAS TIC","Decreto 1008 de 2018","Interno","Digital","Documentos de Archivo - electrónicos","PDF","Español","INFORMACIÓN PÚBLICA","https://www.gobiernodigital.gov.co/623/w3-propertyvalue-7651.html","N/A","N/A","N/A","N/A","N/A","N/A","N/A","N/A"]
["320.3-364","INFORMACIÓN","GRUPO INTERNO DE TRABAJO DE POLITICA","Documento con resultados del proyecto de I+D+I","Documento general con resultados de los proyectos que aplicaron las fases del proceso I+D+I del Ministerio TIC","GRUPO INTERNO DE TRABAJO DE POLITICA","2018-11-28","GRUPO INTERNO DE TRABAJO DE POLITICA","2019-01-02","MISIONAL","GESTION_CONOCIMIENTO_SECTOR_TIC","I+D+I","Decreto 1414 de 2017 - Funciones Dirección de Gobierno Digital","Interno","Digital","Documentos de Archivo - electrónicos","PDF","Español","INFORMACIÓN PÚBLICA","https://mintic.sharepoint.com/sites/cipd/Documentos%20compartidos/Forms/AllItems.aspx?newTargetListUrl=%2Fsites%2Fcipd%2FDocumentos%20compartidos&viewpath=%2Fsites%2Fcipd%2FDocumentos%20compartidos%2FForms%2FAllItems%2Easpx&viewid=1034f1ef%2D44d7%2D4caa%2Da5fc%2Dc752cb47c19a&id=%2Fsites%2Fcipd%2FDocumentos%20compartidos%2F01%20COORDINACION%20CIPD%2FProceso%20I%2BD%2BI","N/A","N/A","N/A","N/A","N/A","N/A","N/A","N/A"]
["320.3-365","INFORMACIÓN","GRUPO INTERNO DE TRABAJO DE POLITICA","Reportes de avance de Colombia en Indices Internacionales","Informe de avances de Indices Internacionales","GRUPO INTERNO DE TRABAJO DE POLITICA","2018-11-28","GRUPO INTERNO DE TRABAJO DE POLITICA","2019-11-14","MISIONAL","PLANEACION_FORMULACION_POLITICAS_TIC","PLANEACION Y FORMULACION DE POLITICAS TIC","Decreto 1414 de 2017 - Funciones Dirección de Gobierno Digital","Interno","Digital","Documentos de Archivo - electrónicos","PDF","Español","INFORMACIÓN PÚBLICA","https://mintic-my.sharepoint.com/:b:/g/personal/hnino_mintic_gov_co/EQkIq_R48atBt_60EI-JTWsBYDnQDW9s5uoaolTU0IPVfA?e=5VHDOI","N/A","N/A","N/A","N/A","N/A","N/A","N/A","N/A"]
["320.3-366","INFORMACIÓN","GRUPO INTERNO DE TRABAJO DE POLITICA","Reportes","Informes sobre la política, informes para presidencia, Ministerio TIC, otras entidades nacionales, informes a organismos internacionales","GRUPO INTERNO DE TRABAJO DE POLITICA","2018-11-28","GRUPO INTERNO DE TRABAJO DE POLITICA","2019-01-02","MISIONAL","PLANEACION_FORMULACION_POLITICAS_TIC","PLANEACION Y FORMULACION DE POLITICAS TIC","Decreto 1414 de 2017 - Funciones Dirección de Gobierno Digital","Interno","Digital","Documentos de Archivo - electrónicos","PDF","Español","INFORMACIÓN PÚBLICA","https://mintic.sharepoint.com/gel/1_marco_regulatorio/Forms/AllItems.aspx?viewid=17460923%2D9ee8%2D4d8e%2D9201%2D078088703123&id=%2Fgel%2F1%5Fmarco%5Fregulatorio%2FVarios","N/A","N/A","N/A","N/A","N/A","N/A","N/A","N/A"]
["320.2-367","INFORMACIÓN","GRUPO INTERNO DE TRABAJO DE CIUDADES INTELIGENTES","Modelo de madurez de ciudades y territorios inteligentes ","Lineamientos que permiten la generación de capacidades en las entidades territoriales necesarias para el diseño y ejecución de iniciativas de ciudad inteligente. ","GRUPO INTERNO DE TRABAJO DE CIUDADES INTELIGENTES","2018-11-28","GRUPO INTERNO DE TRABAJO DE CIUDADES INTELIGENTES","2019-09-01","MISIONAL","ACCESO_USO_APROPIACION_TIC","USO Y APROPIACION DE LAS TIC"," Plan Estratégico Institucional 2018 - 2022\nDecreto 1414 de 2017\nDecreto 1008 de 2018","Interno","Digital","Uso de tecnologías en la nube","PDF","Español","INFORMACIÓN PÚBLICA","https://mintic.sharepoint.com/gel/5_acompanamiento/Forms/AllItems.aspx?id=%2Fgel%2F5_acompanamiento%2F3-Ciudades%20inteligentes","N/A","N/A","N/A","N/A","N/A","N/A","N/A","N/A"]
["320.2-368","SOFTWARE","GRUPO INTERNO DE TRABAJO DE CIUDADES INTELIGENTES","Sello de Excelencia de Gobierno Digital","Plataforma a través de la cual opera el modelo para la certificación de calidad de los productos digitales de las entidades públicas em Colombia- Portal Sello de Excelencia Gobierno Digital, se requiere la creación de la subserie en la TRD","GRUPO INTERNO DE TRABAJO DE CIUDADES INTELIGENTES","2018-11-28","GRUPO INTERNO DE TRABAJO DE CIUDADES INTELIGENTES","2019-01-02","MISIONAL","ACCESO_USO_APROPIACION_TIC","USO Y APROPIACION DE LAS TIC","\nLey 1978 de 2019\nDecreto 1414 de 2017\nDecreto 1008 de 2018","Interno","Digital","Sistemas de Información corporativos","HTML (Página Web)","Español","INFORMACIÓN PÚBLICA","https://sellodeexcelencia.gov.co/banner/5","N/A","N/A","N/A","N/A","N/A","N/A","N/A","N/A"]
["320.2-369","SOFTWARE","GRUPO INTERNO DE TRABAJO DE CIUDADES INTELIGENTES","Máxima Velocidad ","Plataforma a través de la cual opera la estrategia de gamificación a través de la cual las  entidades públicas mejoran su desempeño y los resultados en el marco de la implementación de la Política de Gobierno Digital. Se requiere la creación de la subserie en la TRD","GRUPO INTERNO DE TRABAJO DE CIUDADES INTELIGENTES","2018-11-28","GRUPO INTERNO DE TRABAJO DE CIUDADES INTELIGENTES","2019-01-02","MISIONAL","ACCESO_USO_APROPIACION_TIC","USO Y APROPIACION DE LAS TIC","Ley 1978 de 2019\nDecreto 1008 de 2018\nDecreto 1414 de 2017","Interno","Digital","Sistemas de Información corporativos","HTML (Página Web)","Español","INFORMACIÓN PÚBLICA","https://www.maximavelocidad.gov.co/647/w3-channel.html","N/A","N/A","N/A","N/A","N/A","N/A","N/A","N/A"]
["400-370","INFORMACIÓN","SECRETARÍA GENERAL","Actas de reunion con los sindicatos ","Documento donde se consigna lo sucedido en las mesas de trabajo con los sindicatos compromisos y demas aspectos que se tratan. ","SECRETARÍA GENERAL","2018-11-28","SECRETARÍA GENERAL","2019-01-02","APOYO","GESTION_RECURSOS","GESTION DEL TALENTO HUMANO","Ley 584 de 2000","Externo","Físico","Documentos de Archivo - físicos","N/A","Español","INFORMACIÓN PÚBLICA","Archivo ","N/A","N/A","N/A","N/A","N/A","N/A","Dato personal público","g. Conservar evidencia de los eventos de entrenamiento y sensibilización realizados, audiencias de adjudicación de contratos, reuniones internas y externas."]
["400-371","INFORMACIÓN","SECRETARÍA GENERAL","CIRCULAR","Documento que se utiliza para comunicar cualquier noticia, información o evento actual y de interés para el ministerio y sus servidores. ","SECRETARÍA GENERAL","2018-11-28","SECRETARÍA GENERAL","2019-01-02","APOYO","GESTION_RECURSOS","GESTION DEL TALENTO HUMANO","Ley 584 de 2000","Externo","Físico","Documentos de Archivo - físicos","N/A","Español","INFORMACIÓN PÚBLICA","intranet - correo ","N/A","N/A","N/A","N/A","N/A","N/A","Dato personal público","N/A"]
["400-372","INFORMACIÓN","SECRETARÍA GENERAL","decreto","Acto administrativo que posee un contenido normativo reglamentario y jerarquía inferior a las leyes, que expone la decisión sobre la materia. ","SECRETARÍA GENERAL","2018-11-28","SECRETARÍA GENERAL","2019-01-02","APOYO","GESTION_RECURSOS","GESTION DEL TALENTO HUMANO","Ley 584 de 2000","Externo","Físico","Documentos de Archivo - físicos","N/A","Español","INFORMACIÓN PÚBLICA","intranet - correo ","N/A","N/A","N/A","N/A","N/A","N/A","Dato personal público","N/A"]
["400-373","INFORMACIÓN","SECRETARÍA GENERAL","Manual de contratacion ","documento guia para llevar a coabo las actividades propias en un proceso de contratación ","SECRETARÍA GENERAL","2018-11-28","GRUPO INTERNO DE TRABAJO DE CONTRATACIÓN","2019-01-02","APOYO","GESTION_RECURSOS","GESTION DEL TALENTO HUMANO","Ley 80 de 1993 ","Externo","Digital","Sistemas de Información corporativos","PDF","Español","INFORMACIÓN PÚBLICA","isolucion","N/A","N/A","N/A","N/A","N/A","N/A","N/A","N/A"]
["400-374","INFORMACIÓN","SECRETARÍA GENERAL","manual de funciones ","Documento que contiene los requisitos, funciones y competencias de los cargos que actualmente requiere el mintic para su funcionamiento ","SECRETARÍA GENERAL","2018-11-28","GRUPO INTERNO DE TRABAJO DE GESTIÓN DE TALENTO HUMANO","2019-01-02","APOYO","GESTION_RECURSOS","GESTION DEL TALENTO HUMANO","Ley 80 de 1994","Externo","Digital","Sistemas de Información corporativos","PDF","Español","INFORMACIÓN PÚBLICA","pagina web Mintic","N/A","N/A","N/A","N/A","N/A","N/A","N/A","N/A"]
["400-375","INFORMACIÓN","SECRETARÍA GENERAL","Solicitudes varias grupos de interés","solicitudes de los grupos de interres","SECRETARÍA GENERAL","2018-11-28","GRUPO INTERNO DE TRABAJO DE FORTALECIMIENTO DE LAS RELACIONES CON LOS GRUPOS DE INTERES","2019-01-02","ESTRATEGICO","GESTION_ATENCION_GRUPOS_INTERES","GESTION DE ATENCION A GRUPOS DE INTERES","Ley 1437 del 2011","Externo","Físico","Documentos de Archivo - físicos","Papel","Español","INFORMACIÓN PÚBLICA","pagina web Mintic","N/A","N/A","N/A","N/A","N/A","N/A","Dato personal privado ","f. Atender y resolver peticiones, quejas, reclamos y sugerencias."]
["400-376","INFORMACIÓN","SECRETARÍA GENERAL","RESOLUCIONES MINISTERIO","Acto administrativo que posee un contenido decisivo y reglamentario para la entidad ","SECRETARÍA GENERAL","2018-11-28","SECRETARÍA GENERAL","2019-01-02","ESTRATEGICO","ARQUITECTURA_INSTITUCIONAL","FORTALECIMIENTO ORGANIZACIONAL","Ley 1437 del 2011","Interno","Físico","Documentos de Archivo - físicos","Papel","Español","INFORMACIÓN PÚBLICA","pagina web Mintic","N/A","N/A","N/A","N/A","N/A","N/A","Dato personal público","N/A"]
["400-377","INFORMACIÓN","SECRETARÍA GENERAL","RESOLUCIONES FONDO ","Acto administrativo que posee un contenido decisivo y reglamentario para la entidad ","SECRETARÍA GENERAL","2018-11-28","SECRETARÍA GENERAL","2019-01-02","ESTRATEGICO","ARQUITECTURA_INSTITUCIONAL","FORTALECIMIENTO ORGANIZACIONAL","Ley 1437 del 2011","Interno","Físico","Documentos de Archivo - físicos","Papel","Español","INFORMACIÓN PÚBLICA","pagina web Mintic","N/A","N/A","N/A","N/A","N/A","N/A","Dato personal público","N/A"]
["401-378","INFORMACIÓN","GRUPO INTERNO DE TRABAJO DE CONTRATACIÓN","ACTAS DE COMITÉ DE CONTRATACIÓN","SE ELABORAN LAS ACTAS DE LAS SESIONES DEL  COMITÉ ASESOR DE CNTRATACIÓN , LUEGO SE SUSCRIBEN POR PARTE DE LOS INTEGRANTES Y SE INCORPORAN EN UNA CARPETA","GRUPO INTERNO DE TRABAJO DE CONTRATACIÓN","2018-11-28","GRUPO INTERNO DE TRABAJO DE CONTRATACIÓN","2019-11-29","APOYO","GESTION_RECURSOS","GESTION DE COMPRAS Y CONTRATACION","Resolución 1045-2015","Interno","Físico","Documentos de Archivo - físicos","Papel","Español","INFORMACIÓN PÚBLICA","ARCHIVO","N/A","N/A","N/A","N/A","N/A","N/A","N/A","c)       Realizar la selección, contratación y/o vinculación de servidores públicos y contratistas de prestación de servicios de la entidad."]
["401-379","INFORMACIÓN","GRUPO INTERNO DE TRABAJO DE CONTRATACIÓN","ACTAS DE SEGUIMIENTO AL PAA DE ADQUISICIONES","SE ELABORAN LAS ACTAS DE LAS SESIONES DEL COMITÉ  ASESOR DE CONTRATACIÓN , LUEGO SE SUSCRIBEN POR PARTE DE LOS INTEGRANTES Y SE INCORPORAN EN UNA CARPETA","GRUPO INTERNO DE TRABAJO DE CONTRATACIÓN","2018-11-28","GRUPO INTERNO DE TRABAJO DE CONTRATACIÓN","2019-11-30","APOYO","GESTION_RECURSOS","GESTION DE COMPRAS Y CONTRATACION","Resolución 1125-2016","Interno","Físico","Documentos de Archivo - físicos","Papel","Español","INFORMACIÓN PÚBLICA","ARCHIVO","N/A","N/A","N/A","N/A","N/A","N/A","N/A","c)       Realizar la selección, contratación y/o vinculación de servidores públicos y contratistas de prestación de servicios de la entidad."]
["401-380","INFORMACIÓN","GRUPO INTERNO DE TRABAJO DE CONTRATACIÓN","CONTRATOS ","SE ELABORAN DE ACUERDO CON LAS SOLICITUDES DE LAS ÁREAS DE LA ENTIDAD","GRUPO INTERNO DE TRABAJO DE CONTRATACIÓN","2018-11-28","GRUPO INTERNO DE TRABAJO DE FORTALECIMIENTO DE LAS RELACIONES CON LOS GRUPOS DE INTERES","2019-12-01","APOYO","GESTION_RECURSOS","GESTION DE COMPRAS Y CONTRATACION","LEY 80 DTOS REGLAMENTARIOS","Externo","Físico","Archivos Institucionales - físicos","Papel","Español","INFORMACIÓN PÚBLICA CLASIFICADA","ARCHIVO Y EN  EL SECOP","SI","Del artículo 18 Y 19 de la Ley 1712 de 2014","literal A\nParágrafo","Reserva parcial","2018-11-22","4 AÑOS","Dato personal público","b)       Desarrollar los estudios previos y procesos de selección para la contratación oficial del Ministerio/Fondo TIC destinada a garantizar el funcionamiento de la entidad y la ejecución de proyectos y el desarrollo de esquemas de gerencia de proyectos."]
["401-381","INFORMACIÓN","GRUPO INTERNO DE TRABAJO DE CONTRATACIÓN","CONTRATOS DE ARRENDAMIENTO DEL FONDO","SE ELABORAN DE ACUERDO CON LAS SOLICITUDES DE LAS ÁREAS DE LA ENTIDAD","GRUPO INTERNO DE TRABAJO DE CONTRATACIÓN","2018-11-28","GRUPO INTERNO DE TRABAJO DE FORTALECIMIENTO DE LAS RELACIONES CON LOS GRUPOS DE INTERES","2019-12-02","APOYO","GESTION_RECURSOS","GESTION DE COMPRAS Y CONTRATACION","LEY 80 DTOS REGLAMENTARIOS","Externo","Físico","Documentos de Archivo - físicos","Papel","Español","INFORMACIÓN PÚBLICA CLASIFICADA","ARCHIVO Y EN  EL SECOP","SI","Del artículo 18 Y 19 de la Ley 1712 de 2014","literal A\nParágrafo","Reserva parcial","2018-11-22","4 AÑOS","Dato personal público","b)       Desarrollar los estudios previos y procesos de selección para la contratación oficial del Ministerio/Fondo TIC destinada a garantizar el funcionamiento de la entidad y la ejecución de proyectos y el desarrollo de esquemas de gerencia de proyectos."]
["401-382","INFORMACIÓN","GRUPO INTERNO DE TRABAJO DE CONTRATACIÓN","CONTRATOS DE ARRENDAMIENTO DELMINISTERIO","SE ELABORAN DE ACUERDO CON LAS SOLICITUDES DE LAS ÁREAS DE LA ENTIDAD","GRUPO INTERNO DE TRABAJO DE CONTRATACIÓN","2018-11-28","GRUPO INTERNO DE TRABAJO DE FORTALECIMIENTO DE LAS RELACIONES CON LOS GRUPOS DE INTERES","2019-12-03","APOYO","GESTION_RECURSOS","GESTION DE COMPRAS Y CONTRATACION","LEY 80 DTOS REGLAMENTARIOS","Externo","Físico","Documentos de Archivo - físicos","Papel","Español","INFORMACIÓN PÚBLICA CLASIFICADA","ARCHIVO Y EN  EL SECOP","SI","Del artículo 18 Y 19 de la Ley 1712 de 2014","literal A\nParágrafo","Reserva parcial","2018-11-22","4 AÑOS","Dato personal público","b)       Desarrollar los estudios previos y procesos de selección para la contratación oficial del Ministerio/Fondo TIC destinada a garantizar el funcionamiento de la entidad y la ejecución de proyectos y el desarrollo de esquemas de gerencia de proyectos."]
["401-383","INFORMACIÓN","GRUPO INTERNO DE TRABAJO DE CONTRATACIÓN","CONTRATOS CIENCIA TECNOLOGÍA E INNOVAVIÓN  DEL FONDO","SE ELABORAN DE ACUERDO CON LAS SOLICITUDES DE LAS ÁREAS DE LA ENTIDAD","GRUPO INTERNO DE TRABAJO DE CONTRATACIÓN","2018-11-28","GRUPO INTERNO DE TRABAJO DE FORTALECIMIENTO DE LAS RELACIONES CON LOS GRUPOS DE INTERES","2019-12-04","APOYO","GESTION_RECURSOS","GESTION DE COMPRAS Y CONTRATACION","LEY 80 DTOS REGLAMENTARIOS","Externo","Físico","Documentos de Archivo - físicos","Papel","Español","INFORMACIÓN PÚBLICA","ARCHIVO Y EN  EL SECOP","N/A","N/A","N/A","N/A","N/A","N/A","Dato personal público","b)       Desarrollar los estudios previos y procesos de selección para la contratación oficial del Ministerio/Fondo TIC destinada a garantizar el funcionamiento de la entidad y la ejecución de proyectos y el desarrollo de esquemas de gerencia de proyectos."]
["401-384","INFORMACIÓN","GRUPO INTERNO DE TRABAJO DE CONTRATACIÓN","MODIFICACIÓN , OTROSI, PRORROGA ADICIONES","SE ELEBORA DE ACUERDO CON LAS SOLICITUDES DE LAS AREAS DE LAENTIDAD","GRUPO INTERNO DE TRABAJO DE CONTRATACIÓN","2018-11-28","GRUPO INTERNO DE TRABAJO DE FORTALECIMIENTO DE LAS RELACIONES CON LOS GRUPOS DE INTERES","2019-12-04","APOYO","GESTION_RECURSOS","GESTION DE COMPRAS Y CONTRATACION","LEY 80 DTOS REGLAMENTARIOS","Externo","Físico","Documentos de Archivo - físicos","Papel","Español","INFORMACIÓN PÚBLICA","ARCHIVO Y EN  EL SECOP","N/A","N/A","N/A","N/A","N/A","N/A","Dato personal público","b)       Desarrollar los estudios previos y procesos de selección para la contratación oficial del Ministerio/Fondo TIC destinada a garantizar el funcionamiento de la entidad y la ejecución de proyectos y el desarrollo de esquemas de gerencia de proyectos."]
["401-385","INFORMACIÓN","GRUPO INTERNO DE TRABAJO DE CONTRATACIÓN","CONTRATOS DE CIENCIA TECNOLOGÍA E INNOVACIÓN DEL MINISTERIO","SE ELABORAN DE ACUERDO CON LAS SOLICITUDES DE LAS ÁREAS DE LA ENTIDAD",{"$f":"IF(C392=\"\",\"\",C392)","v":"GRUPO INTERNO DE TRABAJO DE CONTRATACIÓN"},"2018-11-28","GRUPO INTERNO DE TRABAJO DE FORTALECIMIENTO DE LAS RELACIONES CON LOS GRUPOS DE INTERES","2019-12-06","APOYO","GESTION_RECURSOS","GESTION DE COMPRAS Y CONTRATACION","LEY 80 DTOS REGLAMENTARIOS","Externo","Físico","Documentos de Archivo - físicos","Papel","Español","INFORMACIÓN PÚBLICA","ARCHIVO Y EN  EL SECOP","N/A","N/A","N/A","N/A","N/A","N/A","Dato personal público","b)       Desarrollar los estudios previos y procesos de selección para la contratación oficial del Ministerio/Fondo TIC destinada a garantizar el funcionamiento de la entidad y la ejecución de proyectos y el desarrollo de esquemas de gerencia de proyectos."]
["401-386","INFORMACIÓN","GRUPO INTERNO DE TRABAJO DE CONTRATACIÓN","COTRATOS DE COMODATO DEL FONDO","SE ELABORAN DE ACUERDO COT LAS SOLICITUDES DE LAS ÁREAS DE LA ENTIDAD","GRUPO INTERNO DE TRABAJO DE CONTRATACIÓN","2018-11-28","GRUPO INTERNO DE TRABAJO DE FORTALECIMIENTO DE LAS RELACIONES CON LOS GRUPOS DE INTERES","2019-12-07","APOYO","GESTION_RECURSOS","GESTION DE COMPRAS Y CONTRATACION","LEY 80 DTOS REGLAMENTARIOS","Externo","Físico","Documentos de Archivo - físicos","Papel","Español","INFORMACIÓN PÚBLICA","ARCHIVO Y EN  EL SECOP","N/A","N/A","N/A","N/A","N/A","N/A","Dato personal público","b)       Desarrollar los estudios previos y procesos de selección para la contratación oficial del Ministerio/Fondo TIC destinada a garantizar el funcionamiento de la entidad y la ejecución de proyectos y el desarrollo de esquemas de gerencia de proyectos."]
["401-387","INFORMACIÓN","GRUPO INTERNO DE TRABAJO DE CONTRATACIÓN","ACTA DE INICIO","SE ELABORAN DE ACUERDO CON  LAS SOLICITUDES DE LAS ÁREAS DE LA ENTIDAD","GRUPO INTERNO DE TRABAJO DE CONTRATACIÓN","2018-11-28","GRUPO INTERNO DE TRABAJO DE FORTALECIMIENTO DE LAS RELACIONES CON LOS GRUPOS DE INTERES","2019-12-08","APOYO","GESTION_RECURSOS","GESTION DE COMPRAS Y CONTRATACION","LEY 80 DTOS REGLAMENTARIOS","Externo","Físico","Documentos de Archivo - físicos","Papel","Español","INFORMACIÓN PÚBLICA","ARCHIVO Y EN  EL SECOP","N/A","N/A","N/A","N/A","N/A","N/A","Dato personal público","b)       Desarrollar los estudios previos y procesos de selección para la contratación oficial del Ministerio/Fondo TIC destinada a garantizar el funcionamiento de la entidad y la ejecución de proyectos y el desarrollo de esquemas de gerencia de proyectos."]
["401-388","INFORMACIÓN","GRUPO INTERNO DE TRABAJO DE CONTRATACIÓN","CONTRATOS DE COMODATO DEL MINISTERIO","SE ELABORAN DE ACUERDO CON LAS SOLICITUDES DE LAS ÁREAS DE LA ENTIDAD","GRUPO INTERNO DE TRABAJO DE CONTRATACIÓN","2018-11-28","GRUPO INTERNO DE TRABAJO DE FORTALECIMIENTO DE LAS RELACIONES CON LOS GRUPOS DE INTERES","2019-12-09","APOYO","GESTION_RECURSOS","GESTION DE COMPRAS Y CONTRATACION","LEY 80 DTOS REGLAMENTARIOS","Externo","Físico","Documentos de Archivo - físicos","Papel","Español","INFORMACIÓN PÚBLICA","ARCHIVO Y EN  EL SECOP","N/A","N/A","N/A","N/A","N/A","N/A","Dato personal público","b)       Desarrollar los estudios previos y procesos de selección para la contratación oficial del Ministerio/Fondo TIC destinada a garantizar el funcionamiento de la entidad y la ejecución de proyectos y el desarrollo de esquemas de gerencia de proyectos."]
["401-389","INFORMACIÓN","GRUPO INTERNO DE TRABAJO DE CONTRATACIÓN","CONTRATOS DE COMPRAVENTA DEL FONDO","SE  ELABORAN DE ACUERDO CON LAS SOLICITUDES DE LAS ÁREAS DE LA ENTIDAD","GRUPO INTERNO DE TRABAJO DE CONTRATACIÓN","2018-11-28","GRUPO INTERNO DE TRABAJO DE FORTALECIMIENTO DE LAS RELACIONES CON LOS GRUPOS DE INTERES","2019-12-10","APOYO","GESTION_RECURSOS","GESTION DE COMPRAS Y CONTRATACION","LEY 80 DTOS REGLAMENTARIOS","Externo","Físico","Documentos de Archivo - físicos","Papel","Español","INFORMACIÓN PÚBLICA","ARCHIVO Y EN  EL SECOP","N/A","N/A","N/A","N/A","N/A","N/A","Dato personal público","b)       Desarrollar los estudios previos y procesos de selección para la contratación oficial del Ministerio/Fondo TIC destinada a garantizar el funcionamiento de la entidad y la ejecución de proyectos y el desarrollo de esquemas de gerencia de proyectos."]
["401-390","INFORMACIÓN","GRUPO INTERNO DE TRABAJO DE CONTRATACIÓN","modificaciones , otrosi, prórrogas, adiciones","SE ELABORAN DE ACUERDO CON LAS SOLICITUDES DE LAS ÁREAS DE LA ENTIDAD","GRUPO INTERNO DE TRABAJO DE CONTRATACIÓN","2018-11-28","GRUPO INTERNO DE TRABAJO DE FORTALECIMIENTO DE LAS RELACIONES CON LOS GRUPOS DE INTERES","2019-12-11","APOYO","GESTION_RECURSOS","GESTION DE COMPRAS Y CONTRATACION","LEY 80 DTOS REGLAMENTARIOS","Externo","Físico","Documentos de Archivo - físicos","Papel","Español","INFORMACIÓN PÚBLICA","ARCHIVO Y EN  EL SECOP","N/A","N/A","N/A","N/A","N/A","N/A","Dato personal público","b)       Desarrollar los estudios previos y procesos de selección para la contratación oficial del Ministerio/Fondo TIC destinada a garantizar el funcionamiento de la entidad y la ejecución de proyectos y el desarrollo de esquemas de gerencia de proyectos."]
["401-391","INFORMACIÓN","GRUPO INTERNO DE TRABAJO DE CONTRATACIÓN","AVISO DE CONVOCATORIA ARTICULO 30 LEY 80 DE 1993","SE ELABORAN DE ACUERDO LAS SOLICITUDES DE LAS ÁREAS DE LA ENTIDAD","GRUPO INTERNO DE TRABAJO DE CONTRATACIÓN","2018-11-28","GRUPO INTERNO DE TRABAJO DE FORTALECIMIENTO DE LAS RELACIONES CON LOS GRUPOS DE INTERES","2019-12-12","APOYO","GESTION_RECURSOS","GESTION DE COMPRAS Y CONTRATACION","LEY 80 DTOS REGLAMENTARIOS","Externo","Físico","Documentos de Archivo - físicos","Papel","Español","INFORMACIÓN PÚBLICA","ARCHIVO Y EN  EL SECOP","N/A","N/A","N/A","N/A","N/A","N/A","Dato personal público","b)       Desarrollar los estudios previos y procesos de selección para la contratación oficial del Ministerio/Fondo TIC destinada a garantizar el funcionamiento de la entidad y la ejecución de proyectos y el desarrollo de esquemas de gerencia de proyectos."]
["401-392","INFORMACIÓN","GRUPO INTERNO DE TRABAJO DE CONTRATACIÓN","CONTRATOS DE COMPRAVENTA DELMINISTERIO","SE ELABORAN DE ACUERDO CON LAS SOLICITUDES DE LAS ÁREAS DE LA ENTIDAD","GRUPO INTERNO DE TRABAJO DE CONTRATACIÓN","2018-11-28","GRUPO INTERNO DE TRABAJO DE FORTALECIMIENTO DE LAS RELACIONES CON LOS GRUPOS DE INTERES","2019-12-13","APOYO","GESTION_RECURSOS","GESTION DE COMPRAS Y CONTRATACION","LEY 80 DTOS REGLAMENTARIOS","Externo","Físico","Documentos de Archivo - físicos","Papel","Español","INFORMACIÓN PÚBLICA","ARCHIVO Y EN  EL SECOP","N/A","N/A","N/A","N/A","N/A","N/A","Dato personal público","b)       Desarrollar los estudios previos y procesos de selección para la contratación oficial del Ministerio/Fondo TIC destinada a garantizar el funcionamiento de la entidad y la ejecución de proyectos y el desarrollo de esquemas de gerencia de proyectos."]
["401-393","INFORMACIÓN","GRUPO INTERNO DE TRABAJO DE CONTRATACIÓN","CONTRATOS DE CNSULTORIA DEL FONDO","SE ELABORAN DE ACUERDO CON LAS SOLICITUDES DE LAS ÁREAS DE LA ENTIDAD","GRUPO INTERNO DE TRABAJO DE CONTRATACIÓN","2018-11-28","GRUPO INTERNO DE TRABAJO DE FORTALECIMIENTO DE LAS RELACIONES CON LOS GRUPOS DE INTERES","2019-12-14","APOYO","GESTION_RECURSOS","GESTION DE COMPRAS Y CONTRATACION","LEY 80 DTOS REGLAMENTARIOS","Externo","Físico","Documentos de Archivo - físicos","Papel","Español","INFORMACIÓN PÚBLICA","ARCHIVO Y EN  EL SECOP","N/A","N/A","N/A","N/A","N/A","N/A","Dato personal público","b)       Desarrollar los estudios previos y procesos de selección para la contratación oficial del Ministerio/Fondo TIC destinada a garantizar el funcionamiento de la entidad y la ejecución de proyectos y el desarrollo de esquemas de gerencia de proyectos."]
["401-394","INFORMACIÓN","GRUPO INTERNO DE TRABAJO DE CONTRATACIÓN","CONTRATOS DE CONSULTORIA DEL MINISTERIO","SE ELABORAN DE ACUERDO CON LAS SOLICITUDES DE LAS ÁREAS DE LA ENTIDAD","GRUPO INTERNO DE TRABAJO DE CONTRATACIÓN","2018-11-28","GRUPO INTERNO DE TRABAJO DE FORTALECIMIENTO DE LAS RELACIONES CON LOS GRUPOS DE INTERES","2019-12-15","APOYO","GESTION_RECURSOS","GESTION DE COMPRAS Y CONTRATACION","LEY 80 DTOS REGLAMENTARIOS","Externo","Físico","Documentos de Archivo - físicos","Papel","Español","INFORMACIÓN PÚBLICA","ARCHIVO Y EN  EL SECOP","N/A","N/A","N/A","N/A","N/A","N/A","Dato personal público","b)       Desarrollar los estudios previos y procesos de selección para la contratación oficial del Ministerio/Fondo TIC destinada a garantizar el funcionamiento de la entidad y la ejecución de proyectos y el desarrollo de esquemas de gerencia de proyectos."]
["401-395","INFORMACIÓN","GRUPO INTERNO DE TRABAJO DE CONTRATACIÓN","CONTRATOS DE INTERVENTORÍA DEL FONDO","SE ELABORAN DE ACUERDO CON LAS SOLICITUDES DE LAS ÁREAS DE LA ENTIDAD","GRUPO INTERNO DE TRABAJO DE CONTRATACIÓN","2018-11-28","GRUPO INTERNO DE TRABAJO DE FORTALECIMIENTO DE LAS RELACIONES CON LOS GRUPOS DE INTERES","2019-12-16","APOYO","GESTION_RECURSOS","GESTION DE COMPRAS Y CONTRATACION","LEY 80 DTOS REGLAMENTARIOS","Externo","Físico","Documentos de Archivo - físicos","Papel","Español","INFORMACIÓN PÚBLICA","ARCHIVO Y EN  EL SECOP","N/A","N/A","N/A","N/A","N/A","N/A","Dato personal público","b)       Desarrollar los estudios previos y procesos de selección para la contratación oficial del Ministerio/Fondo TIC destinada a garantizar el funcionamiento de la entidad y la ejecución de proyectos y el desarrollo de esquemas de gerencia de proyectos."]
["401-396","INFORMACIÓN","GRUPO INTERNO DE TRABAJO DE CONTRATACIÓN","CONTRATOS DE INTERVENTORÍA DEL MINISTERIO","SE ELABORAN DE ACUERDO CON LAS SOLICITUDES DE LAS ÁREAS DE LA ENTIDAD","GRUPO INTERNO DE TRABAJO DE CONTRATACIÓN","2018-11-28","GRUPO INTERNO DE TRABAJO DE FORTALECIMIENTO DE LAS RELACIONES CON LOS GRUPOS DE INTERES","2019-12-17","APOYO","GESTION_RECURSOS","GESTION DE COMPRAS Y CONTRATACION","LEY 80 DTOS REGLAMENTARIOS","Externo","Físico","Documentos de Archivo - físicos","Papel","Español","INFORMACIÓN PÚBLICA","ARCHIVO Y EN  EL SECOP","N/A","N/A","N/A","N/A","N/A","N/A","Dato personal público","b)       Desarrollar los estudios previos y procesos de selección para la contratación oficial del Ministerio/Fondo TIC destinada a garantizar el funcionamiento de la entidad y la ejecución de proyectos y el desarrollo de esquemas de gerencia de proyectos."]
["401-397","INFORMACIÓN","GRUPO INTERNO DE TRABAJO DE CONTRATACIÓN","CONTRATOS DE OBRA DEL FONDO","SE ELABORAN DE ACUERDO CON LAS SOLICITUDES DE LAS ÁREAS DE LA ENTIDAD","GRUPO INTERNO DE TRABAJO DE CONTRATACIÓN","2018-11-28","GRUPO INTERNO DE TRABAJO DE FORTALECIMIENTO DE LAS RELACIONES CON LOS GRUPOS DE INTERES","2019-12-18","APOYO","GESTION_RECURSOS","GESTION DE COMPRAS Y CONTRATACION","LEY 80 DTOS REGLAMENTARIOS","Externo","Físico","Documentos de Archivo - electrónicos","Papel","Español","INFORMACIÓN PÚBLICA","ARCHIVO Y EN  EL SECOP","N/A","N/A","N/A","N/A","N/A","N/A","Dato personal público","b)       Desarrollar los estudios previos y procesos de selección para la contratación oficial del Ministerio/Fondo TIC destinada a garantizar el funcionamiento de la entidad y la ejecución de proyectos y el desarrollo de esquemas de gerencia de proyectos."]
["401-398","INFORMACIÓN","GRUPO INTERNO DE TRABAJO DE CONTRATACIÓN","CONTRATOS DE OBRA DEL MINISTERIO","SE ELABORAN DE ACUERDO CON LAS SOLICITUDES DE LAS ÁREAS DE LA ENTIDAD","GRUPO INTERNO DE TRABAJO DE CONTRATACIÓN","2018-11-28","GRUPO INTERNO DE TRABAJO DE FORTALECIMIENTO DE LAS RELACIONES CON LOS GRUPOS DE INTERES","2019-12-19","APOYO","GESTION_RECURSOS","GESTION DE COMPRAS Y CONTRATACION","LEY 80 DTOS REGLAMENTARIOS","Externo","Físico","Documentos de Archivo - físicos","Papel","Español","INFORMACIÓN PÚBLICA","ARCHIVO Y EN  EL SECOP","N/A","N/A","N/A","N/A","N/A","N/A","Dato personal público","b)       Desarrollar los estudios previos y procesos de selección para la contratación oficial del Ministerio/Fondo TIC destinada a garantizar el funcionamiento de la entidad y la ejecución de proyectos y el desarrollo de esquemas de gerencia de proyectos."]
["401-399","INFORMACIÓN","GRUPO INTERNO DE TRABAJO DE CONTRATACIÓN","CONTRATOS DE PRESTACIÓN DE SERVICIOS DEL FONDO","PR ELABORAAN LAS CONTRATOS DEL COMITÉ DE CNTRATCOIÓN , LUEGO PR SUSCRIBEN POR PARTE DE LOS INTEGRANTES Y PR INCORPORAN ST UNA CARPETA","GRUPO INTERNO DE TRABAJO DE CONTRATACIÓN","2018-11-28","GRUPO INTERNO DE TRABAJO DE FORTALECIMIENTO DE LAS RELACIONES CON LOS GRUPOS DE INTERES","2019-12-20","APOYO","GESTION_RECURSOS","GESTION DE COMPRAS Y CONTRATACION","LEY 80 DTOS REGLAMENTARIOS","Externo","Físico","Documentos de Archivo - físicos","Papel","Español","INFORMACIÓN PÚBLICA","ARCHIVO Y EN  EL SECOP","N/A","N/A","N/A","N/A","N/A","N/A","Dato personal público","b)       Desarrollar los estudios previos y procesos de selección para la contratación oficial del Ministerio/Fondo TIC destinada a garantizar el funcionamiento de la entidad y la ejecución de proyectos y el desarrollo de esquemas de gerencia de proyectos."]
["401-400","INFORMACIÓN","GRUPO INTERNO DE TRABAJO DE CONTRATACIÓN","CONTRATOS DE PRESTAION DE SERVICIOS MINISTERIO","SE ELABORAN DE ACUERDO CON LAS SOLICITUDES DE LAS ÁREAS DE LA ENTIDAD","GRUPO INTERNO DE TRABAJO DE CONTRATACIÓN","2018-11-28","GRUPO INTERNO DE TRABAJO DE FORTALECIMIENTO DE LAS RELACIONES CON LOS GRUPOS DE INTERES","2019-12-21","APOYO","GESTION_RECURSOS","GESTION DE COMPRAS Y CONTRATACION","LEY 80 DTOS REGLAMENTARIOS","Externo","Físico","Documentos de Archivo - físicos","Papel","Español","INFORMACIÓN PÚBLICA","ARCHIVO Y EN  EL SECOP","N/A","N/A","N/A","N/A","N/A","N/A","Dato personal público","b)       Desarrollar los estudios previos y procesos de selección para la contratación oficial del Ministerio/Fondo TIC destinada a garantizar el funcionamiento de la entidad y la ejecución de proyectos y el desarrollo de esquemas de gerencia de proyectos."]
["401-401","INFORMACIÓN","GRUPO INTERNO DE TRABAJO DE CONTRATACIÓN","CONTRATOS DE PRESTACION DE SERVICIOS PROFESIONALES Y DE APOYO A LA GESSTIÓN DEL FONDO","SE ELABORAN DE ACUERDO CON LAS SOLICITUDES DE LAS ÁREAS DE LA ENTIDAD","GRUPO INTERNO DE TRABAJO DE CONTRATACIÓN","2018-11-28","GRUPO INTERNO DE TRABAJO DE FORTALECIMIENTO DE LAS RELACIONES CON LOS GRUPOS DE INTERES","2019-12-22","APOYO","GESTION_RECURSOS","GESTION DE COMPRAS Y CONTRATACION","LEY 80 DTOS REGLAMENTARIOS","Externo","Físico","Documentos de Archivo - físicos","Papel","Español","INFORMACIÓN PÚBLICA","ARCHIVO Y EN  EL SECOP","N/A","N/A","N/A","N/A","N/A","N/A","Dato personal público","b)       Desarrollar los estudios previos y procesos de selección para la contratación oficial del Ministerio/Fondo TIC destinada a garantizar el funcionamiento de la entidad y la ejecución de proyectos y el desarrollo de esquemas de gerencia de proyectos."]
["401-402","INFORMACIÓN","GRUPO INTERNO DE TRABAJO DE CONTRATACIÓN","CONTRATOS DE PRESTACION DE SERVICIOS PROFESIONALES Y DE APOYO A LA GESTIÓN DEL MINISTERIO","SE ELABORAN DE ACUERDO CON LAS SOLICITUDES DE LAS ÁREAS DE LA ENTIDAD","GRUPO INTERNO DE TRABAJO DE CONTRATACIÓN","2018-11-28","GRUPO INTERNO DE TRABAJO DE FORTALECIMIENTO DE LAS RELACIONES CON LOS GRUPOS DE INTERES","2019-12-23","APOYO","GESTION_RECURSOS","GESTION DE COMPRAS Y CONTRATACION","LEY 80 DTOS REGLAMENTARIOS","Externo","Físico","Documentos de Archivo - físicos","Papel","Español","INFORMACIÓN PÚBLICA","ARCHIVO Y EN  EL SECOP","N/A","N/A","N/A","N/A","N/A","N/A","Dato personal público","b)       Desarrollar los estudios previos y procesos de selección para la contratación oficial del Ministerio/Fondo TIC destinada a garantizar el funcionamiento de la entidad y la ejecución de proyectos y el desarrollo de esquemas de gerencia de proyectos."]
["401-403","INFORMACIÓN","GRUPO INTERNO DE TRABAJO DE CONTRATACIÓN","CONTRATOS DE SUMINISTRO DEL FONDO","SE ELABORAN DE ACUERDO CON LAS SOLICITUDES DE LAS ÁREAS DE LA ENTIDAD","GRUPO INTERNO DE TRABAJO DE CONTRATACIÓN","2018-11-28","GRUPO INTERNO DE TRABAJO DE FORTALECIMIENTO DE LAS RELACIONES CON LOS GRUPOS DE INTERES","2019-12-24","APOYO","GESTION_RECURSOS","GESTION DE COMPRAS Y CONTRATACION","LEY 80 DTOS REGLAMENTARIOS","Externo","Físico","Documentos de Archivo - físicos","Papel","Español","INFORMACIÓN PÚBLICA","ARCHIVO Y EN  EL SECOP","N/A","N/A","N/A","N/A","N/A","N/A","Dato personal público","b)       Desarrollar los estudios previos y procesos de selección para la contratación oficial del Ministerio/Fondo TIC destinada a garantizar el funcionamiento de la entidad y la ejecución de proyectos y el desarrollo de esquemas de gerencia de proyectos."]
["401-404","INFORMACIÓN","GRUPO INTERNO DE TRABAJO DE CONTRATACIÓN","CONTRATOS DE SUMINISTRO DEL MINITERIO","SE ELABORAN DE ACUERDO CON LAS SOLICITUDES DE LAS ÁREAS DE LA ENTIDAD","GRUPO INTERNO DE TRABAJO DE CONTRATACIÓN","2018-11-28","GRUPO INTERNO DE TRABAJO DE FORTALECIMIENTO DE LAS RELACIONES CON LOS GRUPOS DE INTERES","2019-12-25","APOYO","GESTION_RECURSOS","GESTION DE COMPRAS Y CONTRATACION","LEY 80 DTOS REGLAMENTARIOS","Externo","Físico","Documentos de Archivo - físicos","Papel","Español","INFORMACIÓN PÚBLICA","ARCHIVO Y EN  EL SECOP","N/A","N/A","N/A","N/A","N/A","N/A","Dato personal público","b)       Desarrollar los estudios previos y procesos de selección para la contratación oficial del Ministerio/Fondo TIC destinada a garantizar el funcionamiento de la entidad y la ejecución de proyectos y el desarrollo de esquemas de gerencia de proyectos."]
["401-405","INFORMACIÓN","GRUPO INTERNO DE TRABAJO DE CONTRATACIÓN","CONTRATOS INTERADMINISTRATIVOS DEL FONDO","SE ELABORAN DE ACUERDO CON LAS SOLICITUDES DE LAS ÁREAS DE LA ENTIDAD","GRUPO INTERNO DE TRABAJO DE CONTRATACIÓN","2018-11-28","GRUPO INTERNO DE TRABAJO DE FORTALECIMIENTO DE LAS RELACIONES CON LOS GRUPOS DE INTERES","2019-12-26","APOYO","GESTION_RECURSOS","GESTION DE COMPRAS Y CONTRATACION","LEY 80 DTOS REGLAMENTARIOS","Externo","Físico","Documentos de Archivo - físicos","Papel","Español","INFORMACIÓN PÚBLICA","ARCHIVO Y EN  EL SECOP","N/A","N/A","N/A","N/A","N/A","N/A","Dato personal público","b)       Desarrollar los estudios previos y procesos de selección para la contratación oficial del Ministerio/Fondo TIC destinada a garantizar el funcionamiento de la entidad y la ejecución de proyectos y el desarrollo de esquemas de gerencia de proyectos."]
["401-406","INFORMACIÓN","GRUPO INTERNO DE TRABAJO DE CONTRATACIÓN","CONTRATOS INTERADMINISTRATIVOS DEL MINISTERIO","SE ELABORAN DE ACUERDO CON LAS SOLICITUDES DE LAS ÁREAS DE LA ENTIDAD","GRUPO INTERNO DE TRABAJO DE CONTRATACIÓN","2018-11-28","GRUPO INTERNO DE TRABAJO DE FORTALECIMIENTO DE LAS RELACIONES CON LOS GRUPOS DE INTERES","2019-12-27","APOYO","GESTION_RECURSOS","GESTION DE COMPRAS Y CONTRATACION","LEY 80 DTOS REGLAMENTARIOS","Externo","Físico","Documentos de Archivo - físicos","Papel","Español","INFORMACIÓN PÚBLICA","ARCHIVO Y EN  EL SECOP","N/A","N/A","N/A","N/A","N/A","N/A","Dato personal público","b)       Desarrollar los estudios previos y procesos de selección para la contratación oficial del Ministerio/Fondo TIC destinada a garantizar el funcionamiento de la entidad y la ejecución de proyectos y el desarrollo de esquemas de gerencia de proyectos."]
["401-407","INFORMACIÓN","GRUPO INTERNO DE TRABAJO DE CONTRATACIÓN","CONVENIOS","SE ELABORAN DE ACUERDO CON LAS SOLICITUDES DE LAS ÁREAS DE LA ENTIDAD","GRUPO INTERNO DE TRABAJO DE CONTRATACIÓN","2018-11-28","GRUPO INTERNO DE TRABAJO DE FORTALECIMIENTO DE LAS RELACIONES CON LOS GRUPOS DE INTERES","2019-12-28","APOYO","GESTION_RECURSOS","GESTION DE COMPRAS Y CONTRATACION","LEY 80 DTOS REGLAMENTARIOS","Externo","Físico","Documentos de Archivo - físicos","Papel","Español","INFORMACIÓN PÚBLICA","ARCHIVO Y EN  EL SECOP","N/A","N/A","N/A","N/A","N/A","N/A","Dato personal público","b)       Desarrollar los estudios previos y procesos de selección para la contratación oficial del Ministerio/Fondo TIC destinada a garantizar el funcionamiento de la entidad y la ejecución de proyectos y el desarrollo de esquemas de gerencia de proyectos."]
["401-408","INFORMACIÓN","GRUPO INTERNO DE TRABAJO DE CONTRATACIÓN","CONVENIOS DE ASOCIACIÓN DEL FONDO","SE ELABORAN DE ACUERDO CON LAS SOLICITUDES DE LAS ÁREAS DE LA ENTIDAD","GRUPO INTERNO DE TRABAJO DE CONTRATACIÓN","2018-11-28","GRUPO INTERNO DE TRABAJO DE FORTALECIMIENTO DE LAS RELACIONES CON LOS GRUPOS DE INTERES","2019-12-29","APOYO","GESTION_RECURSOS","GESTION DE COMPRAS Y CONTRATACION","LEY 80 DTOS REGLAMENTARIOS","Externo","Físico","Documentos de Archivo - físicos","Papel","Español","INFORMACIÓN PÚBLICA","ARCHIVO Y EN  EL SECOP","N/A","N/A","N/A","N/A","N/A","N/A","Dato personal público","b)       Desarrollar los estudios previos y procesos de selección para la contratación oficial del Ministerio/Fondo TIC destinada a garantizar el funcionamiento de la entidad y la ejecución de proyectos y el desarrollo de esquemas de gerencia de proyectos."]
["401-409","INFORMACIÓN","GRUPO INTERNO DE TRABAJO DE CONTRATACIÓN","CONVENIOS DE ASOCIACIÓN DEL MINISTERIO","SE ELABORAN DE ACUERDO CON LAS SOLICITUDES DE LAS ÁREAS DE LA ENTIDAD","GRUPO INTERNO DE TRABAJO DE CONTRATACIÓN","2018-11-28","GRUPO INTERNO DE TRABAJO DE FORTALECIMIENTO DE LAS RELACIONES CON LOS GRUPOS DE INTERES","2019-12-30","APOYO","GESTION_RECURSOS","GESTION DE COMPRAS Y CONTRATACION","LEY 80 DTOS REGLAMENTARIOS","Externo","Físico","Documentos de Archivo - físicos","Papel","Español","INFORMACIÓN PÚBLICA","ARCHIVO Y EN  EL SECOP","N/A","N/A","N/A","N/A","N/A","N/A","Dato personal público","b)       Desarrollar los estudios previos y procesos de selección para la contratación oficial del Ministerio/Fondo TIC destinada a garantizar el funcionamiento de la entidad y la ejecución de proyectos y el desarrollo de esquemas de gerencia de proyectos."]
["401-410","INFORMACIÓN","GRUPO INTERNO DE TRABAJO DE CONTRATACIÓN","CONVENIOS DE COOPERACIÓN DEL FONDO","SE ELABORAN DE ACUERDO CON LAS SOLICITUDES DE LAS ÁREAS DE LA ENTIDAD","GRUPO INTERNO DE TRABAJO DE CONTRATACIÓN","2018-11-28","GRUPO INTERNO DE TRABAJO DE FORTALECIMIENTO DE LAS RELACIONES CON LOS GRUPOS DE INTERES","2019-12-31","APOYO","GESTION_RECURSOS","GESTION DE COMPRAS Y CONTRATACION","LEY 80 DTOS REGLAMENTARIOS","Externo","Físico","Documentos de Archivo - físicos","Papel","Español","INFORMACIÓN PÚBLICA","ARCHIVO Y EN  EL SECOP","N/A","N/A","N/A","N/A","N/A","N/A","Dato personal público","b)       Desarrollar los estudios previos y procesos de selección para la contratación oficial del Ministerio/Fondo TIC destinada a garantizar el funcionamiento de la entidad y la ejecución de proyectos y el desarrollo de esquemas de gerencia de proyectos."]
["401-411","INFORMACIÓN","GRUPO INTERNO DE TRABAJO DE CONTRATACIÓN","CONVENIOS DE COOPERACIÓN DEL MINISTERIO","SE ELABORAN DE ACUERDO CON LAS SOLICITUDES DE LAS ÁREAS DE LA ENTIDAD","GRUPO INTERNO DE TRABAJO DE CONTRATACIÓN","2018-11-28","GRUPO INTERNO DE TRABAJO DE FORTALECIMIENTO DE LAS RELACIONES CON LOS GRUPOS DE INTERES","2020-01-01","APOYO","GESTION_RECURSOS","GESTION DE COMPRAS Y CONTRATACION","LEY 80 DTOS REGLAMENTARIOS","Externo","Físico","Documentos de Archivo - físicos","Papel","Español","INFORMACIÓN PÚBLICA","ARCHIVO Y EN  EL SECOP","N/A","N/A","N/A","N/A","N/A","N/A","Dato personal público","b)       Desarrollar los estudios previos y procesos de selección para la contratación oficial del Ministerio/Fondo TIC destinada a garantizar el funcionamiento de la entidad y la ejecución de proyectos y el desarrollo de esquemas de gerencia de proyectos."]
["401-412","INFORMACIÓN","GRUPO INTERNO DE TRABAJO DE CONTRATACIÓN","CONVENIOS INTERADMINISTRATIVOS DEL FONDO","SE ELABORAN DE ACUERDO CON LAS SOLICITUDES DE LAS ÁREAS DE LA ENTIDAD","GRUPO INTERNO DE TRABAJO DE CONTRATACIÓN","2018-11-28","GRUPO INTERNO DE TRABAJO DE FORTALECIMIENTO DE LAS RELACIONES CON LOS GRUPOS DE INTERES","2020-01-02","APOYO","GESTION_RECURSOS","GESTION DE COMPRAS Y CONTRATACION","LEY 80 DTOS REGLAMENTARIOS","Externo","Físico","Documentos de Archivo - físicos","Papel","Español","INFORMACIÓN PÚBLICA","ARCHIVO Y EN  EL SECOP","N/A","N/A","N/A","N/A","N/A","N/A","Dato personal público","b)       Desarrollar los estudios previos y procesos de selección para la contratación oficial del Ministerio/Fondo TIC destinada a garantizar el funcionamiento de la entidad y la ejecución de proyectos y el desarrollo de esquemas de gerencia de proyectos."]
["401-413","INFORMACIÓN","GRUPO INTERNO DE TRABAJO DE CONTRATACIÓN","CONVENIOS INTERADMINISTRATIVOS DEL MINISTERIO","SE ELABORAN DE ACUERDO CON LAS SOLICITUDES DE LAS ÁREAS DE LA ENTIDAD","GRUPO INTERNO DE TRABAJO DE CONTRATACIÓN","2018-11-28","GRUPO INTERNO DE TRABAJO DE FORTALECIMIENTO DE LAS RELACIONES CON LOS GRUPOS DE INTERES","2020-01-03","APOYO","GESTION_RECURSOS","GESTION DE COMPRAS Y CONTRATACION","LEY 80 DTOS REGLAMENTARIOS","Externo","Físico","Documentos de Archivo - físicos","Papel","Español","INFORMACIÓN PÚBLICA CLASIFICADA","ARCHIVO Y EN  EL SECOP","SI","Del artículo 18 Y 19 de la Ley 1712 de 2014","literal A\nParágrafo","Reserva parcial","2018-11-22","4 AÑOS","Dato personal público","b)       Desarrollar los estudios previos y procesos de selección para la contratación oficial del Ministerio/Fondo TIC destinada a garantizar el funcionamiento de la entidad y la ejecución de proyectos y el desarrollo de esquemas de gerencia de proyectos."]
["401-414","INFORMACIÓN","GRUPO INTERNO DE TRABAJO DE CONTRATACIÓN","PETICIONES, QUEJAS , RECLAMOS , SUGERENCIAS Y DENUNCIAS ","SE DA RESPUESTA A LAS PQRSD QUE SON ENVIADAS AL GIT DE CONTRATACIÓN","GRUPO INTERNO DE TRABAJO DE CONTRATACIÓN","2018-11-28","GRUPO INTERNO DE TRABAJO DE CONTRATACIÓN","2020-01-04","APOYO","GESTION_RECURSOS","GESTION DE COMPRAS Y CONTRATACION","Ley 1755 de 2015","Externo","Físico","Documentos de Archivo - físicos","Papel","Español","INFORMACIÓN PÚBLICA","ARCHIVO DE LA ENTIDAD","N/A","N/A","N/A","N/A","N/A","N/A","Dato personal privado ","f. Atender y resolver peticiones, quejas, reclamos y sugerencias."]
["402-415","INFORMACIÓN","GRUPO INTERNO DE TRABAJO DE CONTROL INTERNO DISCIPLINARIO","Solicitud ","Información oficial sobre el ejercicio de las dependencias, para ser usado como insumo investigadores o ciudadanos","GRUPO INTERNO DE TRABAJO DE CONTROL INTERNO DISCIPLINARIO","2018-11-28","GRUPO INTERNO DE TRABAJO DE CONTROL INTERNO DISCIPLINARIO","2019-01-02","APOYO","GESTION_RECURSOS","GESTION DEL TALENTO HUMANO","N/A","Interno","Físico","Documentos de Archivo - físicos","Papel","Español","INFORMACIÓN PÚBLICA","N\\A","N/A","N/A","N/A","N/A","N/A","N/A","N/A","a. Permitir el desarrollo del objeto del Ministerio/Fondo TIC, en los términos de los artículos 1o y 2o del Decreto 1414 de 2017."]
["402-416","INFORMACIÓN","GRUPO INTERNO DE TRABAJO DE CONTROL INTERNO DISCIPLINARIO","Informe","Información oficial sobre el ejercicio de las dependencias, para ser usado como insumo investigadores o ciudadanos","GRUPO INTERNO DE TRABAJO DE CONTROL INTERNO DISCIPLINARIO","2018-11-28","GRUPO INTERNO DE TRABAJO DE CONTROL INTERNO DISCIPLINARIO","2019-01-02","APOYO","GESTION_RECURSOS","GESTION DEL TALENTO HUMANO","N/A","Interno","Físico","Documentos de Archivo - físicos","Papel","Español","INFORMACIÓN PÚBLICA","N/A","N/A","N/A","N/A","N/A","N/A","N/A","N/A","a. Permitir el desarrollo del objeto del Ministerio/Fondo TIC, en los términos de los artículos 1o y 2o del Decreto 1414 de 2017."]
["402-417","INFORMACIÓN","GRUPO INTERNO DE TRABAJO DE CONTROL INTERNO DISCIPLINARIO","Solicitud ","Denuncias presentadas por posibles infracciones de servidores. ","GRUPO INTERNO DE TRABAJO DE CONTROL INTERNO DISCIPLINARIO","2018-11-28","GRUPO INTERNO DE TRABAJO DE CONTROL INTERNO DISCIPLINARIO","2019-01-02","APOYO","GESTION_RECURSOS","GESTION DEL TALENTO HUMANO","Art 69 - Ley 734 de 2002","Interno","Físico","Documentos de Archivo - físicos","Papel","Español","INFORMACIÓN PÚBLICA","N/A","N/A","N/A","N/A","N/A","N/A","N/A","N/A","N/A"]
["402-418","INFORMACIÓN","GRUPO INTERNO DE TRABAJO DE CONTROL INTERNO DISCIPLINARIO","Respuesta y/o trámite","Denuncias presentadas por posibles infracciones de servidores. ","GRUPO INTERNO DE TRABAJO DE CONTROL INTERNO DISCIPLINARIO","2018-11-28","GRUPO INTERNO DE TRABAJO DE CONTROL INTERNO DISCIPLINARIO","2019-01-02","APOYO","GESTION_RECURSOS","GESTION DEL TALENTO HUMANO","Art 69 - Ley 734 de 2002","Interno","Físico","Documentos de Archivo - físicos","Papel","Español","INFORMACIÓN PÚBLICA","N/A","N/A","N/A","N/A","N/A","N/A","N/A","N/A","N/A"]
["402-419","INFORMACIÓN","GRUPO INTERNO DE TRABAJO DE CONTROL INTERNO DISCIPLINARIO","Auto de citación a audiencia ","Proceso disciplinario por posibles infracciones de servidores públicos. ","GRUPO INTERNO DE TRABAJO DE CONTROL INTERNO DISCIPLINARIO","2018-11-28","GRUPO INTERNO DE TRABAJO DE CONTROL INTERNO DISCIPLINARIO","2019-01-02","APOYO","GESTION_RECURSOS","GESTION DEL TALENTO HUMANO","Titulo  IX - Ley 734 de 2002","Interno","Físico","Documentos de Archivo - físicos","Papel","Español","INFORMACIÓN PÚBLICA RESERVADA","N/A","SI","Art 95 - Ley 734 de 2002","Reserva de la actuación disciplinaria","Reserva parcial","2018-11-28","N/A","N/A","N/A"]
["402-420","INFORMACIÓN","GRUPO INTERNO DE TRABAJO DE CONTROL INTERNO DISCIPLINARIO","Notificación personal ","Proceso disciplinario por posibles infracciones de servidores públicos. ","GRUPO INTERNO DE TRABAJO DE CONTROL INTERNO DISCIPLINARIO","2018-11-28","GRUPO INTERNO DE TRABAJO DE CONTROL INTERNO DISCIPLINARIO","2019-01-02","APOYO","GESTION_RECURSOS","GESTION DEL TALENTO HUMANO","Titulo  IX - Ley 734 de 2002","Interno","Físico","Documentos de Archivo - físicos","Papel","Español","INFORMACIÓN PÚBLICA RESERVADA","N/A","SI","Art 95 - Ley 734 de 2002","Reserva de la actuación disciplinaria","Reserva parcial","2018-11-28","N/A","N/A","N/A"]
["402-421","INFORMACIÓN","GRUPO INTERNO DE TRABAJO DE CONTROL INTERNO DISCIPLINARIO","Acta de celebración de primera audiencia (pruebas, descargos, versión libre, nulidades)","Proceso disciplinario por posibles infracciones de servidores públicos. ","GRUPO INTERNO DE TRABAJO DE CONTROL INTERNO DISCIPLINARIO","2018-11-28","GRUPO INTERNO DE TRABAJO DE CONTROL INTERNO DISCIPLINARIO","2019-01-02","APOYO","GESTION_RECURSOS","GESTION DEL TALENTO HUMANO","Titulo  IX - Ley 734 de 2002","Interno","Físico","Documentos de Archivo - físicos","Papel","Español","INFORMACIÓN PÚBLICA RESERVADA","N/A","SI","Art 95 - Ley 734 de 2002","Reserva de la actuación disciplinaria","Reserva parcial","2018-11-28","N/A","N/A","N/A"]
["402-422","INFORMACIÓN","GRUPO INTERNO DE TRABAJO DE CONTROL INTERNO DISCIPLINARIO","Acta de celebración de segunda audiencia (resuelve nulidades, decreta pruebas)","Proceso disciplinario por posibles infracciones de servidores públicos. ","GRUPO INTERNO DE TRABAJO DE CONTROL INTERNO DISCIPLINARIO","2018-11-28","GRUPO INTERNO DE TRABAJO DE CONTROL INTERNO DISCIPLINARIO","2019-01-02","APOYO","GESTION_RECURSOS","GESTION DEL TALENTO HUMANO","Titulo  IX - Ley 734 de 2002","Interno","Físico","Documentos de Archivo - físicos","Papel","Español","INFORMACIÓN PÚBLICA RESERVADA","N/A","SI","Art 95 - Ley 734 de 2002","Reserva de la actuación disciplinaria","Reserva parcial","2018-11-28","N/A","N/A","N/A"]
["402-423","INFORMACIÓN","GRUPO INTERNO DE TRABAJO DE CONTROL INTERNO DISCIPLINARIO","Acta de celebración de tercera audiencia (práctica de pruebas) ","Proceso disciplinario por posibles infracciones de servidores públicos. ","GRUPO INTERNO DE TRABAJO DE CONTROL INTERNO DISCIPLINARIO","2018-11-28","GRUPO INTERNO DE TRABAJO DE CONTROL INTERNO DISCIPLINARIO","2019-01-02","APOYO","GESTION_RECURSOS","GESTION DEL TALENTO HUMANO","Titulo  IX - Ley 734 de 2002","Interno","Físico","Documentos de Archivo - físicos","Papel","Español","INFORMACIÓN PÚBLICA RESERVADA","N/A","SI","Art 95 - Ley 734 de 2002","Reserva de la actuación disciplinaria","Reserva parcial","2018-11-28","N/A","N/A","N/A"]
["402-424","INFORMACIÓN","GRUPO INTERNO DE TRABAJO DE CONTROL INTERNO DISCIPLINARIO","Acta de celebración de cuarta audiencia (alegatos de conclusión) ","Proceso disciplinario por posibles infracciones de servidores públicos. ","GRUPO INTERNO DE TRABAJO DE CONTROL INTERNO DISCIPLINARIO","2018-11-28","GRUPO INTERNO DE TRABAJO DE CONTROL INTERNO DISCIPLINARIO","2019-01-02","APOYO","GESTION_RECURSOS","GESTION DEL TALENTO HUMANO","Titulo  IX - Ley 734 de 2002","Interno","Físico","Documentos de Archivo - físicos","Papel","Español","INFORMACIÓN PÚBLICA RESERVADA","N/A","SI","Art 95 - Ley 734 de 2002","Reserva de la actuación disciplinaria","Reserva parcial","2018-11-28","N/A","N/A","N/A"]
["402-425","INFORMACIÓN","GRUPO INTERNO DE TRABAJO DE CONTROL INTERNO DISCIPLINARIO","Acta de celebración de quinta audiencia (fallo de primera instancia) ","Proceso disciplinario por posibles infracciones de servidores públicos. ","GRUPO INTERNO DE TRABAJO DE CONTROL INTERNO DISCIPLINARIO","2018-11-28","GRUPO INTERNO DE TRABAJO DE CONTROL INTERNO DISCIPLINARIO","2019-01-02","APOYO","GESTION_RECURSOS","GESTION DEL TALENTO HUMANO","Titulo  IX - Ley 734 de 2002","Interno","Físico","Documentos de Archivo - físicos","Papel","Español","INFORMACIÓN PÚBLICA RESERVADA","N/A","SI","Art 95 - Ley 734 de 2002","Reserva de la actuación disciplinaria","Reserva parcial","2018-11-28","N/A","N/A","N/A"]
["402-426","INFORMACIÓN","GRUPO INTERNO DE TRABAJO DE CONTROL INTERNO DISCIPLINARIO","Apelación ","Proceso disciplinario por posibles infracciones de servidores públicos. ","GRUPO INTERNO DE TRABAJO DE CONTROL INTERNO DISCIPLINARIO","2018-11-28","GRUPO INTERNO DE TRABAJO DE CONTROL INTERNO DISCIPLINARIO","2019-01-02","APOYO","GESTION_RECURSOS","GESTION DEL TALENTO HUMANO","Titulo  IX - Ley 734 de 2002","Interno","Físico","Documentos de Archivo - físicos","Papel","Español","INFORMACIÓN PÚBLICA RESERVADA","N/A","SI","Art 95 - Ley 734 de 2002","Reserva de la actuación disciplinaria","Reserva parcial","2018-11-28","N/A","N/A","N/A"]
["402-427","INFORMACIÓN","GRUPO INTERNO DE TRABAJO DE CONTROL INTERNO DISCIPLINARIO","Auto que concede apelación ","Proceso disciplinario por posibles infracciones de servidores públicos. ","GRUPO INTERNO DE TRABAJO DE CONTROL INTERNO DISCIPLINARIO","2018-11-28","GRUPO INTERNO DE TRABAJO DE CONTROL INTERNO DISCIPLINARIO","2019-01-02","APOYO","GESTION_RECURSOS","GESTION DEL TALENTO HUMANO","Titulo  IX - Ley 734 de 2002","Interno","Físico","Documentos de Archivo - físicos","Papel","Español","INFORMACIÓN PÚBLICA RESERVADA","N/A","SI","Art 95 - Ley 734 de 2002","Reserva de la actuación disciplinaria","Reserva parcial","2018-11-28","N/A","N/A","N/A"]
["402-428","INFORMACIÓN","GRUPO INTERNO DE TRABAJO DE CONTROL INTERNO DISCIPLINARIO","Oficio remisorio para la segunda instancia ","Proceso disciplinario por posibles infracciones de servidores públicos. ","GRUPO INTERNO DE TRABAJO DE CONTROL INTERNO DISCIPLINARIO","2018-11-28","GRUPO INTERNO DE TRABAJO DE CONTROL INTERNO DISCIPLINARIO","2019-01-02","APOYO","GESTION_RECURSOS","GESTION DEL TALENTO HUMANO","Titulo  IX - Ley 734 de 2002","Interno","Físico","Documentos de Archivo - físicos","Papel","Español","INFORMACIÓN PÚBLICA RESERVADA","N/A","SI","Art 95 - Ley 734 de 2002","Reserva de la actuación disciplinaria","Reserva parcial","2018-11-28","N/A","N/A","N/A"]
["402-429","INFORMACIÓN","GRUPO INTERNO DE TRABAJO DE CONTROL INTERNO DISCIPLINARIO","Falla de segunda instancia (acto administrativo)","Proceso disciplinario por posibles infracciones de servidores públicos. ","GRUPO INTERNO DE TRABAJO DE CONTROL INTERNO DISCIPLINARIO","2018-11-28","GRUPO INTERNO DE TRABAJO DE CONTROL INTERNO DISCIPLINARIO","2019-01-02","APOYO","GESTION_RECURSOS","GESTION DEL TALENTO HUMANO","Titulo  IX - Ley 734 de 2002","Interno","Físico","Documentos de Archivo - físicos","Papel","Español","INFORMACIÓN PÚBLICA RESERVADA","N/A","SI","Art 95 - Ley 734 de 2002","Reserva de la actuación disciplinaria","Reserva parcial","2018-11-28","N/A","N/A","N/A"]
["402-430","INFORMACIÓN","GRUPO INTERNO DE TRABAJO DE CONTROL INTERNO DISCIPLINARIO","Oficio de citación","Proceso disciplinario por posibles infracciones de servidores públicos. ","GRUPO INTERNO DE TRABAJO DE CONTROL INTERNO DISCIPLINARIO","2018-11-28","GRUPO INTERNO DE TRABAJO DE CONTROL INTERNO DISCIPLINARIO","2019-01-02","APOYO","GESTION_RECURSOS","GESTION DEL TALENTO HUMANO","Titulo  IX - Ley 734 de 2002","Interno","Físico","Documentos de Archivo - físicos","Papel","Español","INFORMACIÓN PÚBLICA RESERVADA","N/A","SI","Art 95 - Ley 734 de 2002","Reserva de la actuación disciplinaria","Reserva parcial","2018-11-28","N/A","N/A","N/A"]
["402-431","INFORMACIÓN","GRUPO INTERNO DE TRABAJO DE CONTROL INTERNO DISCIPLINARIO","Notificación","Proceso disciplinario por posibles infracciones de servidores públicos. ","GRUPO INTERNO DE TRABAJO DE CONTROL INTERNO DISCIPLINARIO","2018-11-28","GRUPO INTERNO DE TRABAJO DE CONTROL INTERNO DISCIPLINARIO","2019-01-02","APOYO","GESTION_RECURSOS","GESTION DEL TALENTO HUMANO","Titulo  IX - Ley 734 de 2002","Interno","Físico","Documentos de Archivo - físicos","Papel","Español","INFORMACIÓN PÚBLICA RESERVADA","N/A","SI","Art 95 - Ley 734 de 2002","Reserva de la actuación disciplinaria","Reserva parcial","2018-11-28","N/A","N/A","N/A"]
["402-432","INFORMACIÓN","GRUPO INTERNO DE TRABAJO DE CONTROL INTERNO DISCIPLINARIO","Resolución de ejecución de sanción disciplinaria","Proceso disciplinario por posibles infracciones de servidores públicos. ","GRUPO INTERNO DE TRABAJO DE CONTROL INTERNO DISCIPLINARIO","2018-11-28","GRUPO INTERNO DE TRABAJO DE CONTROL INTERNO DISCIPLINARIO","2019-01-02","APOYO","GESTION_RECURSOS","GESTION DEL TALENTO HUMANO","Titulo  IX - Ley 734 de 2002","Interno","Físico","Documentos de Archivo - físicos","Papel","Español","INFORMACIÓN PÚBLICA RESERVADA","N/A","SI","Art 95 - Ley 734 de 2002","Reserva de la actuación disciplinaria","Reserva parcial","2018-11-28","N/A","N/A","N/A"]
["402-433","INFORMACIÓN","GRUPO INTERNO DE TRABAJO DE CONTROL INTERNO DISCIPLINARIO","Notificación","Proceso disciplinario por posibles infracciones de servidores públicos. ","GRUPO INTERNO DE TRABAJO DE CONTROL INTERNO DISCIPLINARIO","2018-11-28","GRUPO INTERNO DE TRABAJO DE CONTROL INTERNO DISCIPLINARIO","2019-01-02","APOYO","GESTION_RECURSOS","GESTION DEL TALENTO HUMANO","Titulo  IX - Ley 734 de 2002","Interno","Físico","Documentos de Archivo - físicos","Papel","Español","INFORMACIÓN PÚBLICA RESERVADA","N/A","SI","Art 95 - Ley 734 de 2002","Reserva de la actuación disciplinaria","Reserva parcial","2018-11-28","N/A","N/A","N/A"]
["402-434","INFORMACIÓN","GRUPO INTERNO DE TRABAJO DE CONTROL INTERNO DISCIPLINARIO","Comunicaciones de Ley (Procuraduría, Gestión Humana, Fiscalía, Contraloría)","Proceso disciplinario por posibles infracciones de servidores públicos. ","GRUPO INTERNO DE TRABAJO DE CONTROL INTERNO DISCIPLINARIO","2018-11-28","GRUPO INTERNO DE TRABAJO DE CONTROL INTERNO DISCIPLINARIO","2019-01-02","APOYO","GESTION_RECURSOS","GESTION DEL TALENTO HUMANO","Titulo  IX - Ley 734 de 2002","Interno","Físico","Documentos de Archivo - físicos","Papel","Español","INFORMACIÓN PÚBLICA RESERVADA","N/A","SI","Art 95 - Ley 734 de 2002","Reserva de la actuación disciplinaria","Reserva parcial","2018-11-28","N/A","N/A","N/A"]
["402-435","INFORMACIÓN","GRUPO INTERNO DE TRABAJO DE CONTROL INTERNO DISCIPLINARIO","Comunicaciones","Proceso disciplinario por posibles infracciones de servidores públicos. ","GRUPO INTERNO DE TRABAJO DE CONTROL INTERNO DISCIPLINARIO","2018-11-28","GRUPO INTERNO DE TRABAJO DE CONTROL INTERNO DISCIPLINARIO","2019-01-02","APOYO","GESTION_RECURSOS","GESTION DEL TALENTO HUMANO","Titulo  IX - Ley 734 de 2002","Interno","Físico","Documentos de Archivo - físicos","Papel","Español","INFORMACIÓN PÚBLICA RESERVADA","N/A","SI","Art 95 - Ley 734 de 2002","Reserva de la actuación disciplinaria","Reserva parcial","2018-11-28","N/A","N/A","N/A"]
["402-436","INFORMACIÓN","GRUPO INTERNO DE TRABAJO DE CONTROL INTERNO DISCIPLINARIO","Queja o informe","Proceso disciplinario por posibles infracciones de servidores públicos. ","GRUPO INTERNO DE TRABAJO DE CONTROL INTERNO DISCIPLINARIO","2018-11-28","GRUPO INTERNO DE TRABAJO DE CONTROL INTERNO DISCIPLINARIO","2019-01-02","APOYO","GESTION_RECURSOS","GESTION DEL TALENTO HUMANO","Titulo  IX - Ley 734 de 2002","Interno","Físico","Documentos de Archivo - físicos","Papel","Español","INFORMACIÓN PÚBLICA RESERVADA","N/A","SI","Art 95 - Ley 734 de 2002","Reserva de la actuación disciplinaria","Reserva parcial","2018-11-28","N/A","N/A","N/A"]
["402-437","INFORMACIÓN","GRUPO INTERNO DE TRABAJO DE CONTROL INTERNO DISCIPLINARIO","Auto Inhibitorio","Proceso disciplinario por posibles infracciones de servidores públicos. ","GRUPO INTERNO DE TRABAJO DE CONTROL INTERNO DISCIPLINARIO","2018-11-28","GRUPO INTERNO DE TRABAJO DE CONTROL INTERNO DISCIPLINARIO","2019-01-02","APOYO","GESTION_RECURSOS","GESTION DEL TALENTO HUMANO","Titulo  IX - Ley 734 de 2002","Interno","Físico","Documentos de Archivo - físicos","Papel","Español","INFORMACIÓN PÚBLICA RESERVADA","N/A","SI","Art 95 - Ley 734 de 2002","Reserva de la actuación disciplinaria","Reserva parcial","2018-11-28","N/A","N/A","N/A"]
["402-438","INFORMACIÓN","GRUPO INTERNO DE TRABAJO DE CONTROL INTERNO DISCIPLINARIO","Oficio remisorio","Proceso disciplinario por posibles infracciones de servidores públicos. ","GRUPO INTERNO DE TRABAJO DE CONTROL INTERNO DISCIPLINARIO","2018-11-28","GRUPO INTERNO DE TRABAJO DE CONTROL INTERNO DISCIPLINARIO","2019-01-02","APOYO","GESTION_RECURSOS","GESTION DEL TALENTO HUMANO","Titulo  IX - Ley 734 de 2002","Interno","Físico","Documentos de Archivo - físicos","Papel","Español","INFORMACIÓN PÚBLICA RESERVADA","N/A","SI","Art 95 - Ley 734 de 2002","Reserva de la actuación disciplinaria","Reserva parcial","2018-11-28","N/A","N/A","N/A"]
["402-439","INFORMACIÓN","GRUPO INTERNO DE TRABAJO DE CONTROL INTERNO DISCIPLINARIO","Comunicaciones","Proceso disciplinario por posibles infracciones de servidores públicos. ","GRUPO INTERNO DE TRABAJO DE CONTROL INTERNO DISCIPLINARIO","2018-11-28","GRUPO INTERNO DE TRABAJO DE CONTROL INTERNO DISCIPLINARIO","2019-01-02","APOYO","GESTION_RECURSOS","GESTION DEL TALENTO HUMANO","Titulo  IX - Ley 734 de 2002","Interno","Físico","Documentos de Archivo - físicos","Papel","Español","INFORMACIÓN PÚBLICA RESERVADA","N/A","SI","Art 95 - Ley 734 de 2002","Reserva de la actuación disciplinaria","Reserva parcial","2018-11-28","N/A","N/A","N/A"]
["402-440","INFORMACIÓN","GRUPO INTERNO DE TRABAJO DE CONTROL INTERNO DISCIPLINARIO","Queja o informe","Proceso disciplinario por posibles infracciones de servidores públicos. ","GRUPO INTERNO DE TRABAJO DE CONTROL INTERNO DISCIPLINARIO","2018-11-28","GRUPO INTERNO DE TRABAJO DE CONTROL INTERNO DISCIPLINARIO","2019-01-02","APOYO","GESTION_RECURSOS","GESTION DEL TALENTO HUMANO","Titulo  IX - Ley 734 de 2002","Interno","Físico","Documentos de Archivo - físicos","Papel","Español","INFORMACIÓN PÚBLICA RESERVADA","N/A","SI","Art 95 - Ley 734 de 2002","Reserva de la actuación disciplinaria","Reserva parcial","2018-11-28","N/A","N/A","N/A"]
["402-441","INFORMACIÓN","GRUPO INTERNO DE TRABAJO DE CONTROL INTERNO DISCIPLINARIO","Auto de apertura","Proceso disciplinario por posibles infracciones de servidores públicos. ","GRUPO INTERNO DE TRABAJO DE CONTROL INTERNO DISCIPLINARIO","2018-11-28","GRUPO INTERNO DE TRABAJO DE CONTROL INTERNO DISCIPLINARIO","2019-01-02","APOYO","GESTION_RECURSOS","GESTION DEL TALENTO HUMANO","Titulo  IX - Ley 734 de 2002","Interno","Físico","Documentos de Archivo - físicos","Papel","Español","INFORMACIÓN PÚBLICA RESERVADA","N/A","SI","Art 95 - Ley 734 de 2002","Reserva de la actuación disciplinaria","Reserva parcial","2018-11-28","N/A","N/A","N/A"]
["402-442","INFORMACIÓN","GRUPO INTERNO DE TRABAJO DE CONTROL INTERNO DISCIPLINARIO","citacion a notificación ","Proceso disciplinario por posibles infracciones de servidores públicos. ","GRUPO INTERNO DE TRABAJO DE CONTROL INTERNO DISCIPLINARIO","2018-11-28","GRUPO INTERNO DE TRABAJO DE CONTROL INTERNO DISCIPLINARIO","2019-01-02","APOYO","GESTION_RECURSOS","GESTION DEL TALENTO HUMANO","Titulo  IX - Ley 734 de 2002","Interno","Físico","Documentos de Archivo - físicos","Papel","Español","INFORMACIÓN PÚBLICA RESERVADA","N/A","SI","Art 95 - Ley 734 de 2002","Reserva de la actuación disciplinaria","Reserva parcial","2018-11-28","N/A","N/A","N/A"]
["402-443","INFORMACIÓN","GRUPO INTERNO DE TRABAJO DE CONTROL INTERNO DISCIPLINARIO","Notificación del auto","Proceso disciplinario por posibles infracciones de servidores públicos. ","GRUPO INTERNO DE TRABAJO DE CONTROL INTERNO DISCIPLINARIO","2018-11-28","GRUPO INTERNO DE TRABAJO DE CONTROL INTERNO DISCIPLINARIO","2019-01-02","APOYO","GESTION_RECURSOS","GESTION DEL TALENTO HUMANO","Titulo  IX - Ley 734 de 2002","Interno","Físico","Documentos de Archivo - físicos","Papel","Español","INFORMACIÓN PÚBLICA RESERVADA","N/A","SI","Art 95 - Ley 734 de 2002","Reserva de la actuación disciplinaria","Reserva parcial","2018-11-28","N/A","N/A","N/A"]
["402-444","INFORMACIÓN","GRUPO INTERNO DE TRABAJO DE CONTROL INTERNO DISCIPLINARIO","Versión libre","Proceso disciplinario por posibles infracciones de servidores públicos. ","GRUPO INTERNO DE TRABAJO DE CONTROL INTERNO DISCIPLINARIO","2018-11-28","GRUPO INTERNO DE TRABAJO DE CONTROL INTERNO DISCIPLINARIO","2019-01-02","APOYO","GESTION_RECURSOS","GESTION DEL TALENTO HUMANO","Titulo  IX - Ley 734 de 2002","Interno","Físico","Documentos de Archivo - físicos","Papel","Español","INFORMACIÓN PÚBLICA RESERVADA","N/A","SI","Art 95 - Ley 734 de 2002","Reserva de la actuación disciplinaria","Reserva parcial","2018-11-28","N/A","N/A","N/A"]
["402-445","INFORMACIÓN","GRUPO INTERNO DE TRABAJO DE CONTROL INTERNO DISCIPLINARIO","Declaración juramentada","Proceso disciplinario por posibles infracciones de servidores públicos. ","GRUPO INTERNO DE TRABAJO DE CONTROL INTERNO DISCIPLINARIO","2018-11-28","GRUPO INTERNO DE TRABAJO DE CONTROL INTERNO DISCIPLINARIO","2019-01-02","APOYO","GESTION_RECURSOS","GESTION DEL TALENTO HUMANO","Titulo  IX - Ley 734 de 2002","Interno","Físico","Documentos de Archivo - físicos","Papel","Español","INFORMACIÓN PÚBLICA RESERVADA","N/A","SI","Art 95 - Ley 734 de 2002","Reserva de la actuación disciplinaria","Reserva parcial","2018-11-28","N/A","N/A","N/A"]
["402-446","INFORMACIÓN","GRUPO INTERNO DE TRABAJO DE CONTROL INTERNO DISCIPLINARIO","Oficio práctica de pruebas","Proceso disciplinario por posibles infracciones de servidores públicos. ","GRUPO INTERNO DE TRABAJO DE CONTROL INTERNO DISCIPLINARIO","2018-11-28","GRUPO INTERNO DE TRABAJO DE CONTROL INTERNO DISCIPLINARIO","2019-01-02","APOYO","GESTION_RECURSOS","GESTION DEL TALENTO HUMANO","Titulo  IX - Ley 734 de 2002","Interno","Físico","Documentos de Archivo - físicos","Papel","Español","INFORMACIÓN PÚBLICA RESERVADA","N/A","SI","Art 95 - Ley 734 de 2002","Reserva de la actuación disciplinaria","Reserva parcial","2018-11-28","N/A","N/A","N/A"]
["402-447","INFORMACIÓN","GRUPO INTERNO DE TRABAJO DE CONTROL INTERNO DISCIPLINARIO","Auto de archivo","Proceso disciplinario por posibles infracciones de servidores públicos. ","GRUPO INTERNO DE TRABAJO DE CONTROL INTERNO DISCIPLINARIO","2018-11-28","GRUPO INTERNO DE TRABAJO DE CONTROL INTERNO DISCIPLINARIO","2019-01-02","APOYO","GESTION_RECURSOS","GESTION DEL TALENTO HUMANO","Titulo  IX - Ley 734 de 2002","Interno","Físico","Documentos de Archivo - físicos","Papel","Español","INFORMACIÓN PÚBLICA RESERVADA","N/A","SI","Art 95 - Ley 734 de 2002","Reserva de la actuación disciplinaria","Reserva parcial","2018-11-28","N/A","N/A","N/A"]
["402-448","INFORMACIÓN","GRUPO INTERNO DE TRABAJO DE CONTROL INTERNO DISCIPLINARIO","Oficio de citación","Proceso disciplinario por posibles infracciones de servidores públicos. ","GRUPO INTERNO DE TRABAJO DE CONTROL INTERNO DISCIPLINARIO","2018-11-28","GRUPO INTERNO DE TRABAJO DE CONTROL INTERNO DISCIPLINARIO","2019-01-02","APOYO","GESTION_RECURSOS","GESTION DEL TALENTO HUMANO","Titulo  IX - Ley 734 de 2002","Interno","Físico","Documentos de Archivo - físicos","Papel","Español","INFORMACIÓN PÚBLICA RESERVADA","N/A","SI","Art 95 - Ley 734 de 2002","Reserva de la actuación disciplinaria","Reserva parcial","2018-11-28","N/A","N/A","N/A"]
["402-449","INFORMACIÓN","GRUPO INTERNO DE TRABAJO DE CONTROL INTERNO DISCIPLINARIO","Notificación ","Proceso disciplinario por posibles infracciones de servidores públicos. ",{"$f":"IF(C456=\"\",\"\",C456)","v":"GRUPO INTERNO DE TRABAJO DE CONTROL INTERNO DISCIPLINARIO"},"2018-11-28","GRUPO INTERNO DE TRABAJO DE CONTROL INTERNO DISCIPLINARIO","2019-01-02","APOYO","GESTION_RECURSOS","GESTION DEL TALENTO HUMANO","Titulo  IX - Ley 734 de 2002","Interno","Físico","Documentos de Archivo - físicos","Papel","Español","INFORMACIÓN PÚBLICA RESERVADA","N/A","SI","Art 95 - Ley 734 de 2002","Reserva de la actuación disciplinaria","Reserva parcial","2018-11-28","N/A","N/A","N/A"]
["402-450","INFORMACIÓN","GRUPO INTERNO DE TRABAJO DE CONTROL INTERNO DISCIPLINARIO","Comunicaciones","Proceso disciplinario por posibles infracciones de servidores públicos. ","GRUPO INTERNO DE TRABAJO DE CONTROL INTERNO DISCIPLINARIO","2018-11-28","GRUPO INTERNO DE TRABAJO DE CONTROL INTERNO DISCIPLINARIO","2019-01-02","APOYO","GESTION_RECURSOS","GESTION DEL TALENTO HUMANO","Titulo  IX - Ley 734 de 2002","Interno","Físico","Documentos de Archivo - físicos","Papel","Español","INFORMACIÓN PÚBLICA RESERVADA","N/A","SI","Art 95 - Ley 734 de 2002","Reserva de la actuación disciplinaria","Reserva parcial","2018-11-28","N/A","N/A","N/A"]
["402-451","INFORMACIÓN","GRUPO INTERNO DE TRABAJO DE CONTROL INTERNO DISCIPLINARIO","Recurso de apelación","Proceso disciplinario por posibles infracciones de servidores públicos. ","GRUPO INTERNO DE TRABAJO DE CONTROL INTERNO DISCIPLINARIO","2018-11-28","GRUPO INTERNO DE TRABAJO DE CONTROL INTERNO DISCIPLINARIO","2019-01-02","APOYO","GESTION_RECURSOS","GESTION DEL TALENTO HUMANO","Titulo  IX - Ley 734 de 2002","Interno","Físico","Documentos de Archivo - físicos","Papel","Español","INFORMACIÓN PÚBLICA RESERVADA","N/A","SI","Art 95 - Ley 734 de 2002","Reserva de la actuación disciplinaria","Reserva parcial","2018-11-28","N/A","N/A","N/A"]
["402-452","INFORMACIÓN","GRUPO INTERNO DE TRABAJO DE CONTROL INTERNO DISCIPLINARIO","Auto de que concede apelación","Proceso disciplinario por posibles infracciones de servidores públicos. ","GRUPO INTERNO DE TRABAJO DE CONTROL INTERNO DISCIPLINARIO","2018-11-28","GRUPO INTERNO DE TRABAJO DE CONTROL INTERNO DISCIPLINARIO","2019-01-02","APOYO","GESTION_RECURSOS","GESTION DEL TALENTO HUMANO","Titulo  IX - Ley 734 de 2002","Interno","Físico","Documentos de Archivo - físicos","Papel","Español","INFORMACIÓN PÚBLICA RESERVADA","N/A","SI","Art 95 - Ley 734 de 2002","Reserva de la actuación disciplinaria","Reserva parcial","2018-11-28","N/A","N/A","N/A"]
["402-453","INFORMACIÓN","GRUPO INTERNO DE TRABAJO DE CONTROL INTERNO DISCIPLINARIO","Oficio remisorio al despacho del ministro","Proceso disciplinario por posibles infracciones de servidores públicos. ","GRUPO INTERNO DE TRABAJO DE CONTROL INTERNO DISCIPLINARIO","2018-11-28","GRUPO INTERNO DE TRABAJO DE CONTROL INTERNO DISCIPLINARIO","2019-01-02","APOYO","GESTION_RECURSOS","GESTION DEL TALENTO HUMANO","Titulo  IX - Ley 734 de 2002","Interno","Físico","Documentos de Archivo - físicos","Papel","Español","INFORMACIÓN PÚBLICA RESERVADA","N/A","SI","Art 95 - Ley 734 de 2002","Reserva de la actuación disciplinaria","Reserva parcial","2018-11-28","N/A","N/A","N/A"]
["402-454","INFORMACIÓN","GRUPO INTERNO DE TRABAJO DE CONTROL INTERNO DISCIPLINARIO","Oficio remisorio para la segunda instancia ","Proceso disciplinario por posibles infracciones de servidores públicos. ","GRUPO INTERNO DE TRABAJO DE CONTROL INTERNO DISCIPLINARIO","2018-11-28","GRUPO INTERNO DE TRABAJO DE CONTROL INTERNO DISCIPLINARIO","2019-01-02","APOYO","GESTION_RECURSOS","GESTION DEL TALENTO HUMANO","Titulo  IX - Ley 734 de 2002","Interno","Físico","Documentos de Archivo - físicos","Papel","Español","INFORMACIÓN PÚBLICA RESERVADA","N/A","SI","Art 95 - Ley 734 de 2002","Reserva de la actuación disciplinaria","Reserva parcial","2018-11-28","N/A","N/A","N/A"]
["402-455","INFORMACIÓN","GRUPO INTERNO DE TRABAJO DE CONTROL INTERNO DISCIPLINARIO","Fallo de segunda instancia (acto administrativo)","Proceso disciplinario por posibles infracciones de servidores públicos. ","GRUPO INTERNO DE TRABAJO DE CONTROL INTERNO DISCIPLINARIO","2018-11-28","GRUPO INTERNO DE TRABAJO DE CONTROL INTERNO DISCIPLINARIO","2019-01-02","APOYO","GESTION_RECURSOS","GESTION DEL TALENTO HUMANO","Titulo  IX - Ley 734 de 2002","Interno","Físico","Documentos de Archivo - físicos","Papel","Español","INFORMACIÓN PÚBLICA RESERVADA","N/A","SI","Art 95 - Ley 734 de 2002","Reserva de la actuación disciplinaria","Reserva parcial","2018-11-28","N/A","N/A","N/A"]
["402-456","INFORMACIÓN","GRUPO INTERNO DE TRABAJO DE CONTROL INTERNO DISCIPLINARIO","Oficio de citación","Proceso disciplinario por posibles infracciones de servidores públicos. ","GRUPO INTERNO DE TRABAJO DE CONTROL INTERNO DISCIPLINARIO","2018-11-28","GRUPO INTERNO DE TRABAJO DE CONTROL INTERNO DISCIPLINARIO","2019-01-02","APOYO","GESTION_RECURSOS","GESTION DEL TALENTO HUMANO","Titulo  IX - Ley 734 de 2002","Interno","Físico","Documentos de Archivo - físicos","Papel","Español","INFORMACIÓN PÚBLICA RESERVADA","N/A","SI","Art 95 - Ley 734 de 2002","Reserva de la actuación disciplinaria","Reserva parcial","2018-11-28","N/A","N/A","N/A"]
["402-457","INFORMACIÓN","GRUPO INTERNO DE TRABAJO DE CONTROL INTERNO DISCIPLINARIO","Notificación","Proceso disciplinario por posibles infracciones de servidores públicos. ","GRUPO INTERNO DE TRABAJO DE CONTROL INTERNO DISCIPLINARIO","2018-11-28","GRUPO INTERNO DE TRABAJO DE CONTROL INTERNO DISCIPLINARIO","2019-01-02","APOYO","GESTION_RECURSOS","GESTION DEL TALENTO HUMANO","Titulo  IX - Ley 734 de 2002","Interno","Físico","Documentos de Archivo - físicos","Papel","Español","INFORMACIÓN PÚBLICA RESERVADA","N/A","SI","Art 95 - Ley 734 de 2002","Reserva de la actuación disciplinaria","Reserva parcial","2018-11-28","N/A","N/A","N/A"]
["402-458","INFORMACIÓN","GRUPO INTERNO DE TRABAJO DE CONTROL INTERNO DISCIPLINARIO","Resolución de ejecución de sanción disciplinaria","Proceso disciplinario por posibles infracciones de servidores públicos. ","GRUPO INTERNO DE TRABAJO DE CONTROL INTERNO DISCIPLINARIO","2018-11-28","GRUPO INTERNO DE TRABAJO DE CONTROL INTERNO DISCIPLINARIO","2019-01-02","APOYO","GESTION_RECURSOS","GESTION DEL TALENTO HUMANO","Titulo  IX - Ley 734 de 2002","Interno","Físico","Documentos de Archivo - físicos","Papel","Español","INFORMACIÓN PÚBLICA RESERVADA","N/A","SI","Art 95 - Ley 734 de 2002","Reserva de la actuación disciplinaria","Reserva parcial","2018-11-28","N/A","N/A","N/A"]
["402-459","INFORMACIÓN","GRUPO INTERNO DE TRABAJO DE CONTROL INTERNO DISCIPLINARIO","Notificación","Proceso disciplinario por posibles infracciones de servidores públicos. ","GRUPO INTERNO DE TRABAJO DE CONTROL INTERNO DISCIPLINARIO","2018-11-28","GRUPO INTERNO DE TRABAJO DE CONTROL INTERNO DISCIPLINARIO","2019-01-02","APOYO","GESTION_RECURSOS","GESTION DEL TALENTO HUMANO","Titulo  IX - Ley 734 de 2002","Interno","Físico","Documentos de Archivo - físicos","Papel","Español","INFORMACIÓN PÚBLICA RESERVADA","N/A","SI","Art 95 - Ley 734 de 2002","Reserva de la actuación disciplinaria","Reserva parcial","2018-11-28","N/A","N/A","N/A"]
["402-460","INFORMACIÓN","GRUPO INTERNO DE TRABAJO DE CONTROL INTERNO DISCIPLINARIO","Comunicaciones de Ley (Procuraduría, Gestión Humana, Fiscalía, Contraloría)","Proceso disciplinario por posibles infracciones de servidores públicos. ","GRUPO INTERNO DE TRABAJO DE CONTROL INTERNO DISCIPLINARIO","2018-11-28","GRUPO INTERNO DE TRABAJO DE CONTROL INTERNO DISCIPLINARIO","2019-01-02","APOYO","GESTION_RECURSOS","GESTION DEL TALENTO HUMANO","Titulo  IX - Ley 734 de 2002","Interno","Físico","Documentos de Archivo - físicos","Papel","Español","INFORMACIÓN PÚBLICA RESERVADA","N/A","SI","Art 95 - Ley 734 de 2002","Reserva de la actuación disciplinaria","Reserva parcial","2018-11-28","N/A","N/A","N/A"]
["402-461","INFORMACIÓN","GRUPO INTERNO DE TRABAJO DE CONTROL INTERNO DISCIPLINARIO","Comunicaciones","Proceso disciplinario por posibles infracciones de servidores públicos. ","GRUPO INTERNO DE TRABAJO DE CONTROL INTERNO DISCIPLINARIO","2018-11-28","GRUPO INTERNO DE TRABAJO DE CONTROL INTERNO DISCIPLINARIO","2019-01-02","APOYO","GESTION_RECURSOS","GESTION DEL TALENTO HUMANO","Titulo  IX - Ley 734 de 2002","Interno","Físico","Documentos de Archivo - físicos","Papel","Español","INFORMACIÓN PÚBLICA RESERVADA","N/A","SI","Art 95 - Ley 734 de 2002","Reserva de la actuación disciplinaria","Reserva parcial","2018-11-28","N/A","N/A","N/A"]
["402-462","INFORMACIÓN","GRUPO INTERNO DE TRABAJO DE CONTROL INTERNO DISCIPLINARIO","Queja o informe","Proceso disciplinario por posibles infracciones de servidores públicos. ","GRUPO INTERNO DE TRABAJO DE CONTROL INTERNO DISCIPLINARIO","2018-11-28","GRUPO INTERNO DE TRABAJO DE CONTROL INTERNO DISCIPLINARIO","2019-01-02","APOYO","GESTION_RECURSOS","GESTION DEL TALENTO HUMANO","Titulo  IX - Ley 734 de 2002","Interno","Físico","Documentos de Archivo - físicos","Papel","Español","INFORMACIÓN PÚBLICA RESERVADA","N/A","SI","Art 95 - Ley 734 de 2002","Reserva de la actuación disciplinaria","Reserva parcial","2018-11-28","N/A","N/A","N/A"]
["402-463","INFORMACIÓN","GRUPO INTERNO DE TRABAJO DE CONTROL INTERNO DISCIPLINARIO","Auto de apertura","Proceso disciplinario por posibles infracciones de servidores públicos. ","GRUPO INTERNO DE TRABAJO DE CONTROL INTERNO DISCIPLINARIO","2018-11-28","GRUPO INTERNO DE TRABAJO DE CONTROL INTERNO DISCIPLINARIO","2019-01-02","APOYO","GESTION_RECURSOS","GESTION DEL TALENTO HUMANO","Titulo  IX - Ley 734 de 2002","Interno","Físico","Documentos de Archivo - físicos","Papel","Español","INFORMACIÓN PÚBLICA RESERVADA","N/A","SI","Art 95 - Ley 734 de 2002","Reserva de la actuación disciplinaria","Reserva parcial","2018-11-28","N/A","N/A","N/A"]
["402-464","INFORMACIÓN","GRUPO INTERNO DE TRABAJO DE CONTROL INTERNO DISCIPLINARIO","Citación a notificación ","Proceso disciplinario por posibles infracciones de servidores públicos. ","GRUPO INTERNO DE TRABAJO DE CONTROL INTERNO DISCIPLINARIO","2018-11-28","GRUPO INTERNO DE TRABAJO DE CONTROL INTERNO DISCIPLINARIO","2019-01-02","APOYO","GESTION_RECURSOS","GESTION DEL TALENTO HUMANO","Titulo  IX - Ley 734 de 2002","Interno","Físico","Documentos de Archivo - físicos","Papel","Español","INFORMACIÓN PÚBLICA RESERVADA","N/A","SI","Art 95 - Ley 734 de 2002","Reserva de la actuación disciplinaria","Reserva parcial","2018-11-28","N/A","N/A","N/A"]
["402-465","INFORMACIÓN","GRUPO INTERNO DE TRABAJO DE CONTROL INTERNO DISCIPLINARIO","Notificación del auto","Proceso disciplinario por posibles infracciones de servidores públicos. ","GRUPO INTERNO DE TRABAJO DE CONTROL INTERNO DISCIPLINARIO","2018-11-28","GRUPO INTERNO DE TRABAJO DE CONTROL INTERNO DISCIPLINARIO","2019-01-02","APOYO","GESTION_RECURSOS","GESTION DEL TALENTO HUMANO","Titulo  IX - Ley 734 de 2002","Interno","Físico","Documentos de Archivo - físicos","Papel","Español","INFORMACIÓN PÚBLICA RESERVADA","N/A","SI","Art 95 - Ley 734 de 2002","Reserva de la actuación disciplinaria","Reserva parcial","2018-11-28","N/A","N/A","N/A"]
["402-466","INFORMACIÓN","GRUPO INTERNO DE TRABAJO DE CONTROL INTERNO DISCIPLINARIO","Versión libre","Proceso disciplinario por posibles infracciones de servidores públicos. ","GRUPO INTERNO DE TRABAJO DE CONTROL INTERNO DISCIPLINARIO","2018-11-28","GRUPO INTERNO DE TRABAJO DE CONTROL INTERNO DISCIPLINARIO","2019-01-02","APOYO","GESTION_RECURSOS","GESTION DEL TALENTO HUMANO","Titulo  IX - Ley 734 de 2002","Interno","Físico","Documentos de Archivo - físicos","Papel","Español","INFORMACIÓN PÚBLICA RESERVADA","N/A","SI","Art 95 - Ley 734 de 2002","Reserva de la actuación disciplinaria","Reserva parcial","2018-11-28","N/A","N/A","N/A"]
["402-467","INFORMACIÓN","GRUPO INTERNO DE TRABAJO DE CONTROL INTERNO DISCIPLINARIO","Oficio informativo a procuraduría","Proceso disciplinario por posibles infracciones de servidores públicos. ","GRUPO INTERNO DE TRABAJO DE CONTROL INTERNO DISCIPLINARIO","2018-11-28","GRUPO INTERNO DE TRABAJO DE CONTROL INTERNO DISCIPLINARIO","2019-01-02","APOYO","GESTION_RECURSOS","GESTION DEL TALENTO HUMANO","Titulo  IX - Ley 734 de 2002","Interno","Físico","Documentos de Archivo - físicos","Papel","Español","INFORMACIÓN PÚBLICA RESERVADA","N/A","SI","Art 95 - Ley 734 de 2002","Reserva de la actuación disciplinaria","Reserva parcial","2018-11-28","N/A","N/A","N/A"]
["402-468","INFORMACIÓN","GRUPO INTERNO DE TRABAJO DE CONTROL INTERNO DISCIPLINARIO","Declaración juramentada","Proceso disciplinario por posibles infracciones de servidores públicos. ","GRUPO INTERNO DE TRABAJO DE CONTROL INTERNO DISCIPLINARIO","2018-11-28","GRUPO INTERNO DE TRABAJO DE CONTROL INTERNO DISCIPLINARIO","2019-01-02","APOYO","GESTION_RECURSOS","GESTION DEL TALENTO HUMANO","Titulo  IX - Ley 734 de 2002","Interno","Físico","Documentos de Archivo - físicos","Papel","Español","INFORMACIÓN PÚBLICA RESERVADA","N/A","SI","Art 95 - Ley 734 de 2002","Reserva de la actuación disciplinaria","Reserva parcial","2018-11-28","N/A","N/A","N/A"]
["402-469","INFORMACIÓN","GRUPO INTERNO DE TRABAJO DE CONTROL INTERNO DISCIPLINARIO","Oficio práctica de pruebas","Proceso disciplinario por posibles infracciones de servidores públicos. ","GRUPO INTERNO DE TRABAJO DE CONTROL INTERNO DISCIPLINARIO","2018-11-28","GRUPO INTERNO DE TRABAJO DE CONTROL INTERNO DISCIPLINARIO","2019-01-02","APOYO","GESTION_RECURSOS","GESTION DEL TALENTO HUMANO","Titulo  IX - Ley 734 de 2002","Interno","Físico","Documentos de Archivo - físicos","Papel","Español","INFORMACIÓN PÚBLICA RESERVADA","N/A","SI","Art 95 - Ley 734 de 2002","Reserva de la actuación disciplinaria","Reserva parcial","2018-11-28","N/A","N/A","N/A"]
["402-470","INFORMACIÓN","GRUPO INTERNO DE TRABAJO DE CONTROL INTERNO DISCIPLINARIO","Auto de cierre de investigación disciplinaria ","Proceso disciplinario por posibles infracciones de servidores públicos. ","GRUPO INTERNO DE TRABAJO DE CONTROL INTERNO DISCIPLINARIO","2018-11-28","GRUPO INTERNO DE TRABAJO DE CONTROL INTERNO DISCIPLINARIO","2019-01-02","APOYO","GESTION_RECURSOS","GESTION DEL TALENTO HUMANO","Titulo  IX - Ley 734 de 2002","Interno","Físico","Documentos de Archivo - físicos","Papel","Español","INFORMACIÓN PÚBLICA RESERVADA","N/A","SI","Art 95 - Ley 734 de 2002","Reserva de la actuación disciplinaria","Reserva parcial","2018-11-28","N/A","N/A","N/A"]
["402-471","INFORMACIÓN","GRUPO INTERNO DE TRABAJO DE CONTROL INTERNO DISCIPLINARIO","Auto de evaluación de investigación disciplinaria","Proceso disciplinario por posibles infracciones de servidores públicos. ","GRUPO INTERNO DE TRABAJO DE CONTROL INTERNO DISCIPLINARIO","2018-11-28","GRUPO INTERNO DE TRABAJO DE CONTROL INTERNO DISCIPLINARIO","2019-01-02","APOYO","GESTION_RECURSOS","GESTION DEL TALENTO HUMANO","Titulo  IX - Ley 734 de 2002","Interno","Físico","Documentos de Archivo - físicos","Papel","Español","INFORMACIÓN PÚBLICA RESERVADA","N/A","SI","Art 95 - Ley 734 de 2002","Reserva de la actuación disciplinaria","Reserva parcial","2018-11-28","N/A","N/A","N/A"]
["402-472","INFORMACIÓN","GRUPO INTERNO DE TRABAJO DE CONTROL INTERNO DISCIPLINARIO","Citación a notificación ","Proceso disciplinario por posibles infracciones de servidores públicos. ","GRUPO INTERNO DE TRABAJO DE CONTROL INTERNO DISCIPLINARIO","2018-11-28","GRUPO INTERNO DE TRABAJO DE CONTROL INTERNO DISCIPLINARIO","2019-01-02","APOYO","GESTION_RECURSOS","GESTION DEL TALENTO HUMANO","Titulo  IX - Ley 734 de 2002","Interno","Físico","Documentos de Archivo - físicos","Papel","Español","INFORMACIÓN PÚBLICA RESERVADA","N/A","SI","Art 95 - Ley 734 de 2002","Reserva de la actuación disciplinaria","Reserva parcial","2018-11-28","N/A","N/A","N/A"]
["402-473","INFORMACIÓN","GRUPO INTERNO DE TRABAJO DE CONTROL INTERNO DISCIPLINARIO","Notificación ","Proceso disciplinario por posibles infracciones de servidores públicos. ","GRUPO INTERNO DE TRABAJO DE CONTROL INTERNO DISCIPLINARIO","2018-11-28","GRUPO INTERNO DE TRABAJO DE CONTROL INTERNO DISCIPLINARIO","2019-01-02","APOYO","GESTION_RECURSOS","GESTION DEL TALENTO HUMANO","Titulo  IX - Ley 734 de 2002","Interno","Físico","Documentos de Archivo - físicos","Papel","Español","INFORMACIÓN PÚBLICA RESERVADA","N/A","SI","Art 95 - Ley 734 de 2002","Reserva de la actuación disciplinaria","Reserva parcial","2018-11-28","N/A","N/A","N/A"]
["402-474","INFORMACIÓN","GRUPO INTERNO DE TRABAJO DE CONTROL INTERNO DISCIPLINARIO","Poder","Proceso disciplinario por posibles infracciones de servidores públicos. ","GRUPO INTERNO DE TRABAJO DE CONTROL INTERNO DISCIPLINARIO","2018-11-28","GRUPO INTERNO DE TRABAJO DE CONTROL INTERNO DISCIPLINARIO","2019-01-02","APOYO","GESTION_RECURSOS","GESTION DEL TALENTO HUMANO","Titulo  IX - Ley 734 de 2002","Interno","Físico","Documentos de Archivo - físicos","Papel","Español","INFORMACIÓN PÚBLICA RESERVADA","N/A","SI","Art 95 - Ley 734 de 2002","Reserva de la actuación disciplinaria","Reserva parcial","2018-11-28","N/A","N/A","N/A"]
["402-475","INFORMACIÓN","GRUPO INTERNO DE TRABAJO DE CONTROL INTERNO DISCIPLINARIO","Escrito de descargos","Proceso disciplinario por posibles infracciones de servidores públicos. ","GRUPO INTERNO DE TRABAJO DE CONTROL INTERNO DISCIPLINARIO","2018-11-28","GRUPO INTERNO DE TRABAJO DE CONTROL INTERNO DISCIPLINARIO","2019-01-02","APOYO","GESTION_RECURSOS","GESTION DEL TALENTO HUMANO","Titulo  IX - Ley 734 de 2002","Interno","Físico","Documentos de Archivo - físicos","Papel","Español","INFORMACIÓN PÚBLICA RESERVADA","N/A","SI","Art 95 - Ley 734 de 2002","Reserva de la actuación disciplinaria","Reserva parcial","2018-11-28","N/A","N/A","N/A"]
["402-476","INFORMACIÓN","GRUPO INTERNO DE TRABAJO DE CONTROL INTERNO DISCIPLINARIO","Auto de pruebas","Proceso disciplinario por posibles infracciones de servidores públicos. ","GRUPO INTERNO DE TRABAJO DE CONTROL INTERNO DISCIPLINARIO","2018-11-28","GRUPO INTERNO DE TRABAJO DE CONTROL INTERNO DISCIPLINARIO","2019-01-02","APOYO","GESTION_RECURSOS","GESTION DEL TALENTO HUMANO","Titulo  IX - Ley 734 de 2002","Interno","Físico","Documentos de Archivo - físicos","Papel","Español","INFORMACIÓN PÚBLICA RESERVADA","N/A","SI","Art 95 - Ley 734 de 2002","Reserva de la actuación disciplinaria","Reserva parcial","2018-11-28","N/A","N/A","N/A"]
["402-477","INFORMACIÓN","GRUPO INTERNO DE TRABAJO DE CONTROL INTERNO DISCIPLINARIO","Citación a declarar","Proceso disciplinario por posibles infracciones de servidores públicos. ","GRUPO INTERNO DE TRABAJO DE CONTROL INTERNO DISCIPLINARIO","2018-11-28","GRUPO INTERNO DE TRABAJO DE CONTROL INTERNO DISCIPLINARIO","2019-01-02","APOYO","GESTION_RECURSOS","GESTION DEL TALENTO HUMANO","Titulo  IX - Ley 734 de 2002","Interno","Físico","Documentos de Archivo - físicos","Papel","Español","INFORMACIÓN PÚBLICA RESERVADA","N/A","SI","Art 95 - Ley 734 de 2002","Reserva de la actuación disciplinaria","Reserva parcial","2018-11-28","N/A","N/A","N/A"]
["402-478","INFORMACIÓN","GRUPO INTERNO DE TRABAJO DE CONTROL INTERNO DISCIPLINARIO","Constancia de falta de asistencia de los testigos (si la hay)","Proceso disciplinario por posibles infracciones de servidores públicos. ","GRUPO INTERNO DE TRABAJO DE CONTROL INTERNO DISCIPLINARIO","2018-11-28","GRUPO INTERNO DE TRABAJO DE CONTROL INTERNO DISCIPLINARIO","2019-01-02","APOYO","GESTION_RECURSOS","GESTION DEL TALENTO HUMANO","Titulo  IX - Ley 734 de 2002","Interno","Físico","Documentos de Archivo - físicos","Papel","Español","INFORMACIÓN PÚBLICA RESERVADA","N/A","SI","Art 95 - Ley 734 de 2002","Reserva de la actuación disciplinaria","Reserva parcial","2018-11-28","N/A","N/A","N/A"]
["402-479","INFORMACIÓN","GRUPO INTERNO DE TRABAJO DE CONTROL INTERNO DISCIPLINARIO","Auto de alegatos de conclusión","Proceso disciplinario por posibles infracciones de servidores públicos. ","GRUPO INTERNO DE TRABAJO DE CONTROL INTERNO DISCIPLINARIO","2018-11-28","GRUPO INTERNO DE TRABAJO DE CONTROL INTERNO DISCIPLINARIO","2019-01-02","APOYO","GESTION_RECURSOS","GESTION DEL TALENTO HUMANO","Titulo  IX - Ley 734 de 2002","Interno","Físico","Documentos de Archivo - físicos","Papel","Español","INFORMACIÓN PÚBLICA RESERVADA","N/A","SI","Art 95 - Ley 734 de 2002","Reserva de la actuación disciplinaria","Reserva parcial","2018-11-28","N/A","N/A","N/A"]
["402-480","INFORMACIÓN","GRUPO INTERNO DE TRABAJO DE CONTROL INTERNO DISCIPLINARIO","Notificación por estado","Proceso disciplinario por posibles infracciones de servidores públicos. ","GRUPO INTERNO DE TRABAJO DE CONTROL INTERNO DISCIPLINARIO","2018-11-28","GRUPO INTERNO DE TRABAJO DE CONTROL INTERNO DISCIPLINARIO","2019-01-02","APOYO","GESTION_RECURSOS","GESTION DEL TALENTO HUMANO","Titulo  IX - Ley 734 de 2002","Interno","Físico","Documentos de Archivo - físicos","Papel","Español","INFORMACIÓN PÚBLICA RESERVADA","N/A","SI","Art 95 - Ley 734 de 2002","Reserva de la actuación disciplinaria","Reserva parcial","2018-11-28","N/A","N/A","N/A"]
["402-481","INFORMACIÓN","GRUPO INTERNO DE TRABAJO DE CONTROL INTERNO DISCIPLINARIO","Fallo de primera instancia ","Proceso disciplinario por posibles infracciones de servidores públicos. ","GRUPO INTERNO DE TRABAJO DE CONTROL INTERNO DISCIPLINARIO","2018-11-28","GRUPO INTERNO DE TRABAJO DE CONTROL INTERNO DISCIPLINARIO","2019-01-02","APOYO","GESTION_RECURSOS","GESTION DEL TALENTO HUMANO","Titulo  IX - Ley 734 de 2002","Interno","Físico","Documentos de Archivo - físicos","Papel","Español","INFORMACIÓN PÚBLICA RESERVADA","N/A","SI","Art 95 - Ley 734 de 2002","Reserva de la actuación disciplinaria","Reserva parcial","2018-11-28","N/A","N/A","N/A"]
["402-482","INFORMACIÓN","GRUPO INTERNO DE TRABAJO DE CONTROL INTERNO DISCIPLINARIO","Citación a notificación","Proceso disciplinario por posibles infracciones de servidores públicos. ","GRUPO INTERNO DE TRABAJO DE CONTROL INTERNO DISCIPLINARIO","2018-11-28","GRUPO INTERNO DE TRABAJO DE CONTROL INTERNO DISCIPLINARIO","2019-01-02","APOYO","GESTION_RECURSOS","GESTION DEL TALENTO HUMANO","Titulo  IX - Ley 734 de 2002","Interno","Físico","Documentos de Archivo - físicos","Papel","Español","INFORMACIÓN PÚBLICA RESERVADA","N/A","SI","Art 95 - Ley 734 de 2002","Reserva de la actuación disciplinaria","Reserva parcial","2018-11-28","N/A","N/A","N/A"]
["402-483","INFORMACIÓN","GRUPO INTERNO DE TRABAJO DE CONTROL INTERNO DISCIPLINARIO","Notificación","Proceso disciplinario por posibles infracciones de servidores públicos. ","GRUPO INTERNO DE TRABAJO DE CONTROL INTERNO DISCIPLINARIO","2018-11-28","GRUPO INTERNO DE TRABAJO DE CONTROL INTERNO DISCIPLINARIO","2019-01-02","APOYO","GESTION_RECURSOS","GESTION DEL TALENTO HUMANO","Titulo  IX - Ley 734 de 2002","Interno","Físico","Documentos de Archivo - físicos","Papel","Español","INFORMACIÓN PÚBLICA RESERVADA","N/A","SI","Art 95 - Ley 734 de 2002","Reserva de la actuación disciplinaria","Reserva parcial","2018-11-28","N/A","N/A","N/A"]
["410-484","INFORMACIÓN","OFICINA PARA LA GESTIÓN DE INGRESOS DEL FONDO","CITACIÓN","Citación que se realiza mediante correo electrónico para la asistencia al Comité para el Control y Seguimiento del Fondo.","OFICINA PARA LA GESTIÓN DE INGRESOS DEL FONDO","2018-11-28","OFICINA PARA LA GESTIÓN DE INGRESOS DEL FONDO","2019-01-02","APOYO","GESTION_RECURSOS","GESTION FINANCIERA","Resolución 3560 de 2018","Interno","Digital","Documentos de Archivo - electrónicos","RDF-XML","Español","INFORMACIÓN PÚBLICA","N/A","N/A","N/A","N/A","N/A","N/A","N/A","N/A","N/A"]
["410-485","INFORMACIÓN","OFICINA PARA LA GESTIÓN DE INGRESOS DEL FONDO","ACTA","Acta de reunión del Comité para el Control y seguimiento del Fondo donde se tratan temas estratégicos de la gestión de ingresos del Fondo.","OFICINA PARA LA GESTIÓN DE INGRESOS DEL FONDO","2018-11-28","OFICINA PARA LA GESTIÓN DE INGRESOS DEL FONDO","2019-01-02","APOYO","GESTION_RECURSOS","GESTION FINANCIERA","Resolución 3560 de 2018","Interno","Físico","Documentos de Archivo - físicos","Papel","Español","INFORMACIÓN PÚBLICA","SharePoint","N/A","N/A","N/A","N/A","N/A","N/A","N/A","N/A"]
["410-486","INFORMACIÓN","OFICINA PARA LA GESTIÓN DE INGRESOS DEL FONDO","INFORME","Presentación que se realiza sobre los temas a tratar en el Comité para el Control y Seguimiento del Fondo.","OFICINA PARA LA GESTIÓN DE INGRESOS DEL FONDO","2018-11-28","OFICINA PARA LA GESTIÓN DE INGRESOS DEL FONDO","2019-01-02","APOYO","GESTION_RECURSOS","GESTION FINANCIERA","Resolución 3560 de 2018","Interno","Físico","Documentos de Archivo - físicos","Papel","Español","INFORMACIÓN PÚBLICA","N/A","N/A","N/A","N/A","N/A","N/A","N/A","N/A","N/A"]
["410-487","INFORMACIÓN","OFICINA PARA LA GESTIÓN DE INGRESOS DEL FONDO","ANTEPROYECTO","Proyección de ingresos del Fondo para la siguiente vigencia fsical.","OFICINA PARA LA GESTIÓN DE INGRESOS DEL FONDO","2018-11-28","OFICINA PARA LA GESTIÓN DE INGRESOS DEL FONDO","2019-01-02","APOYO","GESTION_RECURSOS","GESTION FINANCIERA","Estatuto Orgánico de Presupuesto","Externo","Digital","Archivos Institucionales - electrónico","XLS","Español","INFORMACIÓN PÚBLICA","N/A","NO","N/A","N/A","N/A","N/A","N/A","N/A","N/A"]
["410-488","INFORMACIÓN","OFICINA PARA LA GESTIÓN DE INGRESOS DEL FONDO","REQUERIMIENTO","Solcitud de entes de control sobre temas específicos.","OFICINA PARA LA GESTIÓN DE INGRESOS DEL FONDO","2018-11-28","OFICINA PARA LA GESTIÓN DE INGRESOS DEL FONDO","2019-01-02","EVALUACION","ANALISIS_MEJORA_GESTION","EVALUACION Y APOYO AL CONTROL DE LA GESTION","Articulo 267 Constitución Política. Ley 1712 de 2014","Externo","Físico","Documentos de Archivo - físicos","Papel","Español","INFORMACIÓN PÚBLICA","N/A","N/A","N/A","N/A","N/A","N/A","N/A","Dato personal público","h. Atender requerimientos de información de entes de control tanto internos como externos."]
["410-489","INFORMACIÓN","OFICINA PARA LA GESTIÓN DE INGRESOS DEL FONDO","INFORME","Respuesta a requerimiento de entes de control sobre temas específicos.","OFICINA PARA LA GESTIÓN DE INGRESOS DEL FONDO","2018-11-28","OFICINA PARA LA GESTIÓN DE INGRESOS DEL FONDO","2019-01-02","EVALUACION","ANALISIS_MEJORA_GESTION","EVALUACION Y APOYO AL CONTROL DE LA GESTION","Articulo 267 Constitución Política. Ley 1712 de 2014","Interno","Físico","Documentos de Archivo - físicos","Papel","Español","INFORMACIÓN PÚBLICA","N/A","N/A","N/A","N/A","N/A","N/A","N/A","Dato personal público","h. Atender requerimientos de información de entes de control tanto internos como externos."]
["410-490","INFORMACIÓN","OFICINA PARA LA GESTIÓN DE INGRESOS DEL FONDO","INFORME","Informes de donde se plasma la gestión de recursos del Fondo en un determinado periodo.","OFICINA PARA LA GESTIÓN DE INGRESOS DEL FONDO","2018-11-28","OFICINA PARA LA GESTIÓN DE INGRESOS DEL FONDO","2019-01-02","APOYO","GESTION_RECURSOS","GESTION FINANCIERA","GEF-TIC-PR-041 Versión 3","Interno","Físico","Documentos de Archivo - físicos","Papel","Español","INFORMACIÓN PÚBLICA","https://mintic.sharepoint.com/Oficina_Gestion_Ingresos_Fondo/SitePages/Inicio.aspx","N/A","N/A","N/A","N/A","N/A","N/A","N/A","N/A"]
["410-491","INFORMACIÓN","OFICINA PARA LA GESTIÓN DE INGRESOS DEL FONDO","SOLICITUD","Requerimiento que se solicita a la oficina para dar respuesta a una petición, queja, sugrencia y/o denuncia.","OFICINA PARA LA GESTIÓN DE INGRESOS DEL FONDO","2018-11-28","SUBDIRECCIÓN ADMINISTRATIVA Y DE GESTIÓN HUMANA","2019-01-02","ESTRATEGICO","GESTION_ATENCION_GRUPOS_INTERES","GESTION DE ATENCION A GRUPOS DE INTERES","Ley 1755 de 2015","Externo","Físico","Documentos de Archivo - físicos","Papel","Español","INFORMACIÓN PÚBLICA","https://www.mintic.gov.co/portal/inicio/Peticiones-quejas-reclamos-sugerencias-y-denuncias-PQRSD/","N/A","N/A","N/A","N/A","N/A","N/A","Dato personal privado ","f. Atender y resolver peticiones, quejas, reclamos y sugerencias."]
["410-492","INFORMACIÓN","OFICINA PARA LA GESTIÓN DE INGRESOS DEL FONDO","RESPUESTA Y/O TRÁMITE","Respuesta de la oficina al peticionario sobre la solicitud de trámite de petición, queja, reclamo y/o denuncia.","OFICINA PARA LA GESTIÓN DE INGRESOS DEL FONDO","2018-11-28","SUBDIRECCIÓN ADMINISTRATIVA Y DE GESTIÓN HUMANA","2019-01-02","ESTRATEGICO","GESTION_ATENCION_GRUPOS_INTERES","GESTION DE ATENCION A GRUPOS DE INTERES","Ley 1755 de 2015","Interno","Físico","Documentos de Archivo - físicos","Papel","Español","INFORMACIÓN PÚBLICA","https://www.mintic.gov.co/portal/inicio/Peticiones-quejas-reclamos-sugerencias-y-denuncias-PQRSD/","N/A","N/A","N/A","N/A","N/A","N/A","Dato personal privado ","f. Atender y resolver peticiones, quejas, reclamos y sugerencias."]
["410-493","INFORMACIÓN","OFICINA PARA LA GESTIÓN DE INGRESOS DEL FONDO","REQUERIMIENTO","Informe de Auditoria de la Contraloría General de la República o de la Oficina de Control Interno.","OFICINA PARA LA GESTIÓN DE INGRESOS DEL FONDO","2018-11-28","OFICINA PARA LA GESTIÓN DE INGRESOS DEL FONDO","2019-01-02","EVALUACION","ANALISIS_MEJORA_GESTION","EVALUACION Y APOYO AL CONTROL DE LA GESTION","Ley 87 de 1993, Decreto 1537 de 2001, Art. 267 Constitución Política. Ley 1712 de 2014. Resolución orgánica 7350 de 2013 de CGR","Interno","Físico","Documentos de Archivo - físicos","Papel","Español","INFORMACIÓN PÚBLICA","https://www.mintic.gov.co/portal/inicio/Transparencia-y-acceso-a-informacion-publica/","N/A","N/A","N/A","N/A","N/A","N/A","N/A","N/A"]
["410-494","INFORMACIÓN","OFICINA PARA LA GESTIÓN DE INGRESOS DEL FONDO","ACTA","Documento que da inicio a la auditoría.","OFICINA PARA LA GESTIÓN DE INGRESOS DEL FONDO","2018-11-28","OFICINA PARA LA GESTIÓN DE INGRESOS DEL FONDO","2019-01-02","EVALUACION","ANALISIS_MEJORA_GESTION","EVALUACION Y APOYO AL CONTROL DE LA GESTION","Ley 87 de 1993, Decreto 1537 de 2001, Art. 267 Constitución Política. Ley 1712 de 2014. Resolución orgánica 7350 de 2013 de CGR","Interno","Físico","Documentos de Archivo - físicos","Papel","Español","INFORMACIÓN PÚBLICA","N/A","N/A","N/A","N/A","N/A","N/A","N/A","N/A","N/A"]
["410-495","INFORMACIÓN","OFICINA PARA LA GESTIÓN DE INGRESOS DEL FONDO","PLAN","Documento que plasma las acciones a mejorar resultado de los procesos de auditoría efectuados.","OFICINA PARA LA GESTIÓN DE INGRESOS DEL FONDO","2018-11-28","OFICINA PARA LA GESTIÓN DE INGRESOS DEL FONDO","2019-01-02","EVALUACION","ANALISIS_MEJORA_GESTION","EVALUACION Y APOYO AL CONTROL DE LA GESTION","Ley 87 de 1993, Decreto 1537 de 2001, Art. 267 Constitución Política. Ley 1712 de 2014. Resolución orgánica 7350 de 2013 de CGR","Interno","Físico","Archivos Institucionales - físicos","Papel","Español","INFORMACIÓN PÚBLICA","https://www.mintic.gov.co/portal/inicio/Transparencia-y-acceso-a-informacion-publica/;https://www.contraloria.gov.co/web/sireci","N/A","N/A","N/A","N/A","N/A","N/A","N/A","N/A"]
["410-496","INFORMACIÓN","OFICINA PARA LA GESTIÓN DE INGRESOS DEL FONDO","INFORME DE SEGUIMIENTO","Documento que refleja las acciones de control tomadas para mejorar y cumplir los objetivos de la Institución.","OFICINA PARA LA GESTIÓN DE INGRESOS DEL FONDO","2018-11-28","OFICINA PARA LA GESTIÓN DE INGRESOS DEL FONDO","2019-01-02","EVALUACION","ANALISIS_MEJORA_GESTION","EVALUACION Y APOYO AL CONTROL DE LA GESTION","Ley 87 de 1993, Decreto 1537 de 2001, Art. 267 Constitución Política. Ley 1712 de 2014. Resolución orgánica 7350 de 2013 de CGR","Interno","Físico","Documentos de Archivo - físicos","Papel","Español","INFORMACIÓN PÚBLICA","https://www.contraloria.gov.co/web/sireci","N/A","N/A","N/A","N/A","N/A","N/A","N/A","N/A"]
["410-497","INFORMACIÓN","OFICINA PARA LA GESTIÓN DE INGRESOS DEL FONDO","COMUNICACIONES","Oficio que se envía a la Oficina de Control Interno mostrando la realización de  acciones mejora con sus respectivos soportes.","OFICINA PARA LA GESTIÓN DE INGRESOS DEL FONDO","2018-11-28","OFICINA PARA LA GESTIÓN DE INGRESOS DEL FONDO","2019-01-02","EVALUACION","ANALISIS_MEJORA_GESTION","EVALUACION Y APOYO AL CONTROL DE LA GESTION","Ley 87 de 1993, Decreto 1537 de 2001, Art. 267 Constitución Política. Ley 1712 de 2014. Resolución orgánica 7350 de 2013 de CGR","Interno","Físico","Documentos de Archivo - físicos","Papel","Español","INFORMACIÓN PÚBLICA","N/A","N/A","N/A","N/A","N/A","N/A","N/A","N/A","N/A"]
["410-498","INFORMACIÓN","OFICINA PARA LA GESTIÓN DE INGRESOS DEL FONDO","INFORME","Dcoumento donde se detalla la ejecución de los recursos del esquema de subsidios de internet frente a las metas establecidas.","OFICINA PARA LA GESTIÓN DE INGRESOS DEL FONDO","2018-11-28","OFICINA PARA LA GESTIÓN DE INGRESOS DEL FONDO","2019-01-02","APOYO","GESTION_RECURSOS","GESTION FINANCIERA","LEY 1341 DE 2009 Y 1363 DE 2012","Externo","Físico","Documentos de Archivo - físicos","Papel","Español","INFORMACIÓN PÚBLICA","N/A","N/A","N/A","N/A","N/A","N/A","N/A","Dato personal público","a. Permitir el desarrollo del objeto del Ministerio/Fondo TIC, en los términos de los artículos 1o y 2o del Decreto 1414 de 2017."]
["410-499","INFORMACIÓN","OFICINA PARA LA GESTIÓN DE INGRESOS DEL FONDO","COMUNICACIONES ENVIADAS Y RECIBIDAS","Comunicaciones de retroalimentación entre la entidad y los operadores prestadores de servicios de internet.","OFICINA PARA LA GESTIÓN DE INGRESOS DEL FONDO","2018-11-28","OFICINA PARA LA GESTIÓN DE INGRESOS DEL FONDO","2019-01-02","APOYO","GESTION_RECURSOS","GESTION FINANCIERA","LEY 1341 DE 2009 Y 1363 DE 2012","Externo","Físico","Documentos de Archivo - físicos","Papel","Español","INFORMACIÓN PÚBLICA","N/A","N/A","N/A","N/A","N/A","N/A","N/A","Dato personal público","a. Permitir el desarrollo del objeto del Ministerio/Fondo TIC, en los términos de los artículos 1o y 2o del Decreto 1414 de 2017."]
["410-500","INFORMACIÓN","OFICINA PARA LA GESTIÓN DE INGRESOS DEL FONDO","RESOLUCIONES DE RECONOCIMIENTO Y PAGO","Actos administrativos donde se reconoce y se liquidan las contraprestaciones a favor y en contra de los operadores presatdores del servicio de internet mediante el cruce de la contrapresatción y los subsidios otorgados.","OFICINA PARA LA GESTIÓN DE INGRESOS DEL FONDO","2018-11-28","OFICINA PARA LA GESTIÓN DE INGRESOS DEL FONDO","2019-01-02","APOYO","GESTION_RECURSOS","GESTION FINANCIERA","LEY 1341 DE 2009 Y 1363 DE 2012","Externo","Físico","Documentos de Archivo - físicos","Papel","Español","INFORMACIÓN PÚBLICA","N/A","N/A","N/A","N/A","N/A","N/A","N/A","Dato personal público","a. Permitir el desarrollo del objeto del Ministerio/Fondo TIC, en los términos de los artículos 1o y 2o del Decreto 1414 de 2017."]
["410-501","INFORMACIÓN","OFICINA PARA LA GESTIÓN DE INGRESOS DEL FONDO","RECURSO DE REPOSICIÓN","Documento donde el operador prestador de servicio de internet interpone el recurso de reposicón ante la entidad.","OFICINA PARA LA GESTIÓN DE INGRESOS DEL FONDO","2018-11-28","OFICINA PARA LA GESTIÓN DE INGRESOS DEL FONDO","2019-01-02","APOYO","GESTION_RECURSOS","GESTION FINANCIERA","LEY 1341 DE 2009 Y 1363 DE 2012","Externo","Físico","Documentos de Archivo - físicos","Papel","Español","INFORMACIÓN PÚBLICA","N/A","N/A","N/A","N/A","N/A","N/A","N/A","Dato personal público","a. Permitir el desarrollo del objeto del Ministerio/Fondo TIC, en los términos de los artículos 1o y 2o del Decreto 1414 de 2017."]
["410-502","INFORMACIÓN","OFICINA PARA LA GESTIÓN DE INGRESOS DEL FONDO","INFORME","Dcoumento donde se detalla la ejecución de los recursos del esquema de subsidios de telefonía pública básica conmutada frente a las metas establecidas.","OFICINA PARA LA GESTIÓN DE INGRESOS DEL FONDO","2018-11-28","OFICINA PARA LA GESTIÓN DE INGRESOS DEL FONDO","2019-01-02","APOYO","GESTION_RECURSOS","GESTION FINANCIERA","LEY 1341 DE 2009 Y 1363 DE 2012","Externo","Físico","Documentos de Archivo - físicos","Papel","Español","INFORMACIÓN PÚBLICA","N/A","N/A","N/A","N/A","N/A","N/A","N/A","Dato personal público","a. Permitir el desarrollo del objeto del Ministerio/Fondo TIC, en los términos de los artículos 1o y 2o del Decreto 1414 de 2017."]
["410-503","INFORMACIÓN","OFICINA PARA LA GESTIÓN DE INGRESOS DEL FONDO","COMUNICACIONES ENVIADAS Y RECIBIDAS","Comunicaciones de retroalimentación entre la entidad y los operadores prestadores de servicios de telefonía pública básica conmutada.","OFICINA PARA LA GESTIÓN DE INGRESOS DEL FONDO","2018-11-28","OFICINA PARA LA GESTIÓN DE INGRESOS DEL FONDO","2019-01-02","APOYO","GESTION_RECURSOS","GESTION FINANCIERA","LEY 1341 DE 2009 Y 1363 DE 2012","Externo","Físico","Documentos de Archivo - físicos","Papel","Español","INFORMACIÓN PÚBLICA","N/A","N/A","N/A","N/A","N/A","N/A","N/A","Dato personal público","a. Permitir el desarrollo del objeto del Ministerio/Fondo TIC, en los términos de los artículos 1o y 2o del Decreto 1414 de 2017."]
["410-504","INFORMACIÓN","OFICINA PARA LA GESTIÓN DE INGRESOS DEL FONDO","RESOLUCIONES DE RECONOCIMIENTO Y PAGO","Actos administrativos donde se reconoce y se liquidan las contraprestaciones a favor y en contra de los operadores prestadores del servicio telefonía pública básica conmutada mediante el cruce de la contrapresatción y los subsidios otorgados.","OFICINA PARA LA GESTIÓN DE INGRESOS DEL FONDO","2018-11-28","OFICINA PARA LA GESTIÓN DE INGRESOS DEL FONDO","2019-01-02","APOYO","GESTION_RECURSOS","GESTION FINANCIERA","LEY 1341 DE 2009 Y 1363 DE 2012","Externo","Físico","Documentos de Archivo - físicos","Papel","Español","INFORMACIÓN PÚBLICA","N/A","N/A","N/A","N/A","N/A","N/A","N/A","Dato personal público","a. Permitir el desarrollo del objeto del Ministerio/Fondo TIC, en los términos de los artículos 1o y 2o del Decreto 1414 de 2017."]
["410-505","INFORMACIÓN","OFICINA PARA LA GESTIÓN DE INGRESOS DEL FONDO","RECURSO DE REPOSICIÓN","Documento donde el operador prestador de servicio de telefonía pública básica conmutada interpone el recurso de reposicón ante la entidad.","OFICINA PARA LA GESTIÓN DE INGRESOS DEL FONDO","2018-11-28","OFICINA PARA LA GESTIÓN DE INGRESOS DEL FONDO","2019-01-02","APOYO","GESTION_RECURSOS","GESTION FINANCIERA","LEY 1341 DE 2009 Y 1363 DE 2012","Externo","Físico","Documentos de Archivo - físicos","Papel","Español","INFORMACIÓN PÚBLICA","N/A","N/A","N/A","N/A","N/A","N/A","N/A","Dato personal público","a. Permitir el desarrollo del objeto del Ministerio/Fondo TIC, en los términos de los artículos 1o y 2o del Decreto 1414 de 2017."]
["412-506","INFORMACIÓN","GRUPO INTERNO DE TRABAJO DE SEGUIMIENTO A LA GESTIÓN DE INGRESOS DEL FONDO TIC","CITACIÓN","Citación que se realiza mediante correo electrónico para el Subcomité de seguimiento de Ingresos del Fondo.","GRUPO INTERNO DE TRABAJO DE SEGUIMIENTO A LA GESTIÓN DE INGRESOS DEL FONDO TIC","2018-11-28","GRUPO INTERNO DE TRABAJO DE SEGUIMIENTO A LA GESTIÓN DE INGRESOS DEL FONDO TIC","2019-01-02","APOYO","GESTION_RECURSOS","GESTION FINANCIERA","Resolución 161 de 2016 y Resolución 3560 de 2018","Interno","Digital","Documentos de Archivo - electrónicos","RDF-XML","Español","INFORMACIÓN PÚBLICA","N/A","N/A","N/A","N/A","N/A","N/A","N/A","N/A","N/A"]
["412-507","INFORMACIÓN","GRUPO INTERNO DE TRABAJO DE SEGUIMIENTO A LA GESTIÓN DE INGRESOS DEL FONDO TIC","ACTA","Acta de reunión del Subcomité de ingresos del Fondo, en donde se documenta el desarrollo de temas de la cadena de ingresos del Fondo.","GRUPO INTERNO DE TRABAJO DE SEGUIMIENTO A LA GESTIÓN DE INGRESOS DEL FONDO TIC","2018-11-28","GRUPO INTERNO DE TRABAJO DE SEGUIMIENTO A LA GESTIÓN DE INGRESOS DEL FONDO TIC","2019-01-02","APOYO","GESTION_RECURSOS","GESTION FINANCIERA","Resolución 161 de 2016 y Resolución 3560 de 2018","Interno","Físico","Documentos de Archivo - físicos","Papel","Español","INFORMACIÓN PÚBLICA","https://mintic.sharepoint.com/Oficina_Gestion_Ingresos_Fondo/SitePages/Inicio.aspx","N/A","N/A","N/A","N/A","N/A","N/A","N/A","N/A"]
["412-508","INFORMACIÓN","GRUPO INTERNO DE TRABAJO DE SEGUIMIENTO A LA GESTIÓN DE INGRESOS DEL FONDO TIC","SOLICITUD ","Solciitud de información enviada mediante correo electrónico a las áreas que integran la cadena de ingresos del Fondo sobre la gestión realizada en determinado periodo.","GRUPO INTERNO DE TRABAJO DE SEGUIMIENTO A LA GESTIÓN DE INGRESOS DEL FONDO TIC","2018-11-28","GRUPO INTERNO DE TRABAJO DE SEGUIMIENTO A LA GESTIÓN DE INGRESOS DEL FONDO TIC","2019-01-02","APOYO","GESTION_RECURSOS","GESTION FINANCIERA","N/A","Interno","Digital","Documentos de Archivo - electrónicos","RDF-XML","Español","INFORMACIÓN PÚBLICA","N/A","N/A","N/A","N/A","N/A","N/A","N/A","N/A","N/A"]
["412-509","INFORMACIÓN","GRUPO INTERNO DE TRABAJO DE SEGUIMIENTO A LA GESTIÓN DE INGRESOS DEL FONDO TIC","INFORME","Documento en word que contine la gestión de ingresos del Fondo efectauda por las áreas que integran dicha gestión.","GRUPO INTERNO DE TRABAJO DE SEGUIMIENTO A LA GESTIÓN DE INGRESOS DEL FONDO TIC","2018-11-28","GRUPO INTERNO DE TRABAJO DE SEGUIMIENTO A LA GESTIÓN DE INGRESOS DEL FONDO TIC","2019-01-02","APOYO","GESTION_RECURSOS","GESTION FINANCIERA","GEF-TIC-PR-041 Versión 3","Interno","Físico","Documentos de Archivo - físicos","Papel","Español","INFORMACIÓN PÚBLICA","https://mintic.sharepoint.com/Oficina_Gestion_Ingresos_Fondo/SitePages/Inicio.aspx","N/A","N/A","N/A","N/A","N/A","N/A","N/A","N/A"]
["411-510","INFORMACIÓN","GRUPO INTERNO DE TRABAJO DE SEGUIMIENTO A LA EJECUCIÓN CONTRACTUAL","CITACION","LA citación se hace mediante correo electrónico al Subcomité de Asuntos Precontractuales","GRUPO INTERNO DE TRABAJO DE SEGUIMIENTO A LA EJECUCIÓN CONTRACTUAL","2018-11-28","GRUPO INTERNO DE TRABAJO DE SEGUIMIENTO A LA EJECUCIÓN CONTRACTUAL","2019-01-02","APOYO","GESTION_RECURSOS","GESTION DE COMPRAS Y CONTRATACION","Resolución 161 de 2016 y Resolución 3560 de 2018","Interno","Digital","Documentos de Archivo - electrónicos","RDF-XML","Español","INFORMACIÓN PÚBLICA","N/A","N/A","N/A","N/A","N/A","N/A","N/A","N/A","N/A"]
["411-511","INFORMACIÓN","GRUPO INTERNO DE TRABAJO DE SEGUIMIENTO A LA EJECUCIÓN CONTRACTUAL","ACTA","Acta correspondiente a la realización del Subcomité de Asuntos Precontractuales","GRUPO INTERNO DE TRABAJO DE SEGUIMIENTO A LA EJECUCIÓN CONTRACTUAL","2018-11-28","GRUPO INTERNO DE TRABAJO DE SEGUIMIENTO A LA EJECUCIÓN CONTRACTUAL","2019-01-02","APOYO","GESTION_RECURSOS","GESTION DE COMPRAS Y CONTRATACION","Resolución 161 de 2016 y Resolución 3560 de 2018","Interno","Físico","Documentos de Archivo - físicos","Papel","Español","INFORMACIÓN PÚBLICA","N/A","N/A","N/A","N/A","N/A","N/A","N/A","N/A","N/A"]
["411-512","INFORMACIÓN","GRUPO INTERNO DE TRABAJO DE SEGUIMIENTO A LA EJECUCIÓN CONTRACTUAL","CITACION","La citación se hace mediante correo electrónico al Subcomité de Seguimiento Correctivo y Preventivo","GRUPO INTERNO DE TRABAJO DE SEGUIMIENTO A LA EJECUCIÓN CONTRACTUAL","2018-11-28","GRUPO INTERNO DE TRABAJO DE SEGUIMIENTO A LA EJECUCIÓN CONTRACTUAL","2019-01-02","APOYO","GESTION_RECURSOS","GESTION DE COMPRAS Y CONTRATACION","Resolución 161 de 2016 y Resolución 3560 de 2018","Interno","Digital","Documentos de Archivo - electrónicos","RDF-XML","Español","INFORMACIÓN PÚBLICA","N/A","N/A","N/A","N/A","N/A","N/A","N/A","N/A","N/A"]
["411-513","INFORMACIÓN","GRUPO INTERNO DE TRABAJO DE SEGUIMIENTO A LA EJECUCIÓN CONTRACTUAL","ACTA","Acta correspondiente a la realización del Subcomité de Seguimiento Correctivo y Preventivo",{"$f":"IF(C520=\"\",\"\",C520)","v":"GRUPO INTERNO DE TRABAJO DE SEGUIMIENTO A LA EJECUCIÓN CONTRACTUAL"},"2018-11-28","GRUPO INTERNO DE TRABAJO DE SEGUIMIENTO A LA EJECUCIÓN CONTRACTUAL","2019-01-02","APOYO","GESTION_RECURSOS","GESTION DE COMPRAS Y CONTRATACION","Resolución 161 de 2016 y Resolución 3560 de 2018","Interno","Físico","Documentos de Archivo - físicos","Papel","Español","INFORMACIÓN PÚBLICA","N/A","N/A","N/A","N/A","N/A","N/A","N/A","N/A","N/A"]
["411-514","INFORMACIÓN","GRUPO INTERNO DE TRABAJO DE SEGUIMIENTO A LA EJECUCIÓN CONTRACTUAL","SOLICITUD","Se solicita via correo electrónico a los funcionarios del GIT de Seguimiento a la Ejecución Contractual información sobre la gestión realizada de acuerdo a sus funciones","GRUPO INTERNO DE TRABAJO DE SEGUIMIENTO A LA EJECUCIÓN CONTRACTUAL","2018-11-28","GRUPO INTERNO DE TRABAJO DE SEGUIMIENTO A LA EJECUCIÓN CONTRACTUAL","2019-01-02","APOYO","GESTION_RECURSOS","GESTION DE COMPRAS Y CONTRATACION","GCC-TIC-PR-013 V.4, GCC-TIC-IN-004, Resolución 3361 del 26/12/2017","Interno","Digital","Documentos de Archivo - electrónicos","RDF-XML","Español","INFORMACIÓN PÚBLICA","https://mintic.sharepoint.com/Oficina_Gestion_Ingresos_Fondo/SitePages/Inicio.aspx","N/A","N/A","N/A","N/A","N/A","N/A","N/A","N/A"]
["411-515","INFORMACIÓN","GRUPO INTERNO DE TRABAJO DE SEGUIMIENTO A LA EJECUCIÓN CONTRACTUAL","INFORME","Informe que compila el seguimiento realizado por el GIT de Seguimiento a la Ejecución Contractual","GRUPO INTERNO DE TRABAJO DE SEGUIMIENTO A LA EJECUCIÓN CONTRACTUAL","2018-11-28","GRUPO INTERNO DE TRABAJO DE SEGUIMIENTO A LA EJECUCIÓN CONTRACTUAL","2019-01-02","APOYO","GESTION_RECURSOS","GESTION DE COMPRAS Y CONTRATACION","GCC-TIC-PR-013 V.4, GCC-TIC-IN-004, Resolución 3361 del 26/12/2017","Interno","Físico","Documentos de Archivo - físicos","Papel","Español","INFORMACIÓN PÚBLICA","https://mintic.sharepoint.com/Oficina_Gestion_Ingresos_Fondo/SitePages/Inicio.aspx","N/A","N/A","N/A","N/A","N/A","N/A","N/A","N/A"]
["420-516","INFORMACIÓN","SUBDIRECCIÓN FINANCIERA","INFORME","Informe de gestión PARES","SUBDIRECCIÓN FINANCIERA","2018-11-28","SUBDIRECCIÓN FINANCIERA","2019-01-02","APOYO","GESTION_RECURSOS","GESTION FINANCIERA","N/A","Externo","Digital","Disco duros, servidores, discos o medios portables, cintas o medios de video y audio (análogo o digital), etc.","PDF","Español","INFORMACIÓN PÚBLICA","N/A","N/A","N/A","N/A","N/A","N/A","N/A","N/A","N/A"]
["422-517","INFORMACIÓN","GRUPO INTERNO DE TRABAJO DE CONTABILIDAD","ACTAS","Seguimiento a la gestión del Comité Técnico de Sostenibilidad Contable y los compromisos adquiridos.","GRUPO INTERNO DE TRABAJO DE CONTABILIDAD","2018-11-28","GRUPO INTERNO DE TRABAJO DE CONTABILIDAD","2019-01-02","APOYO","GESTION_RECURSOS","GESTION FINANCIERA","RESOLUCIÓN 2678 DEL 13/12/2016","Interno","Físico","Documentos de Archivo - físicos","Papel","Español","INFORMACIÓN PÚBLICA","NO APLICA","N/A","N/A","N/A","N/A","N/A","N/A","Dato personal público","a. Permitir el desarrollo del objeto del Ministerio/Fondo TIC, en los términos de los artículos 1o y 2o del Decreto 1414 de 2017."]
["422-518","INFORMACIÓN","GRUPO INTERNO DE TRABAJO DE CONTABILIDAD","COMPROBANTE DE AJUSTES","Control y Seguimiento documentos recibidos.","GRUPO INTERNO DE TRABAJO DE CONTABILIDAD","2018-11-28","GRUPO INTERNO DE TRABAJO DE CONTABILIDAD","2019-01-02","APOYO","GESTION_RECURSOS","GESTION FINANCIERA","CATALOGO GENERAL DE CUENTAS","Externo","Digital","Sistemas de Bases de Datos","Base de datos","Español","INFORMACIÓN PÚBLICA","NO APLICA","N/A","N/A","N/A","N/A","N/A","N/A","Dato personal público","a. Permitir el desarrollo del objeto del Ministerio/Fondo TIC, en los términos de los artículos 1o y 2o del Decreto 1414 de 2017."]
["422-519","INFORMACIÓN","GRUPO INTERNO DE TRABAJO DE CONTABILIDAD","ESTADOS FINANCIEROS","De Situación Financiera, De Resultados y Notas Contables.","GRUPO INTERNO DE TRABAJO DE CONTABILIDAD","2018-11-28","GRUPO INTERNO DE TRABAJO DE CONTABILIDAD","2019-01-02","APOYO","GESTION_RECURSOS","GESTION FINANCIERA","RESOLUCIÓN 186 DE 2017","Externo","Físico","Documentos de Archivo - físicos","Papel","Español","INFORMACIÓN PÚBLICA","http://www.mintic.gov.co/portal/604/w3-propertyvalue-565.html","N/A","N/A","N/A","N/A","N/A","N/A","Dato personal público","a. Permitir el desarrollo del objeto del Ministerio/Fondo TIC, en los términos de los artículos 1o y 2o del Decreto 1414 de 2017."]
["422-520","INFORMACIÓN","GRUPO INTERNO DE TRABAJO DE CONTABILIDAD","REPORTES E INFORMES","Seguimiento a la gestión de la Subdirección y los compromisos pactados.","GRUPO INTERNO DE TRABAJO DE CONTABILIDAD","2018-11-28","GRUPO INTERNO DE TRABAJO DE CONTABILIDAD","2019-01-02","APOYO","GESTION_RECURSOS","GESTION FINANCIERA","N/A","N/A","Físico","Documentos de Archivo - físicos","Papel","Español","INFORMACIÓN PÚBLICA","NO APLICA","N/A","N/A","N/A","N/A","N/A","N/A","Dato personal público","h. Atender requerimientos de información de entes de control tanto internos como externos."]
["422-521","INFORMACIÓN","GRUPO INTERNO DE TRABAJO DE CONTABILIDAD","INFORMES","Seguimiento a la gestión de la Subdirección y los compromisos pactados.","GRUPO INTERNO DE TRABAJO DE CONTABILIDAD","2018-11-28","GRUPO INTERNO DE TRABAJO DE CONTABILIDAD","2019-01-02","APOYO","GESTION_RECURSOS","GESTION FINANCIERA","N/A","N/A","Físico","Documentos de Archivo - físicos","Papel","Español","INFORMACIÓN PÚBLICA","NO APLICA","N/A","N/A","N/A","N/A","N/A","N/A","Dato personal público","f. Atender y resolver peticiones, quejas, reclamos y sugerencias."]
["422-522","INFORMACIÓN","GRUPO INTERNO DE TRABAJO DE CONTABILIDAD","PQRSD","Peticiones, quejas, reclamos, sugerencias y denuncias","GRUPO INTERNO DE TRABAJO DE CONTABILIDAD","2018-11-28","GRUPO INTERNO DE TRABAJO DE CONTABILIDAD","2019-01-02","APOYO","GESTION_RECURSOS","GESTION FINANCIERA","Ley 1712 de 2014","Externo","Digital","Archivos Institucionales - electrónico","Base de datos","Español","INFORMACIÓN PÚBLICA","ALFANET","N/A","N/A","N/A","N/A","N/A","N/A","Dato personal privado ","f. Atender y resolver peticiones, quejas, reclamos y sugerencias."]
["424-523","INFORMACIÓN","GRUPO INTERNO DE TRABAJO DE CARTERA","CERTIFICACIONES DE CUMPLIMIENTO","Control y Seguimiento documentos recibidos y enviados.","GRUPO INTERNO DE TRABAJO DE CARTERA","2018-11-28","GRUPO INTERNO DE TRABAJO DE FORTALECIMIENTO DE LAS RELACIONES CON LOS GRUPOS DE INTERES","2019-01-02","APOYO","GESTION_RECURSOS","GESTION FINANCIERA","Resolución 3361 del 26/12/2017","Interno","Físico","Documentos de Archivo - físicos","Papel","Español","INFORMACIÓN PÚBLICA CLASIFICADA","ARCHIVO MINTIC","SI","Artículo 18 literal a, c y artículo 19  literal b ley 1712 de 2014","Toda la información que sea de un tercero no se publica ","Reserva parcial","N/A","15 años","Dato personal público","a. Permitir el desarrollo del objeto del Ministerio/Fondo TIC, en los términos de los artículos 1o y 2o del Decreto 1414 de 2017."]
["424-524","INFORMACIÓN","GRUPO INTERNO DE TRABAJO DE CARTERA","OFICIOS  COBRO COACTIVO","Control y Seguimiento documentos recibidos y enviados.","GRUPO INTERNO DE TRABAJO DE CARTERA","2018-11-28","GRUPO INTERNO DE TRABAJO DE FORTALECIMIENTO DE LAS RELACIONES CON LOS GRUPOS DE INTERES","2019-01-02","APOYO","GESTION_RECURSOS","GESTION FINANCIERA","Resolución 3361 del 26/12/2017","Interno","Físico","Documentos de Archivo - físicos","Papel","Español","INFORMACIÓN PÚBLICA CLASIFICADA","ARCHIVO MINTIC","SI","Artículo 18 literal a, c y artículo 19  literal b ley 1712 de 2014","Toda la información que sea de un tercero no se publica ","Reserva parcial","N/A","15 años","Dato personal público","a. Permitir el desarrollo del objeto del Ministerio/Fondo TIC, en los términos de los artículos 1o y 2o del Decreto 1414 de 2017."]
["424-525","INFORMACIÓN","GRUPO INTERNO DE TRABAJO DE CARTERA","ESTADO DE CUENTA","Control y Seguimiento documentos recibidos y enviados.","GRUPO INTERNO DE TRABAJO DE CARTERA","2018-11-28","GRUPO INTERNO DE TRABAJO DE FORTALECIMIENTO DE LAS RELACIONES CON LOS GRUPOS DE INTERES","2019-01-02","APOYO","GESTION_RECURSOS","GESTION FINANCIERA","Resolución 3361 del 26/12/2017","Interno","Físico","Documentos de Archivo - físicos","Papel","Español","INFORMACIÓN PÚBLICA CLASIFICADA","ARCHIVO MINTIC","SI","Artículo 18 literal a, c y artículo 19  literal b ley 1712 de 2014","Toda la información que sea de un tercero no se publica ","Reserva parcial","N/A","15 años","Dato personal público","a. Permitir el desarrollo del objeto del Ministerio/Fondo TIC, en los términos de los artículos 1o y 2o del Decreto 1414 de 2017."]
["424-526","INFORMACIÓN","GRUPO INTERNO DE TRABAJO DE CARTERA","INFORME DE REVISIÓN DE AUTOLIQUIDACIONES POR EL USO DE ESPECTRO","Control y Seguimiento documentos recibidos y enviados.","GRUPO INTERNO DE TRABAJO DE CARTERA","2018-11-28","GRUPO INTERNO DE TRABAJO DE FORTALECIMIENTO DE LAS RELACIONES CON LOS GRUPOS DE INTERES","2019-01-02","APOYO","GESTION_RECURSOS","GESTION FINANCIERA","Resolución 3361 del 26/12/2017","Interno","Físico","Documentos de Archivo - físicos","Papel","Español","INFORMACIÓN PÚBLICA CLASIFICADA","ARCHIVO MINTIC","SI","Artículo 18 literal a, c y artículo 19  literal b ley 1712 de 2014","Toda la información que sea de un tercero no se publica ","Reserva parcial","N/A","15 años","Dato personal público","a. Permitir el desarrollo del objeto del Ministerio/Fondo TIC, en los términos de los artículos 1o y 2o del Decreto 1414 de 2017."]
["424-527","INFORMACIÓN","GRUPO INTERNO DE TRABAJO DE CARTERA","INFORME DE REVISIÓN DE AUTOLIQUIDACIONES TRIMESTRALES","Control y Seguimiento documentos recibidos y enviados.","GRUPO INTERNO DE TRABAJO DE CARTERA","2018-11-28","GRUPO INTERNO DE TRABAJO DE FORTALECIMIENTO DE LAS RELACIONES CON LOS GRUPOS DE INTERES","2019-01-02","APOYO","GESTION_RECURSOS","GESTION FINANCIERA","Resolución 3361 del 26/12/2017","Interno","Físico","Documentos de Archivo - físicos","Papel","Español","INFORMACIÓN PÚBLICA CLASIFICADA","ARCHIVO MINTIC","SI","Artículo 18 literal a, c y artículo 19  literal b ley 1712 de 2014","Toda la información que sea de un tercero no se publica ","Reserva parcial","N/A","15 años","Dato personal público","a. Permitir el desarrollo del objeto del Ministerio/Fondo TIC, en los términos de los artículos 1o y 2o del Decreto 1414 de 2017."]
["424-528","INFORMACIÓN","GRUPO INTERNO DE TRABAJO DE CARTERA","LIQUIDACIÓN DE DERECHOS","Control y Seguimiento documentos enviados","GRUPO INTERNO DE TRABAJO DE CARTERA","2018-11-28","GRUPO INTERNO DE TRABAJO DE FORTALECIMIENTO DE LAS RELACIONES CON LOS GRUPOS DE INTERES","2019-01-02","APOYO","GESTION_RECURSOS","GESTION FINANCIERA","Resolución 3361 del 26/12/2017","Interno","Físico","Documentos de Archivo - físicos","Papel","Español","INFORMACIÓN PÚBLICA CLASIFICADA","ARCHIVO MINTIC","SI","Artículo 18 literal a, c y artículo 19  literal b ley 1712 de 2014","Toda la información que sea de un tercero no se publica ","Reserva parcial","N/A","15 años","Dato semiprivado","a. Permitir el desarrollo del objeto del Ministerio/Fondo TIC, en los términos de los artículos 1o y 2o del Decreto 1414 de 2017."]
["424-529","INFORMACIÓN","GRUPO INTERNO DE TRABAJO DE CARTERA","SOLICITUDES, TRAMITES Y/O RESPUESTAS","Control y Seguimiento documentos recibidos y enviados.","GRUPO INTERNO DE TRABAJO DE CARTERA","2018-11-28","GRUPO INTERNO DE TRABAJO DE FORTALECIMIENTO DE LAS RELACIONES CON LOS GRUPOS DE INTERES","2019-01-02","APOYO","GESTION_RECURSOS","GESTION FINANCIERA","Ley 1755 de 2015","Externo","Digital","Documentos de Archivo - electrónicos","PDF","Español","INFORMACIÓN PÚBLICA","http://alfanet.mintic.gov.co/AlfaNetWorkFlow/AlfaNetWF/WorkFlow.aspx","N/A","N/A","N/A","N/A","N/A","N/A","N/A","a. Permitir el desarrollo del objeto del Ministerio/Fondo TIC, en los términos de los artículos 1o y 2o del Decreto 1414 de 2017."]
["424-530","INFORMACIÓN","GRUPO INTERNO DE TRABAJO DE CARTERA","ACTA","Seguimiento a la gestión de la Subdirección y los compromisos pactados.","GRUPO INTERNO DE TRABAJO DE CARTERA","2018-11-28","GRUPO INTERNO DE TRABAJO DE FORTALECIMIENTO DE LAS RELACIONES CON LOS GRUPOS DE INTERES","2019-01-02","APOYO","GESTION_RECURSOS","GESTION FINANCIERA","Resolución 3361 del 26/12/2017","Interno","Digital","Documentos de Archivo - electrónicos","SHP","Español","INFORMACIÓN PÚBLICA RESERVADA","https://simig.mintic.gov.co/Documentacion/frmListadoMaestroDocumentos.aspx?Atras=1","SI","Es información publica reservada, de acuerdo con el artículo 19  literal b de la ley 1712 ","Seguridad Publica","Reserva total","N/A","15 años","N/A","N/A"]
["424-531","INFORMACIÓN","GRUPO INTERNO DE TRABAJO DE CARTERA","CITACIÓN","Control y Seguimiento documentos  enviados.","GRUPO INTERNO DE TRABAJO DE CARTERA","2018-11-28","GRUPO INTERNO DE TRABAJO DE FORTALECIMIENTO DE LAS RELACIONES CON LOS GRUPOS DE INTERES","2019-01-02","APOYO","GESTION_RECURSOS","GESTION FINANCIERA","N/A","Interno","Físico","Documentos de Archivo - electrónicos","Papel","Español","NO CLASIFICADA","ARCHIVO MINTIC","N/A","N/A","N/A","N/A","N/A","N/A","N/A","N/A"]
["424-532","INFORMACIÓN","GRUPO INTERNO DE TRABAJO DE CARTERA","PLAN","Seguimiento a la gestión de la Subdirección y los planes pactados.","GRUPO INTERNO DE TRABAJO DE CARTERA","2018-11-28","GRUPO INTERNO DE TRABAJO DE FORTALECIMIENTO DE LAS RELACIONES CON LOS GRUPOS DE INTERES","2019-01-02","APOYO","GESTION_RECURSOS","GESTION FINANCIERA","Resolución 3361 del 26/12/2017","Interno","Físico","Documentos de Archivo - físicos","Papel","Español","INFORMACIÓN PÚBLICA CLASIFICADA","ARCHIVO MINTIC","N/A","No se publican","Seguridad Publica","Reserva total","N/A","N/A","N/A","a. Permitir el desarrollo del objeto del Ministerio/Fondo TIC, en los términos de los artículos 1o y 2o del Decreto 1414 de 2017."]
["424-533","INFORMACIÓN","GRUPO INTERNO DE TRABAJO DE CARTERA","INFORME DE SEGUIMIENTO","Seguimiento a la gestión de la Subdirección y los compromisos pactados.","GRUPO INTERNO DE TRABAJO DE CARTERA","2018-11-28","GRUPO INTERNO DE TRABAJO DE FORTALECIMIENTO DE LAS RELACIONES CON LOS GRUPOS DE INTERES","2019-01-02","APOYO","GESTION_RECURSOS","GESTION FINANCIERA","Resolución 3361 del 26/12/2017","Interno","Físico","Documentos de Archivo - físicos","Papel","Español","INFORMACIÓN PÚBLICA CLASIFICADA","ARCHIVO MINTIC","N/A","No se publican","Seguridad Publica","Reserva total","N/A","N/A","N/A","a. Permitir el desarrollo del objeto del Ministerio/Fondo TIC, en los términos de los artículos 1o y 2o del Decreto 1414 de 2017."]
["424-534","INFORMACIÓN","GRUPO INTERNO DE TRABAJO DE CARTERA","COMUNICACIONES","Control y Seguimiento documentos recibidos y enviados.","GRUPO INTERNO DE TRABAJO DE CARTERA","2018-11-28","GRUPO INTERNO DE TRABAJO DE FORTALECIMIENTO DE LAS RELACIONES CON LOS GRUPOS DE INTERES","2019-01-02","APOYO","GESTION_RECURSOS","GESTION FINANCIERA","Resolución 3361 del 26/12/2017","Interno","Físico","Documentos de Archivo - físicos","Papel","Español","INFORMACIÓN PÚBLICA CLASIFICADA","ARCHIVO MINTIC","N/A","No se publican","Seguridad Publica","Reserva total","N/A","N/A","N/A","a. Permitir el desarrollo del objeto del Ministerio/Fondo TIC, en los términos de los artículos 1o y 2o del Decreto 1414 de 2017."]
["424-535","INFORMACIÓN","GRUPO INTERNO DE TRABAJO DE CARTERA","OFICIO COBRO PERSUASIVO","Control y Seguimiento documentos recibidos y enviados.","GRUPO INTERNO DE TRABAJO DE CARTERA","2018-11-28","GRUPO INTERNO DE TRABAJO DE FORTALECIMIENTO DE LAS RELACIONES CON LOS GRUPOS DE INTERES","2019-01-02","APOYO","GESTION_RECURSOS","GESTION FINANCIERA","Resolución 3361 del 26/12/2017","Interno","Físico","Documentos de Archivo - físicos","Papel","Español","INFORMACIÓN PÚBLICA CLASIFICADA","ARCHIVO MINTIC","SI","Artículo 18 literal a, c y artículo 19  literal b ley 1712 de 2014","Toda la información que sea de un tercero no se publica ","Reserva parcial","N/A","15 AÑOS","Dato personal público","a. Permitir el desarrollo del objeto del Ministerio/Fondo TIC, en los términos de los artículos 1o y 2o del Decreto 1414 de 2017."]
["423-536","INFORMACIÓN","GRUPO INTERNO DE TRABAJO DE PRESUPUESTO","BALANCE PRESUPUESTAL","DOCUMENTRO QUE CONTIENE EL ESTADO PRESUPUESTAL DEL CONTRARO.","GRUPO INTERNO DE TRABAJO DE PRESUPUESTO","2018-11-28","GRUPO INTERNO DE TRABAJO DE PRESUPUESTO","2019-01-02","APOYO","GESTION_RECURSOS","GESTION FINANCIERA","ESPERAR JEFE PREGUNTE","N/A","Físico","Documentos de Archivo - físicos","Papel","Español","INFORMACIÓN PÚBLICA","N/A","N/A","N/A","N/A","N/A","N/A","N/A","Dato personal público","b. Desarrollar los estudios previos y procesos de selección para la contratación oficial del Ministerio/Fondo TIC destinada a garantizar el funcionamiento de la entidad y la ejecución de proyectos y el desarrollo de esquemas de gerencia de proyectos."]
["423-537","INFORMACIÓN","GRUPO INTERNO DE TRABAJO DE PRESUPUESTO","CERTIFICADO DE DISPONIBILIDAD PRESUPUESTAL","DOCUMENTO EXPEDIDO POR EL JEFE DE PRESUPUESTO CON EL CUAL SE GARANTIZA LA EXISATENCIA DE APROPACIÓN PRESUPUESTAL Y LIBRE DE AFECTACIÓN.","GRUPO INTERNO DE TRABAJO DE PRESUPUESTO","2018-11-28","GRUPO INTERNO DE TRABAJO DE PRESUPUESTO","2019-01-02","APOYO","GESTION_RECURSOS","GESTION FINANCIERA","DECRETO 111 DE 1996","Externo","Físico","Documentos de Archivo - físicos","Papel","Español","INFORMACIÓN PÚBLICA","N/A","N/A","N/A","N/A","N/A","N/A","N/A","Dato semiprivado","b. Desarrollar los estudios previos y procesos de selección para la contratación oficial del Ministerio/Fondo TIC destinada a garantizar el funcionamiento de la entidad y la ejecución de proyectos y el desarrollo de esquemas de gerencia de proyectos."]
["423-538","INFORMACIÓN","GRUPO INTERNO DE TRABAJO DE PRESUPUESTO","CERTIFICADO DE DISPONIBILIDAD PRESUPUESTAL","DOCUMENTO EXPEDIDO POR EL JEFE DE PRESUPUESTO CON EL CUAL SE GARANTIZA LA EXISATENCIA DE APROPACIÓN PRESUPUESTAL Y LIBRE DE AFECTACIÓN.","GRUPO INTERNO DE TRABAJO DE PRESUPUESTO","2018-11-28","GRUPO INTERNO DE TRABAJO DE PRESUPUESTO","2019-01-02","APOYO","GESTION_RECURSOS","GESTION FINANCIERA","DECRETO 111 DE 1996","Externo","Físico","Documentos de Archivo - físicos","Papel","Español","INFORMACIÓN PÚBLICA","N/A","N/A","N/A","N/A","N/A","N/A","N/A","Dato semiprivado","b. Desarrollar los estudios previos y procesos de selección para la contratación oficial del Ministerio/Fondo TIC destinada a garantizar el funcionamiento de la entidad y la ejecución de proyectos y el desarrollo de esquemas de gerencia de proyectos."]
["423-539","INFORMACIÓN","GRUPO INTERNO DE TRABAJO DE PRESUPUESTO","INFORME DE EJECUCIÓN PRESUPUESTAL","DOCUMENTO QUE CONTIENE EL ESTADO DE EJECUCIÓN PRESUPUIESTAL.","GRUPO INTERNO DE TRABAJO DE PRESUPUESTO","2018-11-28","GRUPO INTERNO DE TRABAJO DE PRESUPUESTO","2019-01-02","APOYO","GESTION_RECURSOS","GESTION FINANCIERA","LEY 1712 DE 2014","Externo","Digital","Sistemas de Información corporativos","XLS","Español","INFORMACIÓN PÚBLICA","https://www.mintic.gov.co/portal/inicio/Ministerio/Presupuestos/","N/A","N/A","N/A","N/A","N/A","N/A","N/A","N/A"]
["423-540","INFORMACIÓN","GRUPO INTERNO DE TRABAJO DE PRESUPUESTO","INFORMES","DOCUMENTO CON LA INFOMACIÓN SOLICITADA","GRUPO INTERNO DE TRABAJO DE PRESUPUESTO","2018-11-28","GRUPO INTERNO DE TRABAJO DE PRESUPUESTO","2019-01-02","APOYO","GESTION_RECURSOS","GESTION FINANCIERA","N/A","N/A","Físico","Documentos de Archivo - físicos","Papel","Español","INFORMACIÓN PÚBLICA","N/A","N/A","N/A","N/A","N/A","N/A","N/A","N/A","N/A"]
["423-541","INFORMACIÓN","GRUPO INTERNO DE TRABAJO DE PRESUPUESTO","RESPUESTASA A PQRSD","DOCUMENTO CON LA INFOMACIÓN SOLICITADA","GRUPO INTERNO DE TRABAJO DE PRESUPUESTO","2018-11-28","GRUPO INTERNO DE TRABAJO DE PRESUPUESTO","2019-01-02","APOYO","GESTION_RECURSOS","GESTION FINANCIERA","N/A","N/A","Físico","Documentos de Archivo - físicos","Papel","Español","INFORMACIÓN PÚBLICA","N/A","N/A","N/A","N/A","N/A","N/A","N/A","N/A","N/A"]
["423-542","INFORMACIÓN","GRUPO INTERNO DE TRABAJO DE PRESUPUESTO","PROYECTO DE PRESUPUESTO","DOCUMENTO CON LA INFORMACIÓN DE LAS PROYECCIONES DEL PRESUPUESTO DE LA ENTIDAD","GRUPO INTERNO DE TRABAJO DE PRESUPUESTO","2018-11-28","GRUPO INTERNO DE TRABAJO DE PRESUPUESTO","2019-01-02","APOYO","GESTION_RECURSOS","GESTION FINANCIERA","DECRETO 111 DE 1996","Externo","Físico","Documentos de Archivo - físicos","Papel","Español","INFORMACIÓN PÚBLICA","N/A","N/A","N/A","N/A","N/A","N/A","N/A","N/A","N/A"]
["423-543","INFORMACIÓN","GRUPO INTERNO DE TRABAJO DE PRESUPUESTO","PROYECTO DE PRESUPUESTO","DOCUMENTO CON LA INFORMACIÓN DE LAS PROYECCIONES DEL PRESUPUESTO DE LA ENTIDAD","GRUPO INTERNO DE TRABAJO DE PRESUPUESTO","2018-11-28","GRUPO INTERNO DE TRABAJO DE PRESUPUESTO","2019-01-02","APOYO","GESTION_RECURSOS","GESTION FINANCIERA","DECRETO 111 DE 1996","Externo","Físico","Documentos de Archivo - físicos","Papel","Español","INFORMACIÓN PÚBLICA","N/A","N/A","N/A","N/A","N/A","N/A","N/A","N/A","N/A"]
["423-544","INFORMACIÓN","GRUPO INTERNO DE TRABAJO DE PRESUPUESTO","REGISTROS PRESUPUESTALES","DOCUMENTO CON LA IMPUTACIÓN PRESUPUESTAL MEDIANTE LA CUAL SE AFECTA EN FORMA DEFENITIVA LA APROPACIÓN","GRUPO INTERNO DE TRABAJO DE PRESUPUESTO","2018-11-28","GRUPO INTERNO DE TRABAJO DE PRESUPUESTO","2019-01-02","APOYO","GESTION_RECURSOS","GESTION FINANCIERA","DECRETO 111 DE 1996","Externo","Físico","Documentos de Archivo - físicos","Papel","Español","INFORMACIÓN PÚBLICA","N/A","N/A","N/A","N/A","N/A","N/A","N/A","Datos sensibles","b. Desarrollar los estudios previos y procesos de selección para la contratación oficial del Ministerio/Fondo TIC destinada a garantizar el funcionamiento de la entidad y la ejecución de proyectos y el desarrollo de esquemas de gerencia de proyectos."]
["423-545","INFORMACIÓN","GRUPO INTERNO DE TRABAJO DE PRESUPUESTO","REGISTROS PRESUPUESTALES","DOCUMENTO CON LA IMPUTACIÓN PRESUPUESTAL MEDIANTE LA CUAL SE AFECTA EN FORMA DEFENITIVA LA APROPACIÓN","GRUPO INTERNO DE TRABAJO DE PRESUPUESTO","2018-11-28","GRUPO INTERNO DE TRABAJO DE PRESUPUESTO","2019-01-02","APOYO","GESTION_RECURSOS","GESTION FINANCIERA","DECRETO 111 DE 1996","Externo","Físico","Documentos de Archivo - físicos","Papel","Español","INFORMACIÓN PÚBLICA","N/A","N/A","N/A","N/A","N/A","N/A","N/A","Dato semiprivado","b. Desarrollar los estudios previos y procesos de selección para la contratación oficial del Ministerio/Fondo TIC destinada a garantizar el funcionamiento de la entidad y la ejecución de proyectos y el desarrollo de esquemas de gerencia de proyectos."]
["423-546","INFORMACIÓN","GRUPO INTERNO DE TRABAJO DE PRESUPUESTO","RESERVAS PRESUPUESTALES","CORRESPONDEN A LOS CONTRATOS SUSCRITOS QUE TIENEN RESPALDO PRESUPUESTAL PERO QUE A LA FECHA DEL CIERRE ANUAL, NO SE HAN CONSTITUIDO OBLIGACIONES,","GRUPO INTERNO DE TRABAJO DE PRESUPUESTO","2018-11-28","GRUPO INTERNO DE TRABAJO DE PRESUPUESTO","2019-01-02","APOYO","GESTION_RECURSOS","GESTION FINANCIERA","DECRETO 111 DE 1996","Externo","Físico","Documentos de Archivo - físicos","Papel","Español","INFORMACIÓN PÚBLICA","N/A","N/A","N/A","N/A","N/A","N/A","N/A","Dato semiprivado","a. Permitir el desarrollo del objeto del Ministerio/Fondo TIC, en los términos de los artículos 1o y 2o del Decreto 1414 de 2017."]
["423-547","INFORMACIÓN","GRUPO INTERNO DE TRABAJO DE PRESUPUESTO","RESERVAS PRESUPUESTALES","CORRESPONDEN A LOS CONTRATOS SUSCRITOS QUE TIENEN RESPALDO PRESUPUESTAL PERO QUE A LA FECHA DEL CIERRE ANUAL, NO SE HAN CONSTITUIDO OBLIGACIONES,","GRUPO INTERNO DE TRABAJO DE PRESUPUESTO","2018-11-28","GRUPO INTERNO DE TRABAJO DE PRESUPUESTO","2019-01-02","APOYO","GESTION_RECURSOS","GESTION FINANCIERA","DECRETO 111 DE 1996","Externo","Físico","Documentos de Archivo - físicos","Papel","Español","INFORMACIÓN PÚBLICA","N/A","N/A","N/A","N/A","N/A","N/A","N/A","Dato semiprivado","a. Permitir el desarrollo del objeto del Ministerio/Fondo TIC, en los términos de los artículos 1o y 2o del Decreto 1414 de 2017."]
["423-548","INFORMACIÓN","GRUPO INTERNO DE TRABAJO DE PRESUPUESTO","CUENTAS POR PAGAR","CORRESPONDEN A LOS CONTRATOS SUSCRITOS QUE TIENEN RESPALDO PRESUPUESTAL PERO QUE A LA FECHA DEL CIERRE ANUAL, NO SE HAN PAGADO SUS OBLIGACIONES,","GRUPO INTERNO DE TRABAJO DE PRESUPUESTO","2018-11-28","GRUPO INTERNO DE TRABAJO DE PRESUPUESTO","2019-01-02","APOYO","GESTION_RECURSOS","GESTION FINANCIERA","DECRETO 111 DE 1996","Externo","Físico","Documentos de Archivo - físicos","Papel","Español","INFORMACIÓN PÚBLICA","N/A","N/A","N/A","N/A","N/A","N/A","N/A","Dato semiprivado","a. Permitir el desarrollo del objeto del Ministerio/Fondo TIC, en los términos de los artículos 1o y 2o del Decreto 1414 de 2017."]
["423-549","INFORMACIÓN","GRUPO INTERNO DE TRABAJO DE PRESUPUESTO","CUENTAS POR PAGAR","CORRESPONDEN A LOS CONTRATOS SUSCRITOS QUE TIENEN RESPALDO PRESUPUESTAL PERO QUE A LA FECHA DEL CIERRE ANUAL, NO SE HAN PAGADO SUS OBLIGACIONES,","GRUPO INTERNO DE TRABAJO DE PRESUPUESTO","2018-11-28","GRUPO INTERNO DE TRABAJO DE PRESUPUESTO","2019-01-02","APOYO","GESTION_RECURSOS","GESTION FINANCIERA","DECRETO 111 DE 1996","Externo","Físico","Documentos de Archivo - físicos","Papel","Español","INFORMACIÓN PÚBLICA","N/A","N/A","N/A","N/A","N/A","N/A","N/A","Dato semiprivado","a. Permitir el desarrollo del objeto del Ministerio/Fondo TIC, en los términos de los artículos 1o y 2o del Decreto 1414 de 2017."]
["423-550","INFORMACIÓN","GRUPO INTERNO DE TRABAJO DE PRESUPUESTO","SOLICITUD","DOCUMENTO POR EL CUAL SOLICITAN LA EXPEDICIÓN DE UN CDP,","GRUPO INTERNO DE TRABAJO DE PRESUPUESTO","2018-11-28","GRUPO INTERNO DE TRABAJO DE PRESUPUESTO","2019-01-02","APOYO","GESTION_RECURSOS","GESTION FINANCIERA","DECRETO 111 DE 1996","Externo","Físico","Documentos de Archivo - físicos","Papel","Español","INFORMACIÓN PÚBLICA","N/A","N/A","N/A","N/A","N/A","N/A","N/A","Dato personal público","b. Desarrollar los estudios previos y procesos de selección para la contratación oficial del Ministerio/Fondo TIC destinada a garantizar el funcionamiento de la entidad y la ejecución de proyectos y el desarrollo de esquemas de gerencia de proyectos."]
["423-551","INFORMACIÓN","GRUPO INTERNO DE TRABAJO DE PRESUPUESTO","SOLICITUD","DOCUMENTO POR EL CUAL SOLICITAN LA EXPEDICIÓN DE UN CDP,","GRUPO INTERNO DE TRABAJO DE PRESUPUESTO","2018-11-28","GRUPO INTERNO DE TRABAJO DE PRESUPUESTO","2019-01-02","APOYO","GESTION_RECURSOS","GESTION FINANCIERA","DECRETO 111 DE 1996","Externo","Físico","Documentos de Archivo - físicos","Papel","Español","INFORMACIÓN PÚBLICA","N/A","N/A","N/A","N/A","N/A","N/A","N/A","Dato personal público","b. Desarrollar los estudios previos y procesos de selección para la contratación oficial del Ministerio/Fondo TIC destinada a garantizar el funcionamiento de la entidad y la ejecución de proyectos y el desarrollo de esquemas de gerencia de proyectos."]
["421-552","INFORMACIÓN","GRUPO INTERNO DE TRABAJO DE TESORERIA","Reintegros Dirección del Tesoro Nacional - Ministerio","Consignación al Tesoro Nacional de recursos no ejecutados - Consignaciones a la DTN","GRUPO INTERNO DE TRABAJO DE TESORERIA","2018-11-28","GRUPO INTERNO DE TRABAJO DE TESORERIA","2019-01-02","APOYO","GESTION_RECURSOS","GESTION FINANCIERA","Decreto 111 de 1996; Artículo 18 literal b y artículo 19 literal a,b ley 1712 de 2014","Externo","Físico","Documentos de Archivo - físicos","Papel","Español","NO CLASIFICADA","Oficina de Tesorería","N/A","N/A","N/A","N/A","N/A","N/A","N/A","a. Permitir el desarrollo del objeto del Ministerio/Fondo TIC, en los términos de los artículos 1o y 2o del Decreto 1414 de 2017."]
["421-553","INFORMACIÓN","GRUPO INTERNO DE TRABAJO DE TESORERIA","ACUERDOS","Instrumento de cobro por refinanciación de deudas","GRUPO INTERNO DE TRABAJO DE TESORERIA","2018-11-28","GRUPO INTERNO DE TRABAJO DE TESORERIA","2019-01-02","APOYO","GESTION_RECURSOS","GESTION FINANCIERA","Resolución 3361 de 2017","Interno","Físico","Documentos de Archivo - físicos","Papel","Español","NO CLASIFICADA","Oficina de Tesorería","N/A","N/A","N/A","N/A","N/A","N/A","Dato personal privado ","a. Permitir el desarrollo del objeto del Ministerio/Fondo TIC, en los términos de los artículos 1o y 2o del Decreto 1414 de 2017."]
["421-554","INFORMACIÓN","GRUPO INTERNO DE TRABAJO DE TESORERIA","BOLETINES","Reporte diario de saldos de caja y bancos","GRUPO INTERNO DE TRABAJO DE TESORERIA","2018-11-28","GRUPO INTERNO DE TRABAJO DE TESORERIA","2019-01-02","APOYO","GESTION_RECURSOS","GESTION FINANCIERA","Resolución 3361 de 2017","Interno","Físico","Documentos de Archivo - físicos","Papel","Español","INFORMACIÓN PÚBLICA","Oficina de Tesorería","N/A","N/A","N/A","N/A","N/A","N/A","N/A","N/A"]
["421-555","INFORMACIÓN","GRUPO INTERNO DE TRABAJO DE TESORERIA","BOLETINES","Reporte diario de saldos de caja y bancos","GRUPO INTERNO DE TRABAJO DE TESORERIA","2018-11-28","GRUPO INTERNO DE TRABAJO DE TESORERIA","2019-01-02","APOYO","GESTION_RECURSOS","GESTION FINANCIERA","Resolución 3361 de 2017","Interno","Físico","Documentos de Archivo - físicos","Papel","Español","INFORMACIÓN PÚBLICA","Oficina de Tesorería","N/A","N/A","N/A","N/A","N/A","N/A","N/A","N/A"]
["421-556","INFORMACIÓN","GRUPO INTERNO DE TRABAJO DE TESORERIA","CERTIFICADOS","Certificado de retencion en la fuente","GRUPO INTERNO DE TRABAJO DE TESORERIA","2018-11-28","GRUPO INTERNO DE TRABAJO DE TESORERIA","2019-01-02","APOYO","GESTION_RECURSOS","GESTION FINANCIERA","Articulos 378 -379 E.T.","Interno","Digital","Disco duros, servidores, discos o medios portables, cintas o medios de video y audio (análogo o digital), etc.","TIFF","Español","INFORMACIÓN PÚBLICA","Oficina de Tesorería","N/A","N/A","N/A","N/A","N/A","N/A","Dato personal público","a. Permitir el desarrollo del objeto del Ministerio/Fondo TIC, en los términos de los artículos 1o y 2o del Decreto 1414 de 2017."]
["421-557","INFORMACIÓN","GRUPO INTERNO DE TRABAJO DE TESORERIA","CONCILIACIONES BANCARIAS","INSTRUMENTO DE CONTROL PARA  CRUZAR INFORMACION DE AXULIARES CON EXTRACTO","GRUPO INTERNO DE TRABAJO DE TESORERIA","2018-11-28","GRUPO INTERNO DE TRABAJO DE TESORERIA","2019-01-02","APOYO","GESTION_RECURSOS","GESTION FINANCIERA","Resolución 0003361/2017","Interno","Físico","Documentos de Archivo - físicos","Papel","Español","INFORMACIÓN PÚBLICA","Oficina de Tesorería","N/A","N/A","N/A","N/A","N/A","N/A","N/A","N/A"]
["421-558","INFORMACIÓN","GRUPO INTERNO DE TRABAJO DE TESORERIA","CONCILIACIONES BANCARIAS","INSTRUMENTO DE CONTROL PARA  CRUZAR INFORMACION DE AXULIARES CON EXTRACTO","GRUPO INTERNO DE TRABAJO DE TESORERIA","2018-11-28","GRUPO INTERNO DE TRABAJO DE TESORERIA","2019-01-02","APOYO","GESTION_RECURSOS","GESTION FINANCIERA","Resolución 0003361/2018","Interno","Físico","Documentos de Archivo - físicos","Papel","Español","INFORMACIÓN PÚBLICA","Oficina de Tesorería","N/A","N/A","N/A","N/A","N/A","N/A","N/A","N/A"]
["421-559","INFORMACIÓN","GRUPO INTERNO DE TRABAJO DE TESORERIA","CONCILIACIONES BANCARIAS","INSTRUMENTO DE CONTROL PARA  CRUZAR INFORMACION DE AXULIARES CON EXTRACTO","GRUPO INTERNO DE TRABAJO DE TESORERIA","2018-11-28","GRUPO INTERNO DE TRABAJO DE TESORERIA","2019-01-02","APOYO","GESTION_RECURSOS","GESTION FINANCIERA","Resolución 0003361/2019","Interno","Físico","Documentos de Archivo - físicos","Papel","Español","INFORMACIÓN PÚBLICA","Oficina de Tesorería","N/A","N/A","N/A","N/A","N/A","N/A","N/A","N/A"]
["421-560","INFORMACIÓN","GRUPO INTERNO DE TRABAJO DE TESORERIA","CUENTAS BANCARIAS","Apertura y cierre de cuentas bancarias","GRUPO INTERNO DE TRABAJO DE TESORERIA","2018-11-28","GRUPO INTERNO DE TRABAJO DE TESORERIA","2019-01-02","APOYO","GESTION_RECURSOS","GESTION FINANCIERA","Art. 3 Ley 1 de 1980; Ley 38 de 1989; Ley 179 de 1994; Ley 225 de 1995","Externo","Físico","Documentos de Archivo - físicos","Papel","Español","NO CLASIFICADA","Oficina de Tesorería","N/A","N/A","N/A","N/A","N/A","N/A","N/A","N/A"]
["421-561","INFORMACIÓN","GRUPO INTERNO DE TRABAJO DE TESORERIA","CUENTAS BANCARIAS","Apertura y cierre de cuentas bancarias","GRUPO INTERNO DE TRABAJO DE TESORERIA","2018-11-28","GRUPO INTERNO DE TRABAJO DE TESORERIA","2019-01-02","APOYO","GESTION_RECURSOS","GESTION FINANCIERA","Art. 3 Ley 1 de 1980; Ley 38 de 1989; Ley 179 de 1994; Ley 225 de 1996","Externo","Físico","Documentos de Archivo - físicos","Papel","Español","NO CLASIFICADA","Oficina de Tesorería","N/A","N/A","N/A","N/A","N/A","N/A","N/A","N/A"]
["421-562","INFORMACIÓN","GRUPO INTERNO DE TRABAJO DE TESORERIA","DECLARACIONES TRIBUTARIAS","Formato donde se informa las responsabilidades tributarias y se solicitan beneficios tributarios","GRUPO INTERNO DE TRABAJO DE TESORERIA","2018-11-28","GRUPO INTERNO DE TRABAJO DE TESORERIA","2019-01-02","APOYO","GESTION_RECURSOS","GESTION FINANCIERA","Estatuto Tributario; Decreto 1808 y 1625 de 2019; Decreto 2499 de2012 ","Externo","Físico","Documentos de Archivo - físicos","Papel","Español","INFORMACIÓN PÚBLICA CLASIFICADA","Oficina de Tesorería","SI","Estatuto Tributario; Decreto 1808 y 1625 de 2019; Decreto 2499 de2012 ","Toda la información que sea de un tercero no se publica ","Reserva parcial","N/A","15 AÑOS","Datos sensibles","a. Permitir el desarrollo del objeto del Ministerio/Fondo TIC, en los términos de los artículos 1o y 2o del Decreto 1414 de 2017."]
["421-563","INFORMACIÓN","GRUPO INTERNO DE TRABAJO DE TESORERIA","DECLARACIONES TRIBUTARIAS","Registro en la plataforma externa y en formato externo, con información períodica sobre las contribuciones retenidas","GRUPO INTERNO DE TRABAJO DE TESORERIA","2018-11-28","GRUPO INTERNO DE TRABAJO DE TESORERIA","2019-01-02","APOYO","GESTION_RECURSOS","GESTION FINANCIERA","Ley 1106 de 2006; 1421 de 2010; Decreto 399 de 2011","Externo","Físico","Documentos de Archivo - físicos","Papel","Español","INFORMACIÓN PÚBLICA","Oficina de Tesorería","N/A","Estatuto Tributario Nacional","N/A","N/A","N/A","N/A","N/A","N/A"]
["421-564","INFORMACIÓN","GRUPO INTERNO DE TRABAJO DE TESORERIA","DECLARACIONES TRIBUTARIAS","Registro en la plataforma externa y en formato externo, con información períodica sobre las contribuciones retenidas","GRUPO INTERNO DE TRABAJO DE TESORERIA","2018-11-28","GRUPO INTERNO DE TRABAJO DE TESORERIA","2019-01-02","APOYO","GESTION_RECURSOS","GESTION FINANCIERA","Ley 1106 de 2006; 1421 de 2010; Decreto 399 de 2012","Externo","Físico","Documentos de Archivo - físicos","Papel","Español","INFORMACIÓN PÚBLICA","Oficina de Tesorería","N/A","Estatuto Tributario Nacional","N/A","N/A","N/A","N/A","N/A","N/A"]
["421-565","INFORMACIÓN","GRUPO INTERNO DE TRABAJO DE TESORERIA","DECLARACIONES TRIBUTARIAS","Formato litrográfico para presentar declaraciones mensuales de retención","GRUPO INTERNO DE TRABAJO DE TESORERIA","2018-11-28","GRUPO INTERNO DE TRABAJO DE TESORERIA","2019-01-02","APOYO","GESTION_RECURSOS","GESTION FINANCIERA","Estatuto Tributario Nacional","Externo","Físico","Documentos de Archivo - físicos","Papel","Español","INFORMACIÓN PÚBLICA CLASIFICADA","Oficina de Tesorería","SI","Estatuto Tributario; Decreto 1808 y 1625 de 2019; Decreto 2499 de2012 ","Toda la información que sea de un tercero no se publica ","Reserva parcial","N/A","15 AÑOS","N/A","a. Permitir el desarrollo del objeto del Ministerio/Fondo TIC, en los términos de los artículos 1o y 2o del Decreto 1414 de 2017."]
["421-566","INFORMACIÓN","GRUPO INTERNO DE TRABAJO DE TESORERIA","DECLARACIONES TRIBUTARIAS","Formato litrográfico para presentar declaraciones mensuales de retención","GRUPO INTERNO DE TRABAJO DE TESORERIA","2018-11-28","GRUPO INTERNO DE TRABAJO DE TESORERIA","2019-01-02","APOYO","GESTION_RECURSOS","GESTION FINANCIERA","Estatuto Tributario Nacional","Externo","Físico","Documentos de Archivo - físicos","Papel","Español","INFORMACIÓN PÚBLICA CLASIFICADA","Oficina de Tesorería","SI","Estatuto Tributario; Decreto 1808 y 1625 de 2019; Decreto 2499 de2012 ","Toda la información que sea de un tercero no se publica ","Reserva parcial","N/A","15 AÑOS","N/A","a. Permitir el desarrollo del objeto del Ministerio/Fondo TIC, en los términos de los artículos 1o y 2o del Decreto 1414 de 2017."]
["421-567","INFORMACIÓN","GRUPO INTERNO DE TRABAJO DE TESORERIA","DECLARACIONES TRIBUTARIAS","Formato externo, con información períodica semestral sobre las contribuciones retenidas","GRUPO INTERNO DE TRABAJO DE TESORERIA","2018-11-28","GRUPO INTERNO DE TRABAJO DE TESORERIA","2019-01-02","APOYO","GESTION_RECURSOS","GESTION FINANCIERA","Ley 1697 de 2013","Externo","Físico","Documentos de Archivo - físicos","Papel","Español","INFORMACIÓN PÚBLICA","Oficina de Tesorería","N/A","N/A","N/A","N/A","N/A","N/A","N/A","N/A"]
["421-568","INFORMACIÓN","GRUPO INTERNO DE TRABAJO DE TESORERIA","DECLARACIONES TRIBUTARIAS","Formato externo, con información períodica semestral sobre las contribuciones retenidas","GRUPO INTERNO DE TRABAJO DE TESORERIA","2018-11-28","GRUPO INTERNO DE TRABAJO DE TESORERIA","2019-01-02","APOYO","GESTION_RECURSOS","GESTION FINANCIERA","Ley 1697 de 2013","Externo","Físico","Documentos de Archivo - físicos","Papel","Español","INFORMACIÓN PÚBLICA","Oficina de Tesorería","N/A","N/A","N/A","N/A","N/A","N/A","N/A","N/A"]
["421-569","INFORMACIÓN","GRUPO INTERNO DE TRABAJO DE TESORERIA","DECLARACIONES TRIBUTARIAS","Formato litrográfico para presentar declaraciones bimensuales de retención","GRUPO INTERNO DE TRABAJO DE TESORERIA","2018-11-28","GRUPO INTERNO DE TRABAJO DE TESORERIA","2019-01-02","APOYO","GESTION_RECURSOS","GESTION FINANCIERA","Estatuto Tributario Territorial","Externo","Físico","Documentos de Archivo - físicos","Papel","Español","INFORMACIÓN PÚBLICA CLASIFICADA","Oficina de Tesorería","SI","Estatuto Tributario; Decreto 1808 y 1625 de 2019; Decreto 2499 de2012 ","Toda la información que sea de un tercero no se publica ","Reserva parcial","N/A","15 AÑOS","N/A","a. Permitir el desarrollo del objeto del Ministerio/Fondo TIC, en los términos de los artículos 1o y 2o del Decreto 1414 de 2017."]
["421-570","INFORMACIÓN","GRUPO INTERNO DE TRABAJO DE TESORERIA","DECLARACIONES TRIBUTARIAS","Formato litrográfico para presentar declaraciones bimensuales de retención","GRUPO INTERNO DE TRABAJO DE TESORERIA","2018-11-28","GRUPO INTERNO DE TRABAJO DE TESORERIA","2019-01-02","APOYO","GESTION_RECURSOS","GESTION FINANCIERA","Estatuto Tributario Territorial","Externo","Físico","Documentos de Archivo - físicos","Papel","Español","INFORMACIÓN PÚBLICA CLASIFICADA","Oficina de Tesorería","SI","Estatuto Tributario; Decreto 1808 y 1625 de 2019; Decreto 2499 de2012 ","Toda la información que sea de un tercero no se publica ","Reserva parcial","N/A","15 AÑOS","N/A","a. Permitir el desarrollo del objeto del Ministerio/Fondo TIC, en los términos de los artículos 1o y 2o del Decreto 1414 de 2017."]
["421-571","INFORMACIÓN","GRUPO INTERNO DE TRABAJO DE TESORERIA","EMBARGOS","Medidas cautelares judiciales","GRUPO INTERNO DE TRABAJO DE TESORERIA","2018-11-28","GRUPO INTERNO DE TRABAJO DE TESORERIA","2019-01-02","APOYO","GESTION_RECURSOS","GESTION FINANCIERA","Art 2; 29;229 de la CP; Ley 270 de 1996; Código General del Proceso","Externo","Físico","Documentos de Archivo - físicos","Papel","Español","INFORMACIÓN PÚBLICA CLASIFICADA","Oficina de Tesorería","SI","Art 2; 29;229 de la CP; Ley 270 de 1996; Código General del Proceso","Toda la información que sea de un tercero no se publica ","Reserva parcial","N/A","15 AÑOS","Datos sensibles","a. Permitir el desarrollo del objeto del Ministerio/Fondo TIC, en los términos de los artículos 1o y 2o del Decreto 1414 de 2017."]
["421-572","INFORMACIÓN","GRUPO INTERNO DE TRABAJO DE TESORERIA","EMBARGOS","Medidas cautelares judiciales","GRUPO INTERNO DE TRABAJO DE TESORERIA","2018-11-28","GRUPO INTERNO DE TRABAJO DE TESORERIA","2019-01-02","APOYO","GESTION_RECURSOS","GESTION FINANCIERA","Art 2; 29;229 de la CP; Ley 270 de 1996; Código General del Proceso","Externo","Físico","Documentos de Archivo - físicos","Papel","Español","INFORMACIÓN PÚBLICA CLASIFICADA","Oficina de Tesorería","SI","Art 2; 29;229 de la CP; Ley 270 de 1996; Código General del Proceso","Toda la información que sea de un tercero no se publica ","Reserva parcial","N/A","15 AÑOS","Datos sensibles","a. Permitir el desarrollo del objeto del Ministerio/Fondo TIC, en los términos de los artículos 1o y 2o del Decreto 1414 de 2017."]
["421-573","INFORMACIÓN","GRUPO INTERNO DE TRABAJO DE TESORERIA","EVALUACIÓN Y SEGUIMIENTO DE CONVENIOS BANCARIOS","Verificación del cumplimiento de lo pactado en los Convenios con las entidades Financieras","GRUPO INTERNO DE TRABAJO DE TESORERIA","2018-11-28","GRUPO INTERNO DE TRABAJO DE TESORERIA","2019-01-02","APOYO","GESTION_RECURSOS","GESTION FINANCIERA","Resolución 3361 de 2017","Interno","Físico","Documentos de Archivo - físicos","Papel","Español","INFORMACIÓN PÚBLICA","Oficina de Tesorería","N/A","N/A","N/A","N/A","N/A","N/A","N/A","N/A"]
["421-574","INFORMACIÓN","GRUPO INTERNO DE TRABAJO DE TESORERIA","INFORMES","Contiene la información reportada a otras entidades públicas","GRUPO INTERNO DE TRABAJO DE TESORERIA","2018-11-28","GRUPO INTERNO DE TRABAJO DE TESORERIA","2019-01-02","APOYO","GESTION_RECURSOS","GESTION FINANCIERA","Resolución 3361 de 2017","Interno","Físico","Documentos de Archivo - físicos","Papel","Español","INFORMACIÓN PÚBLICA","Oficina de Tesorería","N/A","N/A","N/A","N/A","N/A","N/A","N/A","N/A"]
["421-575","INFORMACIÓN","GRUPO INTERNO DE TRABAJO DE TESORERIA","INFORMES","Continene la relación de obligaciones no canceladas y reconocidas, al término de la vigencia","GRUPO INTERNO DE TRABAJO DE TESORERIA","2018-11-28","GRUPO INTERNO DE TRABAJO DE TESORERIA","2019-01-02","APOYO","GESTION_RECURSOS","GESTION FINANCIERA","Resolución 3361 de 2017","Interno","Digital","Sistemas de Información corporativos","XLS -PDF","Español","INFORMACIÓN PÚBLICA","Oficina de Tesorería","N/A","N/A","N/A","N/A","N/A","N/A","N/A","N/A"]
["421-576","INFORMACIÓN","GRUPO INTERNO DE TRABAJO DE TESORERIA","LEGALIZACIONES","Apertura, ejecución peródic de gastos y cierre del Fondo de Caja Menor ","GRUPO INTERNO DE TRABAJO DE TESORERIA","2018-11-28","GRUPO INTERNO DE TRABAJO DE TESORERIA","2019-01-02","APOYO","GESTION_RECURSOS","GESTION FINANCIERA","Resolución 3361 de 2017","Interno","Físico","Documentos de Archivo - físicos","Papel","Español","INFORMACIÓN PÚBLICA","Oficina de Tesorería","N/A","N/A","N/A","N/A","N/A","N/A","N/A","N/A"]
["421-577","INFORMACIÓN","GRUPO INTERNO DE TRABAJO DE TESORERIA","LEGALIZACIONES","Registro definitivo de los viáticos y gastos de viaje otorgados",{"$f":"IF(C584=\"\",\"\",C584)","v":"GRUPO INTERNO DE TRABAJO DE TESORERIA"},"2018-11-28","GRUPO INTERNO DE TRABAJO DE TESORERIA","2019-01-02","APOYO","GESTION_RECURSOS","GESTION FINANCIERA","Resolución 3361 de 2017","Interno","Físico","Documentos de Archivo - físicos","Papel","Español","INFORMACIÓN PÚBLICA","Oficina de Tesorería","N/A","N/A","N/A","N/A","N/A","N/A","N/A","N/A"]
["421-578","INFORMACIÓN","GRUPO INTERNO DE TRABAJO DE TESORERIA","NOMINA","Relación de servidores que devengan contraprestaciónes laborales","GRUPO INTERNO DE TRABAJO DE TESORERIA","2018-11-28","GRUPO INTERNO DE TRABAJO DE TESORERIA","2019-01-02","APOYO","GESTION_RECURSOS","GESTION FINANCIERA","Resolución 3361 de 2017","Interno","Físico","Documentos de Archivo - físicos","Papel","Español","INFORMACIÓN PÚBLICA CLASIFICADA","Oficina de Tesorería","SI","Resolución 3361 de 2017","Toda la información que sea de un tercero no se publica ","Reserva parcial","N/A","15 AÑOS","Dato personal privado ","e. Mantener actualizada la historia laboral y registros de nómina de funcionarios del Ministerio/Fondo TIC."]
["421-579","INFORMACIÓN","GRUPO INTERNO DE TRABAJO DE TESORERIA","ORDENES DE PAGO","Documento donde se determina la cantidad pagada a un tercero, junto con sus soportes","GRUPO INTERNO DE TRABAJO DE TESORERIA","2018-11-28","GRUPO INTERNO DE TRABAJO DE TESORERIA","2019-01-02","APOYO","GESTION_RECURSOS","GESTION FINANCIERA","Resolución 3361 de 2017","Interno","Físico","Documentos de Archivo - físicos","Papel","Español","INFORMACIÓN PÚBLICA CLASIFICADA","Oficina de Tesorería","SI","Resolución 3361 de 2017","Toda la información que sea de un tercero no se publica ","Reserva parcial","N/A","15 AÑOS","Dato personal público","a. Permitir el desarrollo del objeto del Ministerio/Fondo TIC, en los términos de los artículos 1o y 2o del Decreto 1414 de 2017."]
["421-580","INFORMACIÓN","GRUPO INTERNO DE TRABAJO DE TESORERIA","ORDENES DE PAGO","Documento donde se determina la cantidad pagada a un tercero, junto con sus soportes","GRUPO INTERNO DE TRABAJO DE TESORERIA","2018-11-28","GRUPO INTERNO DE TRABAJO DE TESORERIA","2019-01-02","APOYO","GESTION_RECURSOS","GESTION FINANCIERA","Resolución 3361 de 2017","Interno","Físico","Documentos de Archivo - físicos","Papel","Español","INFORMACIÓN PÚBLICA CLASIFICADA","Oficina de Tesorería","SI","Resolución 3361 de 2017","Toda la información que sea de un tercero no se publica ","Reserva parcial","N/A","15 AÑOS","Dato personal público","a. Permitir el desarrollo del objeto del Ministerio/Fondo TIC, en los términos de los artículos 1o y 2o del Decreto 1414 de 2017."]
["421-581","INFORMACIÓN","GRUPO INTERNO DE TRABAJO DE TESORERIA","PETICIONES, QUEJAS, RECLAMOS, SUGERENCIAS Y DENUNCIAS - PQRSD","Instrumento ciudadano para demandar información y servicios a la entidad","GRUPO INTERNO DE TRABAJO DE TESORERIA","2018-11-28","GRUPO INTERNO DE TRABAJO DE TESORERIA","2019-01-02","APOYO","GESTION_RECURSOS","GESTION FINANCIERA","Ley 1755 de 2015","Externo","Físico","Documentos de Archivo - físicos","Papel","Español","INFORMACIÓN PÚBLICA","ALFANET","N/A","N/A","N/A","N/A","N/A","N/A","Dato personal privado ","f. Atender y resolver peticiones, quejas, reclamos y sugerencias."]
["421-582","INFORMACIÓN","GRUPO INTERNO DE TRABAJO DE TESORERIA","PLANES","Instrumento mediante el cual se programa el flujo de recursos durante una vigencia fiscal","GRUPO INTERNO DE TRABAJO DE TESORERIA","2018-11-28","GRUPO INTERNO DE TRABAJO DE TESORERIA","2019-01-02","APOYO","GESTION_RECURSOS","GESTION FINANCIERA","Decreto 111 de 1996","Externo","Físico","Documentos de Archivo - físicos","Papel","Español","INFORMACIÓN PÚBLICA","Oficina de Tesorería","N/A","N/A","N/A","N/A","N/A","N/A","N/A","N/A"]
["421-583","INFORMACIÓN","GRUPO INTERNO DE TRABAJO DE TESORERIA","RECAUDOS","Registro de los ingresos de la entifdad","GRUPO INTERNO DE TRABAJO DE TESORERIA","2018-11-28","GRUPO INTERNO DE TRABAJO DE TESORERIA","2019-01-02","APOYO","GESTION_RECURSOS","GESTION FINANCIERA","Ley 1341 de 2009","Externo","Físico","Documentos de Archivo - físicos","Papel","Español","INFORMACIÓN PÚBLICA","Oficina de Tesorería","N/A","N/A","N/A","N/A","N/A","N/A","Dato personal público","a. Permitir el desarrollo del objeto del Ministerio/Fondo TIC, en los términos de los artículos 1o y 2o del Decreto 1414 de 2017."]
["430-584","INFORMACIÓN","SUBDIRECCIÓN ADMINISTRATIVA Y DE GESTIÓN HUMANA","Acta","Marco normativo por el que se debe regir el comité de teletrabajo","SUBDIRECCIÓN ADMINISTRATIVA Y DE GESTIÓN HUMANA","2018-11-28","GRUPO INTERNO DE TRABAJO DE GESTIÓN DE TALENTO HUMANO","2019-01-02","APOYO","GESTION_RECURSOS","GESTION DEL TALENTO HUMANO","Resolución 1151 de 2019","Externo","Físico","Documentos de Archivo - físicos","Papel","Español","INFORMACIÓN PÚBLICA CLASIFICADA","N/A","SI","Ley 1712 de 2014\nLey 1581 de 2012","Resolución 1151 de 2019","Reserva parcial","16 de Mayo de 2019","N/A","Dato personal privado ","d. Formular, ejecutar y evaluar los programas de salud ocupacional y planes de atención a emergencias."]
["430-585","INFORMACIÓN","SUBDIRECCIÓN ADMINISTRATIVA Y DE GESTIÓN HUMANA","PQRSD","Solicitudes o respuestas a PQRSD generadas por los grupos de interés","SUBDIRECCIÓN ADMINISTRATIVA Y DE GESTIÓN HUMANA","2018-11-28","GRUPO INTERNO DE TRABAJO DE FORTALECIMIENTO DE LAS RELACIONES CON LOS GRUPOS DE INTERES","2019-01-02","ESTRATEGICO","GESTION_ATENCION_GRUPOS_INTERES","GESTION DE ATENCION A GRUPOS DE INTERES","Código Contencioso de Procedimientos Administrativos\nLey 1437 de 2011","Externo","Físico","Documentos de Archivo - físicos","Papel","Español","INFORMACIÓN PÚBLICA","ALFANET","N/A","N/A","N/A","N/A","N/A","N/A","Dato personal privado ","f. Atender y resolver peticiones, quejas, reclamos y sugerencias."]
["430-586","INFORMACIÓN","SUBDIRECCIÓN ADMINISTRATIVA Y DE GESTIÓN HUMANA","Informes","Solicitudes  de entes de control  y vigilancia","SUBDIRECCIÓN ADMINISTRATIVA Y DE GESTIÓN HUMANA","2018-11-28","SECRETARÍA GENERAL","2019-01-02","APOYO","GESTION_RECURSOS","GESTION DOCUMENTAL","Ley 1712 DE 2014\nDecreto 103 de 2015 Artículo 18 literal a Ley 1712 de 2014","Externo","Físico","Documentos de Archivo - físicos","Papel","Español","INFORMACIÓN PÚBLICA","N/A","N/A","N/A","N/A","N/A","N/A","N/A","N/A","h. Atender requerimientos de información de entes de control tanto internos como externos."]
["430-587","INFORMACIÓN","SUBDIRECCIÓN ADMINISTRATIVA Y DE GESTIÓN HUMANA","Informes","Solicitudes Informes otros Organismos","SUBDIRECCIÓN ADMINISTRATIVA Y DE GESTIÓN HUMANA","2018-11-28","SECRETARÍA GENERAL","2019-01-02","APOYO","GESTION_RECURSOS","GESTION DOCUMENTAL","Ley 1712 DE 2014\nDecreto 103 de 2015 Artículo 18 literal a Ley 1712 de 2015","Externo","Físico","Documentos de Archivo - físicos","Papel","Español","INFORMACIÓN PÚBLICA","N/A","N/A","N/A","N/A","N/A","N/A","N/A","N/A","h. Atender requerimientos de información de entes de control tanto internos como externos."]
["430-588","INFORMACIÓN","SUBDIRECCIÓN ADMINISTRATIVA Y DE GESTIÓN HUMANA","Informes de Gestión","Solicitud de Informes de Gestión","SUBDIRECCIÓN ADMINISTRATIVA Y DE GESTIÓN HUMANA","2018-11-28","SECRETARÍA GENERAL","2019-01-02","APOYO","GESTION_RECURSOS","GESTION DOCUMENTAL","Ley 1712 DE 2014\nDecreto 103 de 2015 Artículo 18 literal a Ley 1712 de 2016","Externo","Físico","Documentos de Archivo - físicos","Papel","Español","INFORMACIÓN PÚBLICA","N/A","N/A","N/A","N/A","N/A","N/A","N/A","N/A","h. Atender requerimientos de información de entes de control tanto internos como externos."]
["430-589","INFORMACIÓN","SUBDIRECCIÓN ADMINISTRATIVA Y DE GESTIÓN HUMANA","PLAN ANUAL DE ADQUISICIONES","Plan Anual de Adquisición","SUBDIRECCIÓN ADMINISTRATIVA Y DE GESTIÓN HUMANA","2018-11-28","GRUPO INTERNO DE TRABAJO DE CONTRATACIÓN","2019-01-02","APOYO","GESTION_RECURSOS","GESTION DE COMPRAS Y CONTRATACION","Ley 1474 de 2011\nDecreto 1082 de 2015\nLey 1712 de 2014\nDecreto 1081 de 2015","Externo","Digital","Documentos de Archivo - electrónicos","XLS","Español","INFORMACIÓN PÚBLICA","WEB DEL MINISTERIO \nSECOP II","N/A","N/A","N/A","N/A","N/A","N/A","Dato personal público","N/A"]
["431-590","INFORMACIÓN","GRUPO INTERNO DE TRABAJO DE ADMINISTRACIÓN DE BIENES","CITACIIÓN","Programación que se envía  a los integrantes del comité de bienes para dar destinación a los bienes","GRUPO INTERNO DE TRABAJO DE ADMINISTRACIÓN DE BIENES","2018-11-28","GRUPO INTERNO DE TRABAJO DE FORTALECIMIENTO DE LAS RELACIONES CON LOS GRUPOS DE INTERES","2019-01-02","APOYO","GESTION_RECURSOS","GESTION DE RECURSOS ADMINISTRATIVOS","Ley 734 del 2002","Externo","Físico","Documentos de Archivo - físicos","Papel","Español","INFORMACIÓN PÚBLICA","Archivo MINTIC","N/A","N/A","N/A","N/A","N/A","N/A","Dato personal público","N/A"]
["431-591","INFORMACIÓN","GRUPO INTERNO DE TRABAJO DE ADMINISTRACIÓN DE BIENES","ACTA","Actas con las decisiones tomadas en materia de bienes muebles e inmuebles","GRUPO INTERNO DE TRABAJO DE ADMINISTRACIÓN DE BIENES","2018-11-28","GRUPO INTERNO DE TRABAJO DE FORTALECIMIENTO DE LAS RELACIONES CON LOS GRUPOS DE INTERES","2019-01-02","APOYO","GESTION_RECURSOS","GESTION DE RECURSOS ADMINISTRATIVOS","Ley 734 del 2002","Externo","Físico","Archivos Institucionales - físicos","Papel","Español","INFORMACIÓN PÚBLICA","Archivo MINTIC","N/A","N/A","N/A","N/A","N/A","N/A","Dato personal público","N/A"]
["431-592","INFORMACIÓN","GRUPO INTERNO DE TRABAJO DE ADMINISTRACIÓN DE BIENES","SOLICITUD","Solicitud de autorización de entrada y salida de elementos a la Entidad","GRUPO INTERNO DE TRABAJO DE ADMINISTRACIÓN DE BIENES","2018-11-28","GRUPO INTERNO DE TRABAJO DE FORTALECIMIENTO DE LAS RELACIONES CON LOS GRUPOS DE INTERES","2019-01-02","APOYO","GESTION_RECURSOS","GESTION DE RECURSOS ADMINISTRATIVOS","Ley 734 del 2002","Externo","Físico","Documentos de Archivo - físicos","Papel","Español","INFORMACIÓN PÚBLICA","Archivo MINTIC","N/A","N/A","N/A","N/A","N/A","N/A","N/A","N/A"]
["431-593","INFORMACIÓN","GRUPO INTERNO DE TRABAJO DE ADMINISTRACIÓN DE BIENES","AUTORIZACIÓN DE ENTRADA","Documento de autorización de entrada de elementos firmado ","GRUPO INTERNO DE TRABAJO DE ADMINISTRACIÓN DE BIENES","2018-11-28","GRUPO INTERNO DE TRABAJO DE FORTALECIMIENTO DE LAS RELACIONES CON LOS GRUPOS DE INTERES","2019-01-02","APOYO","GESTION_RECURSOS","GESTION DE RECURSOS ADMINISTRATIVOS","Ley 734 del 2002","Externo","Físico","Documentos de Archivo - físicos","Papel","Español","INFORMACIÓN PÚBLICA","Archivo MINTIC","N/A","N/A","N/A","N/A","N/A","N/A","N/A","N/A"]
["431-594","INFORMACIÓN","GRUPO INTERNO DE TRABAJO DE ADMINISTRACIÓN DE BIENES","AUTORIZACIÓN DE SALIDA","Documento de autorización de salida de elementos firmado ","GRUPO INTERNO DE TRABAJO DE ADMINISTRACIÓN DE BIENES","2018-11-28","GRUPO INTERNO DE TRABAJO DE FORTALECIMIENTO DE LAS RELACIONES CON LOS GRUPOS DE INTERES","2019-01-02","APOYO","GESTION_RECURSOS","GESTION DE RECURSOS ADMINISTRATIVOS","Ley 734 del 2002","Externo","Físico","Documentos de Archivo - físicos","Papel","Español","INFORMACIÓN PÚBLICA","Archivo MINTIC","N/A","N/A","N/A","N/A","N/A","N/A","N/A","N/A"]
["431-595","INFORMACIÓN","GRUPO INTERNO DE TRABAJO DE ADMINISTRACIÓN DE BIENES","SOLICITUD","Solicitud de elementos de consumo","GRUPO INTERNO DE TRABAJO DE ADMINISTRACIÓN DE BIENES","2018-11-28","GRUPO INTERNO DE TRABAJO DE FORTALECIMIENTO DE LAS RELACIONES CON LOS GRUPOS DE INTERES","2019-01-02","APOYO","GESTION_RECURSOS","GESTION DE RECURSOS ADMINISTRATIVOS","Resolución 3361 de 2018","Interno","Digital","Documentos de Archivo - electrónicos","EML ","Español","INFORMACIÓN PÚBLICA","Correo del coordinador del GIT de Administración de Bienes ","N/A","N/A","N/A","N/A","N/A","N/A","N/A","N/A"]
["431-596","INFORMACIÓN","GRUPO INTERNO DE TRABAJO DE ADMINISTRACIÓN DE BIENES","COMPROBANTE DE EGRESO","Comprobante de salida de elementos de consumo","GRUPO INTERNO DE TRABAJO DE ADMINISTRACIÓN DE BIENES","2018-11-28","GRUPO INTERNO DE TRABAJO DE FORTALECIMIENTO DE LAS RELACIONES CON LOS GRUPOS DE INTERES","2019-01-02","APOYO","GESTION_RECURSOS","GESTION DE RECURSOS ADMINISTRATIVOS","Resolución 3361 de 2018","Interno","Físico","Documentos de Archivo - físicos","Papel","Español","INFORMACIÓN PÚBLICA","Archivo MINTIC","N/A","N/A","N/A","N/A","N/A","N/A","Dato personal público","a. Permitir el desarrollo del objeto del Ministerio/Fondo TIC, en los términos de los artículos 1o y 2o del Decreto 1414 de 2017."]
["431-597","INFORMACIÓN","GRUPO INTERNO DE TRABAJO DE ADMINISTRACIÓN DE BIENES","SOLICITUD","Solicitud de elementos devolutivos del almacén","GRUPO INTERNO DE TRABAJO DE ADMINISTRACIÓN DE BIENES","2018-11-28","GRUPO INTERNO DE TRABAJO DE ADMINISTRACIÓN DE BIENES","2019-01-02","APOYO","GESTION_RECURSOS","GESTION DE RECURSOS ADMINISTRATIVOS","Ley 734 del 2002","Externo","Digital","Documentos de Archivo - electrónicos","EML ","Español","INFORMACIÓN PÚBLICA","Correo del coordinador del GIT de Administración de Bienes ","N/A","N/A","N/A","N/A","N/A","N/A","N/A","N/A"]
["431-598","INFORMACIÓN","GRUPO INTERNO DE TRABAJO DE ADMINISTRACIÓN DE BIENES","COMPROBANTE DE EGRESO","Comprobante de salida de almacén de elementos devolutivos","GRUPO INTERNO DE TRABAJO DE ADMINISTRACIÓN DE BIENES","2018-11-28","GRUPO INTERNO DE TRABAJO DE FORTALECIMIENTO DE LAS RELACIONES CON LOS GRUPOS DE INTERES","2019-01-02","APOYO","GESTION_RECURSOS","GESTION DE RECURSOS ADMINISTRATIVOS","Ley 734 del 2002","Externo","Físico","Documentos de Archivo - físicos","Papel","Español","INFORMACIÓN PÚBLICA","Archivo MINTIC","N/A","N/A","N/A","N/A","N/A","N/A","Dato personal público","a. Permitir el desarrollo del objeto del Ministerio/Fondo TIC, en los términos de los artículos 1o y 2o del Decreto 1414 de 2017."]
["431-599","INFORMACIÓN","GRUPO INTERNO DE TRABAJO DE ADMINISTRACIÓN DE BIENES","CONTRATO Y/O CONVENIO","Contrato y/o convenio por el cual fueron adquiridos los bienes","GRUPO INTERNO DE TRABAJO DE ADMINISTRACIÓN DE BIENES","2018-11-28","GRUPO INTERNO DE TRABAJO DE FORTALECIMIENTO DE LAS RELACIONES CON LOS GRUPOS DE INTERES","2019-01-02","APOYO","GESTION_RECURSOS","GESTION DE RECURSOS ADMINISTRATIVOS","Ley 734 del 2002","Externo","Físico","Documentos de Archivo - físicos","Papel","Español","INFORMACIÓN PÚBLICA","Archivo MINTIC","N/A","N/A","N/A","N/A","N/A","N/A","Dato personal público","a. Permitir el desarrollo del objeto del Ministerio/Fondo TIC, en los términos de los artículos 1o y 2o del Decreto 1414 de 2017."]
["431-600","INFORMACIÓN","GRUPO INTERNO DE TRABAJO DE ADMINISTRACIÓN DE BIENES","PÓLIZA DE SEGUROS (CONVENIO)","Póliza de aseguramiento de los bienes ","GRUPO INTERNO DE TRABAJO DE ADMINISTRACIÓN DE BIENES","2018-11-28","GRUPO INTERNO DE TRABAJO DE FORTALECIMIENTO DE LAS RELACIONES CON LOS GRUPOS DE INTERES","2019-01-02","APOYO","GESTION_RECURSOS","GESTION DE RECURSOS ADMINISTRATIVOS","Ley 734 del 2002","Externo","Físico","Documentos de Archivo - físicos","Papel","Español","INFORMACIÓN PÚBLICA","Archivo MINTIC","N/A","N/A","N/A","N/A","N/A","N/A","Dato personal público","N/A"]
["431-601","INFORMACIÓN","GRUPO INTERNO DE TRABAJO DE ADMINISTRACIÓN DE BIENES","CERTIFICADO DE RECIBO A SATISFACCIÓN","Certificado de recibo a satisfacción de los bienes, por el supervisor del contrato","GRUPO INTERNO DE TRABAJO DE ADMINISTRACIÓN DE BIENES","2018-11-28","GRUPO INTERNO DE TRABAJO DE FORTALECIMIENTO DE LAS RELACIONES CON LOS GRUPOS DE INTERES","2019-01-02","APOYO","GESTION_RECURSOS","GESTION DE RECURSOS ADMINISTRATIVOS","Ley 734 del 2002","Externo","Físico","Documentos de Archivo - físicos","Papel","Español","INFORMACIÓN PÚBLICA","Archivo MINTIC","N/A","N/A","N/A","N/A","N/A","N/A","Dato personal público","N/A"]
["431-602","INFORMACIÓN","GRUPO INTERNO DE TRABAJO DE ADMINISTRACIÓN DE BIENES","FACTURA O REMISIÓN","Factura de compra o remisión de los bienes ","GRUPO INTERNO DE TRABAJO DE ADMINISTRACIÓN DE BIENES","2018-11-28","GRUPO INTERNO DE TRABAJO DE FORTALECIMIENTO DE LAS RELACIONES CON LOS GRUPOS DE INTERES","2019-01-02","APOYO","GESTION_RECURSOS","GESTION DE RECURSOS ADMINISTRATIVOS","Ley 734 del 2002","Externo","Físico","Documentos de Archivo - físicos","Papel","Español","INFORMACIÓN PÚBLICA","Archivo MINTIC","N/A","N/A","N/A","N/A","N/A","N/A","Dato personal privado ","N/A"]
["431-603","INFORMACIÓN","GRUPO INTERNO DE TRABAJO DE ADMINISTRACIÓN DE BIENES","SOLICITUD DE INGRESO","Solicitud de ingreso de bienes a los inventarios de la Entidad","GRUPO INTERNO DE TRABAJO DE ADMINISTRACIÓN DE BIENES","2018-11-28","GRUPO INTERNO DE TRABAJO DE FORTALECIMIENTO DE LAS RELACIONES CON LOS GRUPOS DE INTERES","2019-01-02","APOYO","GESTION_RECURSOS","GESTION DE RECURSOS ADMINISTRATIVOS","Ley 734 del 2002","Externo","Físico","Documentos de Archivo - físicos","Papel","Español","INFORMACIÓN PÚBLICA","Archivo MINTIC","N/A","N/A","N/A","N/A","N/A","N/A","Dato personal público","N/A"]
["431-604","INFORMACIÓN","GRUPO INTERNO DE TRABAJO DE ADMINISTRACIÓN DE BIENES","COMPROBANTE DE INGRESO","Comprobante de ingreso de bienes ","GRUPO INTERNO DE TRABAJO DE ADMINISTRACIÓN DE BIENES","2018-11-28","GRUPO INTERNO DE TRABAJO DE FORTALECIMIENTO DE LAS RELACIONES CON LOS GRUPOS DE INTERES","2019-01-02","APOYO","GESTION_RECURSOS","GESTION DE RECURSOS ADMINISTRATIVOS","Resolución 193 del 2016 Contaduría General de la Nación","Externo","Físico","Documentos de Archivo - físicos","Papel","Español","INFORMACIÓN PÚBLICA","Archivo MINTIC","N/A","N/A","N/A","N/A","N/A","N/A","N/A","N/A"]
["431-605","INFORMACIÓN","GRUPO INTERNO DE TRABAJO DE ADMINISTRACIÓN DE BIENES","CONTRATO","Contrato por el cual fueron adquiridos los elementos de consumo","GRUPO INTERNO DE TRABAJO DE ADMINISTRACIÓN DE BIENES","2018-11-28","GRUPO INTERNO DE TRABAJO DE FORTALECIMIENTO DE LAS RELACIONES CON LOS GRUPOS DE INTERES","2019-01-02","APOYO","GESTION_RECURSOS","GESTION DE RECURSOS ADMINISTRATIVOS","Ley 734 del 2002","Externo","Físico","Documentos de Archivo - físicos","Papel","Español","INFORMACIÓN PÚBLICA","Archivo MINTIC","N/A","N/A","N/A","N/A","N/A","N/A","Dato personal público","N/A"]
["431-606","INFORMACIÓN","GRUPO INTERNO DE TRABAJO DE ADMINISTRACIÓN DE BIENES","CERTIFICACIÓN DE RECIBO A SATISFACCIÓN","Certificado de recibo a satisfacción de los elementos de consumo, por el supervisor del contrato","GRUPO INTERNO DE TRABAJO DE ADMINISTRACIÓN DE BIENES","2018-11-28","GRUPO INTERNO DE TRABAJO DE FORTALECIMIENTO DE LAS RELACIONES CON LOS GRUPOS DE INTERES","2019-01-02","APOYO","GESTION_RECURSOS","GESTION DE RECURSOS ADMINISTRATIVOS","Ley 734 del 2002","Externo","Físico","Documentos de Archivo - físicos","Papel","Español","INFORMACIÓN PÚBLICA","Archivo MINTIC","N/A","N/A","N/A","N/A","N/A","N/A","N/A","N/A"]
["431-607","INFORMACIÓN","GRUPO INTERNO DE TRABAJO DE ADMINISTRACIÓN DE BIENES","FACTURA O REMISIÓN","Factura de compra o remisión de los elementos de consumo","GRUPO INTERNO DE TRABAJO DE ADMINISTRACIÓN DE BIENES","2018-11-28","GRUPO INTERNO DE TRABAJO DE FORTALECIMIENTO DE LAS RELACIONES CON LOS GRUPOS DE INTERES","2019-01-02","APOYO","GESTION_RECURSOS","GESTION DE RECURSOS ADMINISTRATIVOS","Ley 734 del 2002","Externo","Físico","Documentos de Archivo - físicos","Papel","Español","INFORMACIÓN PÚBLICA","Archivo MINTIC","N/A","N/A","N/A","N/A","N/A","N/A","N/A","N/A"]
["431-608","INFORMACIÓN","GRUPO INTERNO DE TRABAJO DE ADMINISTRACIÓN DE BIENES","SOLICITUD DE INGRESO","Solicitud de ingreso de elementos de consumo al almacén ","GRUPO INTERNO DE TRABAJO DE ADMINISTRACIÓN DE BIENES","2018-11-28","GRUPO INTERNO DE TRABAJO DE FORTALECIMIENTO DE LAS RELACIONES CON LOS GRUPOS DE INTERES","2019-01-02","APOYO","GESTION_RECURSOS","GESTION DE RECURSOS ADMINISTRATIVOS","Ley 734 del 2002","Externo","Físico","Documentos de Archivo - físicos","Papel","Español","INFORMACIÓN PÚBLICA","Archivo MINTIC","N/A","N/A","N/A","N/A","N/A","N/A","N/A","N/A"]
["431-609","INFORMACIÓN","GRUPO INTERNO DE TRABAJO DE ADMINISTRACIÓN DE BIENES","COMPROBANTE DE INGRESO","Comprobante de ingreso de elementos de consumo al almacén","GRUPO INTERNO DE TRABAJO DE ADMINISTRACIÓN DE BIENES","2018-11-28","GRUPO INTERNO DE TRABAJO DE FORTALECIMIENTO DE LAS RELACIONES CON LOS GRUPOS DE INTERES","2019-01-02","APOYO","GESTION_RECURSOS","GESTION DE RECURSOS ADMINISTRATIVOS","Resolución 193 del 2016 Contaduría General de la Nación","Externo","Físico","Documentos de Archivo - físicos","Papel","Español","INFORMACIÓN PÚBLICA","Archivo MINTIC","N/A","N/A","N/A","N/A","N/A","N/A","N/A","N/A"]
["431-610","INFORMACIÓN","GRUPO INTERNO DE TRABAJO DE ADMINISTRACIÓN DE BIENES","SOLICITUD","Solicitud de traslado de bienes entre funcionarios o reintegro a almacén","GRUPO INTERNO DE TRABAJO DE ADMINISTRACIÓN DE BIENES","2018-11-28","GRUPO INTERNO DE TRABAJO DE ADMINISTRACIÓN DE BIENES","2019-01-02","APOYO","GESTION_RECURSOS","GESTION DE RECURSOS ADMINISTRATIVOS","Ley 734 del 2002","Externo","Digital","Documentos de Archivo - electrónicos","EML ","Español","INFORMACIÓN PÚBLICA","Correo del coordinador del GIT de Administración de Bienes ","N/A","N/A","N/A","N/A","N/A","N/A","Dato personal público","N/A"]
["431-611","INFORMACIÓN","GRUPO INTERNO DE TRABAJO DE ADMINISTRACIÓN DE BIENES","FORMATO DE TRASLADO APLICATIVO SEVEN","Comprobante de traslado de activos entre funcionarios y reintegros a almacén","GRUPO INTERNO DE TRABAJO DE ADMINISTRACIÓN DE BIENES","2018-11-28","GRUPO INTERNO DE TRABAJO DE FORTALECIMIENTO DE LAS RELACIONES CON LOS GRUPOS DE INTERES","2019-01-02","APOYO","GESTION_RECURSOS","GESTION DE RECURSOS ADMINISTRATIVOS","Ley 734 del 2002","Externo","Físico","Archivos Institucionales - físicos","Papel","Español","INFORMACIÓN PÚBLICA","Archivo MINTIC","N/A","N/A","N/A","N/A","N/A","N/A","Dato personal público","N/A"]
["431-612","INFORMACIÓN","GRUPO INTERNO DE TRABAJO DE ADMINISTRACIÓN DE BIENES","ESCRITURAS","Escrituras de bienes inmuebles","GRUPO INTERNO DE TRABAJO DE ADMINISTRACIÓN DE BIENES","2018-11-28","GRUPO INTERNO DE TRABAJO DE FORTALECIMIENTO DE LAS RELACIONES CON LOS GRUPOS DE INTERES","2019-01-02","APOYO","GESTION_RECURSOS","GESTION DE RECURSOS ADMINISTRATIVOS","Resolución 3361 de 2018","Interno","Físico","Documentos de Archivo - físicos","Papel","Español","INFORMACIÓN PÚBLICA","Archivo MINTIC","N/A","N/A","N/A","N/A","N/A","N/A","Dato personal público","N/A"]
["431-613","INFORMACIÓN","GRUPO INTERNO DE TRABAJO DE ADMINISTRACIÓN DE BIENES","AVALÚO","Avalúos de bienes inmuebles","GRUPO INTERNO DE TRABAJO DE ADMINISTRACIÓN DE BIENES","2018-11-28","GRUPO INTERNO DE TRABAJO DE FORTALECIMIENTO DE LAS RELACIONES CON LOS GRUPOS DE INTERES","2019-01-02","APOYO","GESTION_RECURSOS","GESTION DE RECURSOS ADMINISTRATIVOS","Resolución 3361 de 2018","Interno","Físico","Documentos de Archivo - físicos","Papel","Español","INFORMACIÓN PÚBLICA CLASIFICADA","Archivo MINTIC","SI","Ley 9 de 1989","Ley 9 de 1989","N/A","2019-11-29","N/A","N/A","N/A"]
["431-614","INFORMACIÓN","GRUPO INTERNO DE TRABAJO DE ADMINISTRACIÓN DE BIENES","PLANOS","Planos de bienes inmuebles","GRUPO INTERNO DE TRABAJO DE ADMINISTRACIÓN DE BIENES","2018-11-28","GRUPO INTERNO DE TRABAJO DE FORTALECIMIENTO DE LAS RELACIONES CON LOS GRUPOS DE INTERES","2019-01-02","APOYO","GESTION_RECURSOS","GESTION DE RECURSOS ADMINISTRATIVOS","Resolución 3361 de 2018","Interno","Físico","Documentos de Archivo - físicos","Papel","Español","INFORMACIÓN PÚBLICA CLASIFICADA","Archivo MINTIC","SI","Ley 9 de 1989","Ley 9 de 1989","N/A","2019-11-29","N/A","N/A","N/A"]
["431-615","INFORMACIÓN","GRUPO INTERNO DE TRABAJO DE ADMINISTRACIÓN DE BIENES","CERTIFICADO DE TRADICIÓN Y LIBERTAD - MATRICULA INMOBILIARIA","Certificados de tradición y libertad, matriculas inmobiliarias","GRUPO INTERNO DE TRABAJO DE ADMINISTRACIÓN DE BIENES","2018-11-28","GRUPO INTERNO DE TRABAJO DE FORTALECIMIENTO DE LAS RELACIONES CON LOS GRUPOS DE INTERES","2019-01-02","APOYO","GESTION_RECURSOS","GESTION DE RECURSOS ADMINISTRATIVOS","Resolución 3361 de 2018","Interno","Físico","Documentos de Archivo - físicos","Papel","Español","INFORMACIÓN PÚBLICA","Archivo MINTIC","N/A","N/A","N/A","N/A","N/A","N/A","Dato personal público","a. Permitir el desarrollo del objeto del Ministerio/Fondo TIC, en los términos de los artículos 1o y 2o del Decreto 1414 de 2017."]
["431-616","INFORMACIÓN","GRUPO INTERNO DE TRABAJO DE ADMINISTRACIÓN DE BIENES","ACTOS ADMINISTRATIVOS","Actos administrativos de los bienes inmuebles","GRUPO INTERNO DE TRABAJO DE ADMINISTRACIÓN DE BIENES","2018-11-28","GRUPO INTERNO DE TRABAJO DE FORTALECIMIENTO DE LAS RELACIONES CON LOS GRUPOS DE INTERES","2019-01-02","APOYO","GESTION_RECURSOS","GESTION DE RECURSOS ADMINISTRATIVOS","Resolución 3361 de 2018","Interno","Físico","Documentos de Archivo - físicos","Papel","Español","INFORMACIÓN PÚBLICA","Archivo MINTIC","N/A","N/A","N/A","N/A","N/A","N/A","Dato personal público","a. Permitir el desarrollo del objeto del Ministerio/Fondo TIC, en los términos de los artículos 1o y 2o del Decreto 1414 de 2017."]
["431-617","INFORMACIÓN","GRUPO INTERNO DE TRABAJO DE ADMINISTRACIÓN DE BIENES","ACTA DE RECIBO","Actas de recibo de bienes inmuebles","GRUPO INTERNO DE TRABAJO DE ADMINISTRACIÓN DE BIENES","2018-11-28","GRUPO INTERNO DE TRABAJO DE FORTALECIMIENTO DE LAS RELACIONES CON LOS GRUPOS DE INTERES","2019-01-02","APOYO","GESTION_RECURSOS","GESTION DE RECURSOS ADMINISTRATIVOS","Resolución 3361 de 2018","Interno","Físico","Documentos de Archivo - físicos","Papel","Español","INFORMACIÓN PÚBLICA CLASIFICADA","Archivo MINTIC","SI","Ley 9 de 1989","Ley 9 de 1989","N/A","2019-11-29","N/A","Dato personal público","a. Permitir el desarrollo del objeto del Ministerio/Fondo TIC, en los términos de los artículos 1o y 2o del Decreto 1414 de 2017."]
["431-618","INFORMACIÓN","GRUPO INTERNO DE TRABAJO DE ADMINISTRACIÓN DE BIENES","COMUNICACIONES","Comunicaciones ","GRUPO INTERNO DE TRABAJO DE ADMINISTRACIÓN DE BIENES","2018-11-28","GRUPO INTERNO DE TRABAJO DE FORTALECIMIENTO DE LAS RELACIONES CON LOS GRUPOS DE INTERES","2019-01-02","APOYO","GESTION_RECURSOS","GESTION DE RECURSOS ADMINISTRATIVOS","Resolución 3361 de 2018","Interno","Físico","Documentos de Archivo - físicos","Papel","Español","INFORMACIÓN PÚBLICA","Archivo MINTIC","N/A","N/A","N/A","N/A","N/A","N/A","Dato personal público","a. Permitir el desarrollo del objeto del Ministerio/Fondo TIC, en los términos de los artículos 1o y 2o del Decreto 1414 de 2017."]
["431-619","INFORMACIÓN","GRUPO INTERNO DE TRABAJO DE ADMINISTRACIÓN DE BIENES","CÉDULA CATASTRAL","Cedula catastral ","GRUPO INTERNO DE TRABAJO DE ADMINISTRACIÓN DE BIENES","2018-11-28","GRUPO INTERNO DE TRABAJO DE FORTALECIMIENTO DE LAS RELACIONES CON LOS GRUPOS DE INTERES","2019-01-02","APOYO","GESTION_RECURSOS","GESTION DE RECURSOS ADMINISTRATIVOS","Resolución 3361 de 2018","Interno","Físico","Documentos de Archivo - físicos","Papel","Español","INFORMACIÓN PÚBLICA","Archivo MINTIC","N/A","N/A","N/A","N/A","N/A","N/A","Dato personal público","N/A"]
["431-620","INFORMACIÓN","GRUPO INTERNO DE TRABAJO DE ADMINISTRACIÓN DE BIENES","FORMULARIO DE PAGO IMPUESTO PREDIAL","Formularios de pago de impuesto predial","GRUPO INTERNO DE TRABAJO DE ADMINISTRACIÓN DE BIENES","2018-11-28","GRUPO INTERNO DE TRABAJO DE FORTALECIMIENTO DE LAS RELACIONES CON LOS GRUPOS DE INTERES","2019-01-02","APOYO","GESTION_RECURSOS","GESTION DE RECURSOS ADMINISTRATIVOS","Resolución 3361 de 2018","Interno","Físico","Documentos de Archivo - físicos","Papel","Español","INFORMACIÓN PÚBLICA","Archivo MINTIC","N/A","N/A","N/A","N/A","N/A","N/A","N/A","N/A"]
["431-621","INFORMACIÓN","GRUPO INTERNO DE TRABAJO DE ADMINISTRACIÓN DE BIENES","REQUERIMIENTOS","Requerimientos a los bienes inmuebles","GRUPO INTERNO DE TRABAJO DE ADMINISTRACIÓN DE BIENES","2018-11-28","GRUPO INTERNO DE TRABAJO DE FORTALECIMIENTO DE LAS RELACIONES CON LOS GRUPOS DE INTERES","2019-01-02","APOYO","GESTION_RECURSOS","GESTION DE RECURSOS ADMINISTRATIVOS","Resolución 3361 de 2018","Interno","Físico","Documentos de Archivo - físicos","Papel","Español","INFORMACIÓN PÚBLICA CLASIFICADA","Archivo MINTIC","SI","Ley 9 de 1989","Ley 9 de 1989","N/A","2019-11-29","N/A","Dato personal público","a. Permitir el desarrollo del objeto del Ministerio/Fondo TIC, en los términos de los artículos 1o y 2o del Decreto 1414 de 2017."]
["431-622","INFORMACIÓN","GRUPO INTERNO DE TRABAJO DE ADMINISTRACIÓN DE BIENES","FORMULARIO DE PAGO IMPUESTO DE VALORACIÓN","Formularios de pago impuesto de valoración","GRUPO INTERNO DE TRABAJO DE ADMINISTRACIÓN DE BIENES","2018-11-28","GRUPO INTERNO DE TRABAJO DE FORTALECIMIENTO DE LAS RELACIONES CON LOS GRUPOS DE INTERES","2019-01-02","APOYO","GESTION_RECURSOS","GESTION DE RECURSOS ADMINISTRATIVOS","Resolución 3361 de 2018","Interno","Físico","Documentos de Archivo - físicos","Papel","Español","INFORMACIÓN PÚBLICA","Archivo MINTIC","N/A","N/A","N/A","N/A","N/A","N/A","N/A","N/A"]
["431-623","INFORMACIÓN","GRUPO INTERNO DE TRABAJO DE ADMINISTRACIÓN DE BIENES","ACTA DE ENTREGA","Actas de entrega de bienes inmuebles","GRUPO INTERNO DE TRABAJO DE ADMINISTRACIÓN DE BIENES","2018-11-28","GRUPO INTERNO DE TRABAJO DE FORTALECIMIENTO DE LAS RELACIONES CON LOS GRUPOS DE INTERES","2019-01-02","APOYO","GESTION_RECURSOS","GESTION DE RECURSOS ADMINISTRATIVOS","Resolución 3361 de 2018","Interno","Físico","Documentos de Archivo - físicos","Papel","Español","INFORMACIÓN PÚBLICA CLASIFICADA","Archivo MINTIC","SI","Ley 9 de 1989","Ley 9 de 1989","N/A","2019-11-29","N/A","Dato personal público","a. Permitir el desarrollo del objeto del Ministerio/Fondo TIC, en los términos de los artículos 1o y 2o del Decreto 1414 de 2017."]
["431-624","INFORMACIÓN","GRUPO INTERNO DE TRABAJO DE ADMINISTRACIÓN DE BIENES","SOLICITUD","Solicitudes de informes para entes de control y vigilancia","GRUPO INTERNO DE TRABAJO DE ADMINISTRACIÓN DE BIENES","2018-11-28","GRUPO INTERNO DE TRABAJO DE ADMINISTRACIÓN DE BIENES","2019-01-02","APOYO","GESTION_RECURSOS","GESTION DE RECURSOS ADMINISTRATIVOS","Resolución 3361 de 2018","Interno","Físico","Documentos de Archivo - físicos","Papel","Español","INFORMACIÓN PÚBLICA","Archivo MINTIC","N/A","N/A","N/A","N/A","N/A","N/A","N/A","N/A"]
["431-625","INFORMACIÓN","GRUPO INTERNO DE TRABAJO DE ADMINISTRACIÓN DE BIENES","INFORME","Informes a entes de control y vigilancia","GRUPO INTERNO DE TRABAJO DE ADMINISTRACIÓN DE BIENES","2018-11-28","GRUPO INTERNO DE TRABAJO DE ADMINISTRACIÓN DE BIENES","2019-01-02","APOYO","GESTION_RECURSOS","GESTION DE RECURSOS ADMINISTRATIVOS","Resolución 3361 de 2018","Interno","Físico","Documentos de Archivo - físicos","Papel","Español","INFORMACIÓN PÚBLICA","Archivo MINTIC","N/A","N/A","N/A","N/A","N/A","N/A","N/A","N/A"]
["431-626","INFORMACIÓN","GRUPO INTERNO DE TRABAJO DE ADMINISTRACIÓN DE BIENES","COMUNICACIONES","Comunicaciones a entes de control y vigilancia","GRUPO INTERNO DE TRABAJO DE ADMINISTRACIÓN DE BIENES","2018-11-28","GRUPO INTERNO DE TRABAJO DE ADMINISTRACIÓN DE BIENES","2019-01-02","APOYO","GESTION_RECURSOS","GESTION DE RECURSOS ADMINISTRATIVOS","Resolución 3361 de 2018","Interno","Físico","Documentos de Archivo - físicos","Papel","Español","INFORMACIÓN PÚBLICA","Archivo MINTIC","N/A","N/A","N/A","N/A","N/A","N/A","N/A","N/A"]
["431-627","INFORMACIÓN","GRUPO INTERNO DE TRABAJO DE ADMINISTRACIÓN DE BIENES","INFORME","Informes de gestión","GRUPO INTERNO DE TRABAJO DE ADMINISTRACIÓN DE BIENES","2018-11-28","GRUPO INTERNO DE TRABAJO DE ADMINISTRACIÓN DE BIENES","2019-01-02","APOYO","GESTION_RECURSOS","GESTION DE RECURSOS ADMINISTRATIVOS","Resolución 3361 de 2018","Interno","Físico","Documentos de Archivo - físicos","Papel","Español","INFORMACIÓN PÚBLICA","Archivo MINTIC","N/A","N/A","N/A","N/A","N/A","N/A","N/A","N/A"]
["431-628","INFORMACIÓN","GRUPO INTERNO DE TRABAJO DE ADMINISTRACIÓN DE BIENES","COMUNICACIONES","Comunicaciones de informes de gestión ","GRUPO INTERNO DE TRABAJO DE ADMINISTRACIÓN DE BIENES","2018-11-28","GRUPO INTERNO DE TRABAJO DE ADMINISTRACIÓN DE BIENES","2019-01-02","APOYO","GESTION_RECURSOS","GESTION DE RECURSOS ADMINISTRATIVOS","Resolución 3361 de 2018","Interno","Físico","Documentos de Archivo - físicos","Papel","Español","INFORMACIÓN PÚBLICA","Archivo MINTIC","N/A","N/A","N/A","N/A","N/A","N/A","N/A","N/A"]
["431-629","INFORMACIÓN","GRUPO INTERNO DE TRABAJO DE ADMINISTRACIÓN DE BIENES","ACTAS DE INSPECCIÓN OCULAR","Actas de inspección ocular de bienes","GRUPO INTERNO DE TRABAJO DE ADMINISTRACIÓN DE BIENES","2018-11-28","GRUPO INTERNO DE TRABAJO DE FORTALECIMIENTO DE LAS RELACIONES CON LOS GRUPOS DE INTERES","2019-01-02","APOYO","GESTION_RECURSOS","GESTION DE RECURSOS ADMINISTRATIVOS","Resolución 3361 de 2018","Interno","Físico","Documentos de Archivo - físicos","Papel","Español","INFORMACIÓN PÚBLICA","Archivo MINTIC","N/A","N/A","N/A","N/A","N/A","N/A","Dato personal público","N/A"]
["431-630","INFORMACIÓN","GRUPO INTERNO DE TRABAJO DE ADMINISTRACIÓN DE BIENES","CONCEPTO DE IDONEIDAD","Conceptos de idoneidad ","GRUPO INTERNO DE TRABAJO DE ADMINISTRACIÓN DE BIENES","2018-11-28","GRUPO INTERNO DE TRABAJO DE FORTALECIMIENTO DE LAS RELACIONES CON LOS GRUPOS DE INTERES","2019-01-02","APOYO","GESTION_RECURSOS","GESTION DE RECURSOS ADMINISTRATIVOS","Resolución 3361 de 2018","Interno","Físico","Documentos de Archivo - físicos","Papel","Español","INFORMACIÓN PÚBLICA","Archivo MINTIC","N/A","N/A","N/A","N/A","N/A","N/A","N/A","N/A"]
["431-631","INFORMACIÓN","GRUPO INTERNO DE TRABAJO DE ADMINISTRACIÓN DE BIENES","ACTO ADMINISTRATIVO","Actos administrativos que ordenan la baja de bienes","GRUPO INTERNO DE TRABAJO DE ADMINISTRACIÓN DE BIENES","2018-11-28","GRUPO INTERNO DE TRABAJO DE FORTALECIMIENTO DE LAS RELACIONES CON LOS GRUPOS DE INTERES","2019-01-02","APOYO","GESTION_RECURSOS","GESTION DE RECURSOS ADMINISTRATIVOS","Resolución 3361 de 2018","Interno","Físico","Documentos de Archivo - físicos","Papel","Español","INFORMACIÓN PÚBLICA","Archivo MINTIC","N/A","N/A","N/A","N/A","N/A","N/A","N/A","N/A"]
["431-632","INFORMACIÓN","GRUPO INTERNO DE TRABAJO DE ADMINISTRACIÓN DE BIENES","DOCUMENTO DE DESTINACIÓN FINAL","Documentos de destinación final de los bienes","GRUPO INTERNO DE TRABAJO DE ADMINISTRACIÓN DE BIENES","2018-11-28","GRUPO INTERNO DE TRABAJO DE FORTALECIMIENTO DE LAS RELACIONES CON LOS GRUPOS DE INTERES","2019-01-02","APOYO","GESTION_RECURSOS","GESTION DE RECURSOS ADMINISTRATIVOS","Resolución 3361 de 2018","Interno","Físico","Documentos de Archivo - físicos","Papel","Español","INFORMACIÓN PÚBLICA","Archivo MINTIC","N/A","N/A","N/A","N/A","N/A","N/A","N/A","N/A"]
["431-633","INFORMACIÓN","GRUPO INTERNO DE TRABAJO DE ADMINISTRACIÓN DE BIENES","ACTA DE ENTREGA","Actas de entrega de bienes","GRUPO INTERNO DE TRABAJO DE ADMINISTRACIÓN DE BIENES","2018-11-28","GRUPO INTERNO DE TRABAJO DE FORTALECIMIENTO DE LAS RELACIONES CON LOS GRUPOS DE INTERES","2019-01-02","APOYO","GESTION_RECURSOS","GESTION DE RECURSOS ADMINISTRATIVOS","Resolución 3361 de 2018","Interno","Físico","Documentos de Archivo - físicos","Papel","Español","INFORMACIÓN PÚBLICA","Archivo MINTIC","N/A","N/A","N/A","N/A","N/A","N/A","Dato personal público","a. Permitir el desarrollo del objeto del Ministerio/Fondo TIC, en los términos de los artículos 1o y 2o del Decreto 1414 de 2017."]
["431-634","INFORMACIÓN","GRUPO INTERNO DE TRABAJO DE ADMINISTRACIÓN DE BIENES","ACTO ADMINISTRATIVO","Actos administrativos de decomiso de bienes","GRUPO INTERNO DE TRABAJO DE ADMINISTRACIÓN DE BIENES","2018-11-28","DIRECCIÓN DE VIGILANCIA Y CONTROL","2019-01-02","APOYO","GESTION_RECURSOS","GESTION DE RECURSOS ADMINISTRATIVOS","Resolución 3361 de 2018","Interno","Físico","Documentos de Archivo - físicos","Papel","Español","INFORMACIÓN PÚBLICA","Archivo MINTIC","N/A","N/A","N/A","N/A","N/A","N/A","N/A","N/A"]
["431-635","INFORMACIÓN","GRUPO INTERNO DE TRABAJO DE ADMINISTRACIÓN DE BIENES","AVALÚO","Avalúos de decomisos de bienes ","GRUPO INTERNO DE TRABAJO DE ADMINISTRACIÓN DE BIENES","2018-11-28","DIRECCIÓN DE VIGILANCIA Y CONTROL","2019-01-02","APOYO","GESTION_RECURSOS","GESTION DE RECURSOS ADMINISTRATIVOS","Resolución 3361 de 2018","Interno","Físico","Documentos de Archivo - físicos","Papel","Español","INFORMACIÓN PÚBLICA RESERVADA","Archivo MINTIC","SI","Ley 40 de 1993","Ley 40 de 1993","Reserva parcial","2019-11-29","1 año","N/A","N/A"]
["431-636","INFORMACIÓN","GRUPO INTERNO DE TRABAJO DE ADMINISTRACIÓN DE BIENES","COMUNICACIONES","Comunicaciones de decomisos de bienes","GRUPO INTERNO DE TRABAJO DE ADMINISTRACIÓN DE BIENES","2018-11-28","DIRECCIÓN DE VIGILANCIA Y CONTROL","2019-01-02","APOYO","GESTION_RECURSOS","GESTION DE RECURSOS ADMINISTRATIVOS","Resolución 3361 de 2018","Interno","Físico","Documentos de Archivo - físicos","Papel","Español","INFORMACIÓN PÚBLICA CLASIFICADA","Archivo MINTIC","SI","Ley 40 de 1993","Ley 40 de 1993","N/A","2019-11-29","N/A","Dato personal público","a. Permitir el desarrollo del objeto del Ministerio/Fondo TIC, en los términos de los artículos 1o y 2o del Decreto 1414 de 2017."]
["431-637","INFORMACIÓN","GRUPO INTERNO DE TRABAJO DE ADMINISTRACIÓN DE BIENES","INVENTARIO","Inventario de decomisos de bienes","GRUPO INTERNO DE TRABAJO DE ADMINISTRACIÓN DE BIENES","2018-11-28","DIRECCIÓN DE VIGILANCIA Y CONTROL","2019-01-02","APOYO","GESTION_RECURSOS","GESTION DE RECURSOS ADMINISTRATIVOS","Resolución 3361 de 2018","Interno","Físico","Documentos de Archivo - físicos","Papel","Español","INFORMACIÓN PÚBLICA RESERVADA","Archivo MINTIC","SI","Ley 40 de 1993","Ley 40 de 1993","Reserva total","2019-11-29","N/A","Dato personal público","a. Permitir el desarrollo del objeto del Ministerio/Fondo TIC, en los términos de los artículos 1o y 2o del Decreto 1414 de 2017."]
["431-638","INFORMACIÓN","GRUPO INTERNO DE TRABAJO DE ADMINISTRACIÓN DE BIENES","ACTA DE DESTINACIÓN FINAL","Actas de destinación final de bienes decomisados","GRUPO INTERNO DE TRABAJO DE ADMINISTRACIÓN DE BIENES","2018-11-28","DIRECCIÓN DE VIGILANCIA Y CONTROL","2019-01-02","APOYO","GESTION_RECURSOS","GESTION DE RECURSOS ADMINISTRATIVOS","Resolución 3361 de 2018","Interno","Físico","Documentos de Archivo - físicos","Papel","Español","INFORMACIÓN PÚBLICA","Archivo MINTIC","N/A","N/A","N/A","N/A","N/A","N/A","Dato personal público","a. Permitir el desarrollo del objeto del Ministerio/Fondo TIC, en los términos de los artículos 1o y 2o del Decreto 1414 de 2017."]
["431-639","INFORMACIÓN","GRUPO INTERNO DE TRABAJO DE ADMINISTRACIÓN DE BIENES","SOLICITUD","Solicitudes de traslado de bienes entre funcionarios o reintegro de bienes a almacén ","GRUPO INTERNO DE TRABAJO DE ADMINISTRACIÓN DE BIENES","2018-11-28","GRUPO INTERNO DE TRABAJO DE FORTALECIMIENTO DE LAS RELACIONES CON LOS GRUPOS DE INTERES","2019-01-02","APOYO","GESTION_RECURSOS","GESTION DE RECURSOS ADMINISTRATIVOS","Resolución 3361 de 2018","Interno","Físico","Documentos de Archivo - físicos","Papel","Español","INFORMACIÓN PÚBLICA","Correo del coordinador del GIT de Administración de Bienes ","N/A","N/A","N/A","N/A","N/A","N/A","Dato personal público","N/A"]
["431-640","INFORMACIÓN","GRUPO INTERNO DE TRABAJO DE ADMINISTRACIÓN DE BIENES","FORMATO DE TRASLADO DE EQUIPOS","Formato de traslado de equipos entre funcionarios","GRUPO INTERNO DE TRABAJO DE ADMINISTRACIÓN DE BIENES","2018-11-28","GRUPO INTERNO DE TRABAJO DE FORTALECIMIENTO DE LAS RELACIONES CON LOS GRUPOS DE INTERES","2019-01-02","APOYO","GESTION_RECURSOS","GESTION DE RECURSOS ADMINISTRATIVOS","Resolución 3361 de 2018","Interno","Físico","Documentos de Archivo - físicos","Papel","Español","INFORMACIÓN PÚBLICA","Archivo MINTIC","N/A","N/A","N/A","N/A","N/A","N/A","Dato personal público","N/A"]
["431-641","INFORMACIÓN","GRUPO INTERNO DE TRABAJO DE ADMINISTRACIÓN DE BIENES","FORMATO DE REINTEGRO","Formato de reintegro de bienes a almacén",{"$f":"IF(C648=\"\",\"\",C648)","v":"GRUPO INTERNO DE TRABAJO DE ADMINISTRACIÓN DE BIENES"},"2018-11-28","GRUPO INTERNO DE TRABAJO DE FORTALECIMIENTO DE LAS RELACIONES CON LOS GRUPOS DE INTERES","2019-01-02","APOYO","GESTION_RECURSOS","GESTION DE RECURSOS ADMINISTRATIVOS","Resolución 3361 de 2018","Interno","Físico","Documentos de Archivo - físicos","Papel","Español","INFORMACIÓN PÚBLICA","Archivo MINTIC","N/A","N/A","N/A","N/A","N/A","N/A","Dato personal público","N/A"]
["431-642","INFORMACIÓN","GRUPO INTERNO DE TRABAJO DE ADMINISTRACIÓN DE BIENES","BOLETÍN MENSUAL DE ALMACÉN","Boletín mensual de almacén ","GRUPO INTERNO DE TRABAJO DE ADMINISTRACIÓN DE BIENES","2018-11-28","GRUPO INTERNO DE TRABAJO DE FORTALECIMIENTO DE LAS RELACIONES CON LOS GRUPOS DE INTERES","2019-01-02","APOYO","GESTION_RECURSOS","GESTION DE RECURSOS ADMINISTRATIVOS","Resolución 3361 de 2018","Interno","Físico","Documentos de Archivo - físicos","Papel","Español","INFORMACIÓN PÚBLICA","Archivo MINTIC","N/A","N/A","N/A","N/A","N/A","N/A","Dato personal público","N/A"]
["431-643","INFORMACIÓN","GRUPO INTERNO DE TRABAJO DE ADMINISTRACIÓN DE BIENES","CONCILIACIONES FIRMADAS","Conciliaciones firmadas ","GRUPO INTERNO DE TRABAJO DE ADMINISTRACIÓN DE BIENES","2018-11-28","GRUPO INTERNO DE TRABAJO DE FORTALECIMIENTO DE LAS RELACIONES CON LOS GRUPOS DE INTERES","2019-01-02","APOYO","GESTION_RECURSOS","GESTION DE RECURSOS ADMINISTRATIVOS","Resolución 3361 de 2018","Interno","Físico","Documentos de Archivo - físicos","Papel","Español","INFORMACIÓN PÚBLICA","Archivo MINTIC","N/A","N/A","N/A","N/A","N/A","N/A","Dato personal público","N/A"]
["431-644","INFORMACIÓN","GRUPO INTERNO DE TRABAJO DE ADMINISTRACIÓN DE BIENES","INFORME DE LAS BODEGAS","Informes de inventario de almacén","GRUPO INTERNO DE TRABAJO DE ADMINISTRACIÓN DE BIENES","2018-11-28","GRUPO INTERNO DE TRABAJO DE FORTALECIMIENTO DE LAS RELACIONES CON LOS GRUPOS DE INTERES","2019-01-02","APOYO","GESTION_RECURSOS","GESTION DE RECURSOS ADMINISTRATIVOS","Resolución 3361 de 2018","Interno","Físico","Documentos de Archivo - físicos","Papel","Español","INFORMACIÓN PÚBLICA","Archivo MINTIC","N/A","N/A","N/A","N/A","N/A","N/A","Dato personal público","N/A"]
["431-645","INFORMACIÓN","GRUPO INTERNO DE TRABAJO DE ADMINISTRACIÓN DE BIENES","ACTA DE LEVANATMIENTO DE INVENTARIO FISICO","Actas de levantamiento de inventario fisico ","GRUPO INTERNO DE TRABAJO DE ADMINISTRACIÓN DE BIENES","2018-11-28","GRUPO INTERNO DE TRABAJO DE FORTALECIMIENTO DE LAS RELACIONES CON LOS GRUPOS DE INTERES","2019-01-02","APOYO","GESTION_RECURSOS","GESTION DE RECURSOS ADMINISTRATIVOS","Resolución 3361 de 2018","Interno","Físico","Documentos de Archivo - físicos","Papel","Español","INFORMACIÓN PÚBLICA","Archivo MINTIC","N/A","N/A","N/A","N/A","N/A","N/A","Dato personal público","N/A"]
["431-646","INFORMACIÓN","GRUPO INTERNO DE TRABAJO DE ADMINISTRACIÓN DE BIENES","COMPROBANTES DE REGISTRO DE INVENTARIO","Comprobantes que registran movimientos realizados para actualizar el inventario","GRUPO INTERNO DE TRABAJO DE ADMINISTRACIÓN DE BIENES","2018-11-28","GRUPO INTERNO DE TRABAJO DE FORTALECIMIENTO DE LAS RELACIONES CON LOS GRUPOS DE INTERES","2019-01-02","APOYO","GESTION_RECURSOS","GESTION DE RECURSOS ADMINISTRATIVOS","Resolución 3361 de 2018","Interno","Físico","Documentos de Archivo - físicos","Papel","Español","INFORMACIÓN PÚBLICA","Archivo MINTIC","N/A","N/A","N/A","N/A","N/A","N/A","Dato personal público","N/A"]
["431-647","INFORMACIÓN","GRUPO INTERNO DE TRABAJO DE ADMINISTRACIÓN DE BIENES","FORMATO DE INVENTARIO INDIVIDUAL FIRMADO","Formatos de Inventario firmados por cada funcionario con bienes a cargo","GRUPO INTERNO DE TRABAJO DE ADMINISTRACIÓN DE BIENES","2018-11-28","GRUPO INTERNO DE TRABAJO DE FORTALECIMIENTO DE LAS RELACIONES CON LOS GRUPOS DE INTERES","2019-01-02","APOYO","GESTION_RECURSOS","GESTION DE RECURSOS ADMINISTRATIVOS","Resolución 3361 de 2018","Interno","Físico","Documentos de Archivo - físicos","Papel","Español","INFORMACIÓN PÚBLICA","Archivo MINTIC","N/A","N/A","N/A","N/A","N/A","N/A","Dato personal público","N/A"]
["431-648","INFORMACIÓN","GRUPO INTERNO DE TRABAJO DE ADMINISTRACIÓN DE BIENES","CONFIRMACIÓN DE CIERRE","Correo electrónico enviado por Financiera, donde se indica la la verificación del proceso de cierre.","GRUPO INTERNO DE TRABAJO DE ADMINISTRACIÓN DE BIENES","2018-11-28","GRUPO INTERNO DE TRABAJO DE FORTALECIMIENTO DE LAS RELACIONES CON LOS GRUPOS DE INTERES","2019-01-02","APOYO","GESTION_RECURSOS","GESTION DE RECURSOS ADMINISTRATIVOS","Resolución 193 del 2016 Contaduría General de la Nación","Externo","Digital","Documentos de Archivo - electrónicos","EML ","Español","INFORMACIÓN PÚBLICA","Correo del coordinador del GIT de Administración de Bienes ","N/A","N/A","N/A","N/A","N/A","N/A","N/A","N/A"]
["431-649","INFORMACIÓN","GRUPO INTERNO DE TRABAJO DE ADMINISTRACIÓN DE BIENES","COMPROBANTE DE DEPRECIACIÓN","Consolida la información de la depreciación aplicada en el mes.","GRUPO INTERNO DE TRABAJO DE ADMINISTRACIÓN DE BIENES","2018-11-28","GRUPO INTERNO DE TRABAJO DE FORTALECIMIENTO DE LAS RELACIONES CON LOS GRUPOS DE INTERES","2019-01-02","APOYO","GESTION_RECURSOS","GESTION DE RECURSOS ADMINISTRATIVOS","Resolución 193 del 2016 Contaduría General de la Nación","Externo","Físico","Documentos de Archivo - físicos","Papel","Español","INFORMACIÓN PÚBLICA","Archivo MINTIC","N/A","N/A","N/A","N/A","N/A","N/A","N/A","N/A"]
["431-650","INFORMACIÓN","GRUPO INTERNO DE TRABAJO DE ADMINISTRACIÓN DE BIENES","RESUMEN LIBRO AUXILIAR ACTIVOS FIJOS","Refleja el valor de adquisición, reconocimiento inicial, valor de depreciación acumulada y la depreciación del mes. ","GRUPO INTERNO DE TRABAJO DE ADMINISTRACIÓN DE BIENES","2018-11-28","GRUPO INTERNO DE TRABAJO DE FORTALECIMIENTO DE LAS RELACIONES CON LOS GRUPOS DE INTERES","2019-01-02","APOYO","GESTION_RECURSOS","GESTION DE RECURSOS ADMINISTRATIVOS","Resolución 193 del 2016 Contaduría General de la Nación","Externo","Físico","Documentos de Archivo - físicos","Papel","Español","INFORMACIÓN PÚBLICA","Archivo MINTIC","N/A","N/A","N/A","N/A","N/A","N/A","N/A","N/A"]
["431-651","INFORMACIÓN","GRUPO INTERNO DE TRABAJO DE ADMINISTRACIÓN DE BIENES","CONCILIACIONES FIRMADAS","Documento que refleja la composición de las cuentas contables del aplicativo seven vs SIIF Nación","GRUPO INTERNO DE TRABAJO DE ADMINISTRACIÓN DE BIENES","2018-11-28","GRUPO INTERNO DE TRABAJO DE FORTALECIMIENTO DE LAS RELACIONES CON LOS GRUPOS DE INTERES","2019-01-02","APOYO","GESTION_RECURSOS","GESTION DE RECURSOS ADMINISTRATIVOS","Resolución 193 del 2016 Contaduría General de la Nación","Externo","Físico","Documentos de Archivo - físicos","Papel","Español","INFORMACIÓN PÚBLICA","Archivo MINTIC","N/A","N/A","N/A","N/A","N/A","N/A","N/A","N/A"]
["431-652","INFORMACIÓN","GRUPO INTERNO DE TRABAJO DE ADMINISTRACIÓN DE BIENES","SALIDA ACTIVOS FIJOS","Refleja el movimiento de salida de inventario de los bienes por concepto de venta, obsolecencia o donación ","GRUPO INTERNO DE TRABAJO DE ADMINISTRACIÓN DE BIENES","2018-11-28","GRUPO INTERNO DE TRABAJO DE FORTALECIMIENTO DE LAS RELACIONES CON LOS GRUPOS DE INTERES","2019-01-02","APOYO","GESTION_RECURSOS","GESTION DE RECURSOS ADMINISTRATIVOS","Resolución 193 del 2016 Contaduría General de la Nación","Externo","Físico","Documentos de Archivo - físicos","Papel","Español","INFORMACIÓN PÚBLICA","Archivo MINTIC","N/A","N/A","N/A","N/A","N/A","N/A","N/A","N/A"]
["431-653","INFORMACIÓN","GRUPO INTERNO DE TRABAJO DE ADMINISTRACIÓN DE BIENES","ACTO ADMINISTRATIVO","Actos administrativos ","GRUPO INTERNO DE TRABAJO DE ADMINISTRACIÓN DE BIENES","2018-11-28","GRUPO INTERNO DE TRABAJO DE FORTALECIMIENTO DE LAS RELACIONES CON LOS GRUPOS DE INTERES","2019-01-02","APOYO","GESTION_RECURSOS","GESTION DE RECURSOS ADMINISTRATIVOS","Resolución 193 del 2016 Contaduría General de la Nación","Externo","Físico","Documentos de Archivo - físicos","Papel","Español","INFORMACIÓN PÚBLICA","Archivo MINTIC","N/A","N/A","N/A","N/A","N/A","N/A","N/A","N/A"]
["431-654","INFORMACIÓN","GRUPO INTERNO DE TRABAJO DE ADMINISTRACIÓN DE BIENES","COPIA CERTIFICADO DE TRADICIÓN Y LIBERTAD","Copias de certificados de tradición y libertad","GRUPO INTERNO DE TRABAJO DE ADMINISTRACIÓN DE BIENES","2018-11-28","GRUPO INTERNO DE TRABAJO DE FORTALECIMIENTO DE LAS RELACIONES CON LOS GRUPOS DE INTERES","2019-01-02","APOYO","GESTION_RECURSOS","GESTION DE RECURSOS ADMINISTRATIVOS","Resolución 193 del 2016 Contaduría General de la Nación","Externo","Físico","Documentos de Archivo - físicos","Papel","Español","INFORMACIÓN PÚBLICA","Archivo MINTIC","N/A","N/A","N/A","N/A","N/A","N/A","N/A","N/A"]
["431-655","INFORMACIÓN","GRUPO INTERNO DE TRABAJO DE ADMINISTRACIÓN DE BIENES","COMPROBANTE DE AJUSTES CONTABLES","Documento que muestra los movimientos realizados de forma manual por parte de Financiera, necesarios para realizar el cierre.","GRUPO INTERNO DE TRABAJO DE ADMINISTRACIÓN DE BIENES","2018-11-28","GRUPO INTERNO DE TRABAJO DE FORTALECIMIENTO DE LAS RELACIONES CON LOS GRUPOS DE INTERES","2019-01-02","APOYO","GESTION_RECURSOS","GESTION DE RECURSOS ADMINISTRATIVOS","Resolución 193 del 2016 Contaduría General de la Nación","Externo","Físico","Documentos de Archivo - físicos","Papel","Español","INFORMACIÓN PÚBLICA","Archivo MINTIC","N/A","N/A","N/A","N/A","N/A","N/A","N/A","N/A"]
["431-656","INFORMACIÓN","GRUPO INTERNO DE TRABAJO DE ADMINISTRACIÓN DE BIENES","BALANCE DE PRUEBA DEL APLICATIVO SEVEN","Refleja el catalogo de cuentas, mostrando el saldo inicial, movimientos débitos, créditos y el saldo final correspondiente al mes a conciliar","GRUPO INTERNO DE TRABAJO DE ADMINISTRACIÓN DE BIENES","2018-11-28","GRUPO INTERNO DE TRABAJO DE FORTALECIMIENTO DE LAS RELACIONES CON LOS GRUPOS DE INTERES","2019-01-02","APOYO","GESTION_RECURSOS","GESTION DE RECURSOS ADMINISTRATIVOS","Resolución 193 del 2016 Contaduría General de la Nación","Externo","Físico","Documentos de Archivo - físicos","Papel","Español","INFORMACIÓN PÚBLICA","Archivo MINTIC","N/A","N/A","N/A","N/A","N/A","N/A","N/A","N/A"]
["431-657","INFORMACIÓN","GRUPO INTERNO DE TRABAJO DE ADMINISTRACIÓN DE BIENES","BALANCE DE SIIF","Documento expedido por Contabilidad, donde se refleja el movimiento de la depreciación en el mes y el consolidado de las operaciones.","GRUPO INTERNO DE TRABAJO DE ADMINISTRACIÓN DE BIENES","2018-11-28","GRUPO INTERNO DE TRABAJO DE FORTALECIMIENTO DE LAS RELACIONES CON LOS GRUPOS DE INTERES","2019-01-02","APOYO","GESTION_RECURSOS","GESTION DE RECURSOS ADMINISTRATIVOS","Resolución 193 del 2016 Contaduría General de la Nación","Externo","Físico","Documentos de Archivo - físicos","Papel","Español","INFORMACIÓN PÚBLICA","Archivo MINTIC","N/A","N/A","N/A","N/A","N/A","N/A","N/A","N/A"]
["431-658","INFORMACIÓN","GRUPO INTERNO DE TRABAJO DE ADMINISTRACIÓN DE BIENES","SOLICITUD","Peticiones, quejas, reclamos, sugerencias y denuncias dirigidas al GIT de Administración de Bienes","GRUPO INTERNO DE TRABAJO DE ADMINISTRACIÓN DE BIENES","2018-11-28","GRUPO INTERNO DE TRABAJO DE FORTALECIMIENTO DE LAS RELACIONES CON LOS GRUPOS DE INTERES","2019-01-02","APOYO","GESTION_RECURSOS","GESTION DE RECURSOS ADMINISTRATIVOS","Resolución 3361 de 2018","Interno","Físico","Documentos de Archivo - físicos","Papel","Español","INFORMACIÓN PÚBLICA","ARCHIVO DE LA ENTIDAD","N/A","N/A","N/A","N/A","N/A","N/A","Dato personal privado ","f. Atender y resolver peticiones, quejas, reclamos y sugerencias."]
["431-659","INFORMACIÓN","GRUPO INTERNO DE TRABAJO DE ADMINISTRACIÓN DE BIENES","RESPUESTA Y/O TRÁMITE ","Respuestas y/o trámites a peticiones, quejas, reclamos, sugerencias y denuncias ","GRUPO INTERNO DE TRABAJO DE ADMINISTRACIÓN DE BIENES","2018-11-28","GRUPO INTERNO DE TRABAJO DE FORTALECIMIENTO DE LAS RELACIONES CON LOS GRUPOS DE INTERES","2019-01-02","APOYO","GESTION_RECURSOS","GESTION DE RECURSOS ADMINISTRATIVOS","Resolución 3361 de 2018","Interno","Físico","Documentos de Archivo - físicos","Papel","Español","INFORMACIÓN PÚBLICA","ARCHIVO DE LA ENTIDAD","N/A","N/A","N/A","N/A","N/A","N/A","Dato personal privado ","f. Atender y resolver peticiones, quejas, reclamos y sugerencias."]
["432-660","INFORMACIÓN","GRUPO INTERNO DE TRABAJO DE NOTIFICACIONES","INFORMES A ENTES DE CONTROL ","Es la información requerida por los diferentres entes de control y vigilancia en el ejecicio de las funciones del area.","GRUPO INTERNO DE TRABAJO DE NOTIFICACIONES","2018-11-28","GRUPO INTERNO DE TRABAJO DE FORTALECIMIENTO DE LAS RELACIONES CON LOS GRUPOS DE INTERES","2019-01-02","APOYO","GESTION_RECURSOS","GESTION DOCUMENTAL","Resolución 3361 de 2018","Externo","Físico","Documentos de Archivo - físicos","N/A","Español","INFORMACIÓN PÚBLICA","N/A","N/A","N/A","N/A","N/A","N/A","N/A","N/A","N/A"]
["432-661","INFORMACIÓN","GRUPO INTERNO DE TRABAJO DE NOTIFICACIONES","INFORMES DE GESTION","Es la información requerida internamente en el ejecicio de las funciones del area.","GRUPO INTERNO DE TRABAJO DE NOTIFICACIONES","2018-11-28","GRUPO INTERNO DE TRABAJO DE FORTALECIMIENTO DE LAS RELACIONES CON LOS GRUPOS DE INTERES","2019-01-02","APOYO","GESTION_RECURSOS","GESTION DOCUMENTAL","Resolución 3361 de 2018","Interno","Físico","Documentos de Archivo - físicos","N/A","Español","INFORMACIÓN PÚBLICA","N/A","N/A","N/A","N/A","N/A","N/A","N/A","N/A","N/A"]
["432-662","INFORMACIÓN","GRUPO INTERNO DE TRABAJO DE NOTIFICACIONES","NOTIFICACION ACTOS ADMINISTRATIVOS","Garantizar la publicidad y eficacia de los Actos Administrativos expedidos por la entidad","GRUPO INTERNO DE TRABAJO DE NOTIFICACIONES","2018-11-28","GRUPO INTERNO DE TRABAJO DE FORTALECIMIENTO DE LAS RELACIONES CON LOS GRUPOS DE INTERES","2019-01-02","APOYO","GESTION_RECURSOS","GESTION DOCUMENTAL","Resolución 3361 de 2018","Interno","Físico","Documentos de Archivo - físicos","N/A","Español","INFORMACIÓN PÚBLICA","N/A","N/A","N/A","N/A","N/A","N/A","N/A","Dato semiprivado","N/A"]
["432-663","INFORMACIÓN","GRUPO INTERNO DE TRABAJO DE NOTIFICACIONES","PQRSD","Solicitud, Respuesta o tramite","GRUPO INTERNO DE TRABAJO DE NOTIFICACIONES","2018-11-28","GRUPO INTERNO DE TRABAJO DE FORTALECIMIENTO DE LAS RELACIONES CON LOS GRUPOS DE INTERES","2019-01-02","APOYO","GESTION_RECURSOS","GESTION DOCUMENTAL","Ley 1755 de 2015","Externo","Físico","Documentos de Archivo - físicos","N/A","Español","INFORMACIÓN PÚBLICA","N/A","N/A","N/A","N/A","N/A","N/A","N/A","Dato personal privado ","f. Atender y resolver peticiones, quejas, reclamos y sugerencias."]
["435-664","INFORMACIÓN","GRUPO INTERNO DE TRABAJO DE GESTIÓN DE SERVICIOS ADMINISTRATIVOS","RUTOGRAMA","Recorrido diario que hacen los vehiculos del mintic","GRUPO INTERNO DE TRABAJO DE GESTIÓN DE SERVICIOS ADMINISTRATIVOS","2018-11-28","GRUPO INTERNO DE TRABAJO DE GESTIÓN DE SERVICIOS ADMINISTRATIVOS","2019-01-02","APOYO","GESTION_RECURSOS","GESTION DE RECURSOS ADMINISTRATIVOS","ley 1702 de 2013","Externo","Físico","Archivos Institucionales - físicos","Papel","Español","INFORMACIÓN PÚBLICA","N/A","N/A","N/A","N/A","N/A","N/A","N/A","Dato personal público","N/A"]
["435-665","INFORMACIÓN","GRUPO INTERNO DE TRABAJO DE GESTIÓN DE SERVICIOS ADMINISTRATIVOS","LISTA DE CHEQUEO DIARIO DEL VEHÍCULO","Revisión  general que se le realiza al vehículo respecto a (documentos, direccionales, luces, limpiabrisas, frenos, llantas, espejos, pito, niveles de fluidos, etc.","GRUPO INTERNO DE TRABAJO DE GESTIÓN DE SERVICIOS ADMINISTRATIVOS","2018-11-28","GRUPO INTERNO DE TRABAJO DE GESTIÓN DE SERVICIOS ADMINISTRATIVOS","2019-01-02","APOYO","GESTION_RECURSOS","GESTION DE RECURSOS ADMINISTRATIVOS","ley 1702 de 2013","Externo","Físico","Archivos Institucionales - físicos","Papel","Español","INFORMACIÓN PÚBLICA","N/A","N/A","N/A","N/A","N/A","N/A","N/A","Dato personal público","N/A"]
["435-666","INFORMACIÓN","GRUPO INTERNO DE TRABAJO DE GESTIÓN DE SERVICIOS ADMINISTRATIVOS","INVENTARIO DEL VEHÍCULO","Se realiza cuando se hace cambio de vehículo entre conductores o cuando se lleva al taller","GRUPO INTERNO DE TRABAJO DE GESTIÓN DE SERVICIOS ADMINISTRATIVOS","2018-11-28","GRUPO INTERNO DE TRABAJO DE GESTIÓN DE SERVICIOS ADMINISTRATIVOS","2019-01-02","APOYO","GESTION_RECURSOS","GESTION DE RECURSOS ADMINISTRATIVOS","ley 1702 de 2013","Externo","Físico","Archivos Institucionales - físicos","Papel","Español","INFORMACIÓN PÚBLICA","N/A","N/A","N/A","N/A","N/A","N/A","N/A","Dato personal público","N/A"]
["435-667","INFORMACIÓN","GRUPO INTERNO DE TRABAJO DE GESTIÓN DE SERVICIOS ADMINISTRATIVOS","COMUNICACIÓN","Solicitud de comision que hace el funcionario o contratista a la Entidad","GRUPO INTERNO DE TRABAJO DE GESTIÓN DE SERVICIOS ADMINISTRATIVOS","2018-11-28","GRUPO INTERNO DE TRABAJO DE GESTIÓN DE SERVICIOS ADMINISTRATIVOS","2019-01-02","APOYO","GESTION_RECURSOS","GESTION DE RECURSOS ADMINISTRATIVOS","resol. 2502 de 2018","Interno","N/A","Archivos Institucionales - físicos","Papel","Español","INFORMACIÓN PÚBLICA","N/A","N/A","N/A","N/A","N/A","N/A","N/A","Dato personal público","N/A"]
["435-668","INFORMACIÓN","GRUPO INTERNO DE TRABAJO DE GESTIÓN DE SERVICIOS ADMINISTRATIVOS","COPIA DEL CONTRATO","Copia del contrato cuando el solicitante es contratista","GRUPO INTERNO DE TRABAJO DE GESTIÓN DE SERVICIOS ADMINISTRATIVOS","2018-11-28","GRUPO INTERNO DE TRABAJO DE GESTIÓN DE SERVICIOS ADMINISTRATIVOS","2019-01-02","APOYO","GESTION_RECURSOS","GESTION DE RECURSOS ADMINISTRATIVOS","resol. 2502 de 2018","Interno","Físico","Archivos Institucionales - físicos","Papel","Español","INFORMACIÓN PÚBLICA","N/A","N/A","N/A","N/A","N/A","N/A","N/A","Dato personal público","e. Mantener actualizada la historia laboral y registros de nómina de funcionarios del Ministerio/Fondo TIC."]
["435-669","INFORMACIÓN","GRUPO INTERNO DE TRABAJO DE GESTIÓN DE SERVICIOS ADMINISTRATIVOS","CERTIFICACION LABORAL CON FUNCIONES","Certificación laboral con funcones en caso de los funcionarios","GRUPO INTERNO DE TRABAJO DE GESTIÓN DE SERVICIOS ADMINISTRATIVOS","2018-11-28","GRUPO INTERNO DE TRABAJO DE GESTIÓN DE SERVICIOS ADMINISTRATIVOS","2019-01-02","APOYO","GESTION_RECURSOS","GESTION DE RECURSOS ADMINISTRATIVOS","resol. 2502 de 2018","Interno","Físico","Archivos Institucionales - físicos","Papel","Español","INFORMACIÓN PÚBLICA","N/A","N/A","N/A","N/A","N/A","N/A","N/A","Dato personal público","e. Mantener actualizada la historia laboral y registros de nómina de funcionarios del Ministerio/Fondo TIC."]
["435-670","INFORMACIÓN","GRUPO INTERNO DE TRABAJO DE GESTIÓN DE SERVICIOS ADMINISTRATIVOS","INVITACIÓN Y AGENDA","Documento que se anexa al oficio para la solicitud de comision","GRUPO INTERNO DE TRABAJO DE GESTIÓN DE SERVICIOS ADMINISTRATIVOS","2018-11-28","GRUPO INTERNO DE TRABAJO DE GESTIÓN DE SERVICIOS ADMINISTRATIVOS","2019-01-02","APOYO","GESTION_RECURSOS","GESTION DE RECURSOS ADMINISTRATIVOS","resol. 2502 de 2018","Interno","Físico","Archivos Institucionales - físicos","Papel","Español","INFORMACIÓN PÚBLICA","N/A","N/A","N/A","N/A","N/A","N/A","N/A","N/A","N/A"]
["435-671","INFORMACIÓN","GRUPO INTERNO DE TRABAJO DE GESTIÓN DE SERVICIOS ADMINISTRATIVOS","CARTA DEL CURSO","Documento que se anexa cuando la comión es de estudios","GRUPO INTERNO DE TRABAJO DE GESTIÓN DE SERVICIOS ADMINISTRATIVOS","2018-11-28","GRUPO INTERNO DE TRABAJO DE GESTIÓN DE SERVICIOS ADMINISTRATIVOS","2019-01-02","APOYO","GESTION_RECURSOS","GESTION DE RECURSOS ADMINISTRATIVOS","resol. 2502 de 2018","Interno","Físico","Archivos Institucionales - físicos","Papel","Español","INFORMACIÓN PÚBLICA","N/A","N/A","N/A","N/A","N/A","N/A","N/A","Dato personal público","e. Mantener actualizada la historia laboral y registros de nómina de funcionarios del Ministerio/Fondo TIC."]
["435-672","INFORMACIÓN","GRUPO INTERNO DE TRABAJO DE GESTIÓN DE SERVICIOS ADMINISTRATIVOS","COTIZACION DE LOS TIQUETES","Documento que expide la agencia de viajes para conocer el valor de los tiquetes aéreos","GRUPO INTERNO DE TRABAJO DE GESTIÓN DE SERVICIOS ADMINISTRATIVOS","2018-11-28","GRUPO INTERNO DE TRABAJO DE GESTIÓN DE SERVICIOS ADMINISTRATIVOS","2019-01-02","APOYO","GESTION_RECURSOS","GESTION DE RECURSOS ADMINISTRATIVOS","resol. 2502 de 2018","Interno","Físico","Archivos Institucionales - físicos","Papel","Español","INFORMACIÓN PÚBLICA","N/A","N/A","N/A","N/A","N/A","N/A","N/A","Dato personal público","g. Conservar evidencia de los eventos de entrenamiento y sensibilización realizados, audiencias de adjudicación de contratos, reuniones internas y externas."]
["435-673","INFORMACIÓN","GRUPO INTERNO DE TRABAJO DE GESTIÓN DE SERVICIOS ADMINISTRATIVOS","POLIZA APROBADA","Documento que se debe aquirir y presentar para el caso de comisión de estudios","GRUPO INTERNO DE TRABAJO DE GESTIÓN DE SERVICIOS ADMINISTRATIVOS","2018-11-28","GRUPO INTERNO DE TRABAJO DE GESTIÓN DE SERVICIOS ADMINISTRATIVOS","2019-01-02","APOYO","GESTION_RECURSOS","GESTION DE RECURSOS ADMINISTRATIVOS","resol. 2502 de 2018","Interno","Físico","Archivos Institucionales - físicos","Papel","Español","INFORMACIÓN PÚBLICA","N/A","N/A","N/A","N/A","N/A","N/A","N/A","Dato personal público","g. Conservar evidencia de los eventos de entrenamiento y sensibilización realizados, audiencias de adjudicación de contratos, reuniones internas y externas."]
["435-674","INFORMACIÓN","GRUPO INTERNO DE TRABAJO DE GESTIÓN DE SERVICIOS ADMINISTRATIVOS","SOLICITUD DISPONIBILIDAD PRESUPUESTAL","Formato que se llena para disponer de los recursos economicos que amparen la comisión","GRUPO INTERNO DE TRABAJO DE GESTIÓN DE SERVICIOS ADMINISTRATIVOS","2018-11-28","GRUPO INTERNO DE TRABAJO DE GESTIÓN DE SERVICIOS ADMINISTRATIVOS","2019-01-02","APOYO","GESTION_RECURSOS","GESTION DE RECURSOS ADMINISTRATIVOS","resol. 2502 de 2018","Interno","Físico","Archivos Institucionales - físicos","Papel","Español","INFORMACIÓN PÚBLICA","N/A","N/A","N/A","N/A","N/A","N/A","N/A","Dato personal público","g. Conservar evidencia de los eventos de entrenamiento y sensibilización realizados, audiencias de adjudicación de contratos, reuniones internas y externas."]
["435-675","INFORMACIÓN","GRUPO INTERNO DE TRABAJO DE GESTIÓN DE SERVICIOS ADMINISTRATIVOS","ANTECEDENTES DISCIPLINARIOS","Se solicitan cuando se encarga a un funcionario diferente al Ministro para atender la comisión","GRUPO INTERNO DE TRABAJO DE GESTIÓN DE SERVICIOS ADMINISTRATIVOS","2018-11-28","GRUPO INTERNO DE TRABAJO DE GESTIÓN DE SERVICIOS ADMINISTRATIVOS","2019-01-02","APOYO","GESTION_RECURSOS","GESTION DE RECURSOS ADMINISTRATIVOS","resol. 2502 de 2018","Interno","Físico","Archivos Institucionales - físicos","Papel","Español","INFORMACIÓN PÚBLICA","N/A","N/A","N/A","N/A","N/A","N/A","N/A","Dato personal público","e. Mantener actualizada la historia laboral y registros de nómina de funcionarios del Ministerio/Fondo TIC."]
["435-676","INFORMACIÓN","GRUPO INTERNO DE TRABAJO DE GESTIÓN DE SERVICIOS ADMINISTRATIVOS","SOLICITUD A PRESIDENCIA DE AUTORIZACIÓN COMISIÓN","Documento que firma el ordenador del gasto y que se envía a presidencia para la aprobación de la comisión al exterior","GRUPO INTERNO DE TRABAJO DE GESTIÓN DE SERVICIOS ADMINISTRATIVOS","2018-11-28","GRUPO INTERNO DE TRABAJO DE GESTIÓN DE SERVICIOS ADMINISTRATIVOS","2019-01-02","APOYO","GESTION_RECURSOS","GESTION DE RECURSOS ADMINISTRATIVOS","resol. 2502 de 2018","Interno","Físico","Archivos Institucionales - físicos","Papel","Español","INFORMACIÓN PÚBLICA","N/A","N/A","N/A","N/A","N/A","N/A","N/A","Dato personal público","e. Mantener actualizada la historia laboral y registros de nómina de funcionarios del Ministerio/Fondo TIC."]
["435-677","INFORMACIÓN","GRUPO INTERNO DE TRABAJO DE GESTIÓN DE SERVICIOS ADMINISTRATIVOS","RESPUESTA A SOLICITUD DE COMISIÓN","Documento que envía presidencia aprabando o negando dicha comisión","GRUPO INTERNO DE TRABAJO DE GESTIÓN DE SERVICIOS ADMINISTRATIVOS","2018-11-28","GRUPO INTERNO DE TRABAJO DE GESTIÓN DE SERVICIOS ADMINISTRATIVOS","2019-01-02","APOYO","GESTION_RECURSOS","GESTION DE RECURSOS ADMINISTRATIVOS","resol. 2502 de 2018","Interno","Físico","Archivos Institucionales - físicos","Papel","Español","INFORMACIÓN PÚBLICA","N/A","N/A","N/A","N/A","N/A","N/A","N/A","Dato personal público","e. Mantener actualizada la historia laboral y registros de nómina de funcionarios del Ministerio/Fondo TIC."]
["435-678","INFORMACIÓN","GRUPO INTERNO DE TRABAJO DE GESTIÓN DE SERVICIOS ADMINISTRATIVOS","OFICIO","Oficio remisorio con toda la documentación para la comisión","GRUPO INTERNO DE TRABAJO DE GESTIÓN DE SERVICIOS ADMINISTRATIVOS","2018-11-28","GRUPO INTERNO DE TRABAJO DE GESTIÓN DE SERVICIOS ADMINISTRATIVOS","2019-01-02","APOYO","GESTION_RECURSOS","GESTION DE RECURSOS ADMINISTRATIVOS","resol. 2502 de 2018","Interno","Físico","Archivos Institucionales - físicos","Papel","Español","INFORMACIÓN PÚBLICA","N/A","N/A","N/A","N/A","N/A","N/A","N/A","Dato personal público","e. Mantener actualizada la historia laboral y registros de nómina de funcionarios del Ministerio/Fondo TIC."]
["435-679","INFORMACIÓN","GRUPO INTERNO DE TRABAJO DE GESTIÓN DE SERVICIOS ADMINISTRATIVOS","RESOLUCIÓN DE COMISION","Acto administrativo que se desprende de todo el proceso para la comsión ","GRUPO INTERNO DE TRABAJO DE GESTIÓN DE SERVICIOS ADMINISTRATIVOS","2018-11-28","GRUPO INTERNO DE TRABAJO DE GESTIÓN DE SERVICIOS ADMINISTRATIVOS","2019-01-02","APOYO","GESTION_RECURSOS","GESTION DE RECURSOS ADMINISTRATIVOS","resol. 2502 de 2018","Interno","Físico","Archivos Institucionales - físicos","Papel","Español","INFORMACIÓN PÚBLICA","N/A","N/A","N/A","N/A","N/A","N/A","N/A","Dato personal público","e. Mantener actualizada la historia laboral y registros de nómina de funcionarios del Ministerio/Fondo TIC."]
["435-680","INFORMACIÓN","GRUPO INTERNO DE TRABAJO DE GESTIÓN DE SERVICIOS ADMINISTRATIVOS","CARPETA INICIAL DEL VEHICULO","Carpeta inicial de cada vehículos que contiene (contrato de compra, copia de la factura de compra, acta de entrega del vehículopor parte del concesionario, inventario por parte del concesionario, formulario de matrícula RUNT, licencia de transito y/o tarjeta de propiedad, pólizas e impuestos iniciales, ingreso inventario Ministerio)","GRUPO INTERNO DE TRABAJO DE GESTIÓN DE SERVICIOS ADMINISTRATIVOS","2018-11-28","GRUPO INTERNO DE TRABAJO DE FORTALECIMIENTO DE LAS RELACIONES CON LOS GRUPOS DE INTERES","2019-01-02","APOYO","GESTION_RECURSOS","GESTION DE RECURSOS ADMINISTRATIVOS","LEY 769 DE 2002","Externo","Físico","Archivos Institucionales - físicos","Papel","Español","INFORMACIÓN PÚBLICA","N/A","N/A","N/A","N/A","N/A","N/A","N/A","N/A","N/A"]
["435-681","INFORMACIÓN","GRUPO INTERNO DE TRABAJO DE GESTIÓN DE SERVICIOS ADMINISTRATIVOS","SEGURO SOAT","compra del seguro obligatorio para cada vehículo","GRUPO INTERNO DE TRABAJO DE GESTIÓN DE SERVICIOS ADMINISTRATIVOS","2018-11-28","GRUPO INTERNO DE TRABAJO DE GESTIÓN DE SERVICIOS ADMINISTRATIVOS","2019-01-02","APOYO","GESTION_RECURSOS","GESTION DE RECURSOS ADMINISTRATIVOS","LEY 769 DE 2002","Externo","Físico","Archivos Institucionales - físicos","Papel","Español","INFORMACIÓN PÚBLICA","N/A","N/A","N/A","N/A","N/A","N/A","N/A","N/A","N/A"]
["435-682","INFORMACIÓN","GRUPO INTERNO DE TRABAJO DE GESTIÓN DE SERVICIOS ADMINISTRATIVOS","POLIZA DE SEGURO DEL VEHICULO","poliza de seguro del vehiculo","GRUPO INTERNO DE TRABAJO DE GESTIÓN DE SERVICIOS ADMINISTRATIVOS","2018-11-28","GRUPO INTERNO DE TRABAJO DE GESTIÓN DE SERVICIOS ADMINISTRATIVOS","2019-01-02","APOYO","GESTION_RECURSOS","GESTION DE RECURSOS ADMINISTRATIVOS","LEY 769 DE 2002","Externo","Físico","Archivos Institucionales - físicos","Papel","Español","INFORMACIÓN PÚBLICA","N/A","N/A","N/A","N/A","N/A","N/A","N/A","N/A","N/A"]
["435-683","INFORMACIÓN","GRUPO INTERNO DE TRABAJO DE GESTIÓN DE SERVICIOS ADMINISTRATIVOS","ACTA DE ENTREGA AL FUNCIONARIO RESPONSABLE","Entrega del vehículo al funcionario encargado de uso del mismo","GRUPO INTERNO DE TRABAJO DE GESTIÓN DE SERVICIOS ADMINISTRATIVOS","2018-11-28","GRUPO INTERNO DE TRABAJO DE GESTIÓN DE SERVICIOS ADMINISTRATIVOS","2019-01-02","APOYO","GESTION_RECURSOS","GESTION DE RECURSOS ADMINISTRATIVOS","LEY 769 DE 2002","Externo","Físico","Archivos Institucionales - físicos","Papel","Español","INFORMACIÓN PÚBLICA","N/A","N/A","N/A","N/A","N/A","N/A","N/A","N/A","N/A"]
["435-684","INFORMACIÓN","GRUPO INTERNO DE TRABAJO DE GESTIÓN DE SERVICIOS ADMINISTRATIVOS","REVISIÓN TECNICO-MECANICA","Reivisión tecnico-mecánica obligatoria que se debe realizar cada año","GRUPO INTERNO DE TRABAJO DE GESTIÓN DE SERVICIOS ADMINISTRATIVOS","2018-11-28","GRUPO INTERNO DE TRABAJO DE GESTIÓN DE SERVICIOS ADMINISTRATIVOS","2019-01-02","APOYO","GESTION_RECURSOS","GESTION DE RECURSOS ADMINISTRATIVOS","LEY 769 DE 2002","Externo","Físico","Archivos Institucionales - físicos","Papel","Español","INFORMACIÓN PÚBLICA","N/A","N/A","N/A","N/A","N/A","N/A","N/A","N/A","N/A"]
["435-685","INFORMACIÓN","GRUPO INTERNO DE TRABAJO DE GESTIÓN DE SERVICIOS ADMINISTRATIVOS","ACTA DE ENTREGA VEHÍCULO POR DONACIÓN O COMODATO","Documento que se elabora cuando el vehículo se entrega en donación o comodato ","GRUPO INTERNO DE TRABAJO DE GESTIÓN DE SERVICIOS ADMINISTRATIVOS","2018-11-28","GRUPO INTERNO DE TRABAJO DE FORTALECIMIENTO DE LAS RELACIONES CON LOS GRUPOS DE INTERES","2019-01-02","APOYO","GESTION_RECURSOS","GESTION DE RECURSOS ADMINISTRATIVOS","LEY 769 DE 2002","Externo","Físico","Archivos Institucionales - físicos","Papel","Español","INFORMACIÓN PÚBLICA","N/A","N/A","N/A","N/A","N/A","N/A","N/A","N/A","N/A"]
["435-686","INFORMACIÓN","GRUPO INTERNO DE TRABAJO DE GESTIÓN DE SERVICIOS ADMINISTRATIVOS","INVENTARIO DEL VEHÍCULO","Inventario inicial cuando se recibe del concesionario","GRUPO INTERNO DE TRABAJO DE GESTIÓN DE SERVICIOS ADMINISTRATIVOS","2018-11-28","GRUPO INTERNO DE TRABAJO DE GESTIÓN DE SERVICIOS ADMINISTRATIVOS","2019-01-02","APOYO","GESTION_RECURSOS","GESTION DE RECURSOS ADMINISTRATIVOS","LEY 769 DE 2002","Externo","Físico","Archivos Institucionales - físicos","Papel","Español","INFORMACIÓN PÚBLICA","N/A","N/A","N/A","N/A","N/A","N/A","N/A","N/A","N/A"]
["435-687","INFORMACIÓN","GRUPO INTERNO DE TRABAJO DE GESTIÓN DE SERVICIOS ADMINISTRATIVOS","ACTA DE DEVOLUCIÓN VEHICULO",null,"GRUPO INTERNO DE TRABAJO DE GESTIÓN DE SERVICIOS ADMINISTRATIVOS","2018-11-28","GRUPO INTERNO DE TRABAJO DE GESTIÓN DE SERVICIOS ADMINISTRATIVOS","2019-01-02","APOYO","GESTION_RECURSOS","GESTION DE RECURSOS ADMINISTRATIVOS","LEY 769 DE 2002","Externo","Físico","Archivos Institucionales - físicos","Papel","Español","INFORMACIÓN PÚBLICA","N/A","N/A","N/A","N/A","N/A","N/A","N/A","N/A","N/A"]
["435-688","INFORMACIÓN","GRUPO INTERNO DE TRABAJO DE GESTIÓN DE SERVICIOS ADMINISTRATIVOS","FORMULARIO DE PAGO DE IMPUESTOS","Pago del impuesto de vehículos","GRUPO INTERNO DE TRABAJO DE GESTIÓN DE SERVICIOS ADMINISTRATIVOS","2018-11-28","GRUPO INTERNO DE TRABAJO DE FORTALECIMIENTO DE LAS RELACIONES CON LOS GRUPOS DE INTERES","2019-01-02","APOYO","GESTION_RECURSOS","GESTION DE RECURSOS ADMINISTRATIVOS","LEY 769 DE 2002","Externo","Físico","Archivos Institucionales - físicos","Papel","Español","INFORMACIÓN PÚBLICA","N/A","N/A","N/A","N/A","N/A","N/A","N/A","N/A","a. Permitir el desarrollo del objeto del Ministerio/Fondo TIC, en los términos de los artículos 1o y 2o del Decreto 1414 de 2017."]
["435-689","INFORMACIÓN","GRUPO INTERNO DE TRABAJO DE GESTIÓN DE SERVICIOS ADMINISTRATIVOS","REQUERIMIENTO","Documentos que se generan dentro del proceso","GRUPO INTERNO DE TRABAJO DE GESTIÓN DE SERVICIOS ADMINISTRATIVOS","2018-11-28","GRUPO INTERNO DE TRABAJO DE GESTIÓN DE SERVICIOS ADMINISTRATIVOS","2019-01-02","APOYO","GESTION_RECURSOS","GESTION DE RECURSOS ADMINISTRATIVOS","LEY 769 DE 2002","Externo","Físico","Archivos Institucionales - físicos","Papel","Español","INFORMACIÓN PÚBLICA","N/A","N/A","N/A","N/A","N/A","N/A","N/A","N/A","N/A"]
["435-690","INFORMACIÓN","GRUPO INTERNO DE TRABAJO DE GESTIÓN DE SERVICIOS ADMINISTRATIVOS","BAJA- DESTINO FINAL","Sacar de inventario","GRUPO INTERNO DE TRABAJO DE GESTIÓN DE SERVICIOS ADMINISTRATIVOS","2018-11-28","GRUPO INTERNO DE TRABAJO DE GESTIÓN DE SERVICIOS ADMINISTRATIVOS","2019-01-02","APOYO","GESTION_RECURSOS","GESTION DE RECURSOS ADMINISTRATIVOS","Resol.1257 de 2018","Interno","Físico","Archivos Institucionales - físicos","Papel","Español","INFORMACIÓN PÚBLICA","N/A","N/A","N/A","N/A","N/A","N/A","N/A","N/A","N/A"]
["435-691","INFORMACIÓN","GRUPO INTERNO DE TRABAJO DE GESTIÓN DE SERVICIOS ADMINISTRATIVOS","INFORME DE ACCIDENTE DE VEHÍCULO","Informe presentado para la aseguradora y para el historisal del vehóiculo","GRUPO INTERNO DE TRABAJO DE GESTIÓN DE SERVICIOS ADMINISTRATIVOS","2018-11-28","GRUPO INTERNO DE TRABAJO DE GESTIÓN DE SERVICIOS ADMINISTRATIVOS","2019-01-02","APOYO","GESTION_RECURSOS","GESTION DE RECURSOS ADMINISTRATIVOS","Resol.1257 de 2018","Interno","Físico","Archivos Institucionales - físicos","Papel","Español","INFORMACIÓN PÚBLICA","N/A","N/A","N/A","N/A","N/A","N/A","N/A","N/A","N/A"]
["435-692","INFORMACIÓN","GRUPO INTERNO DE TRABAJO DE GESTIÓN DE SERVICIOS ADMINISTRATIVOS","HISTORIAL DE MANTENIMIENTO","Hostorial de todos los mantenimiento realizados a los vehículos","GRUPO INTERNO DE TRABAJO DE GESTIÓN DE SERVICIOS ADMINISTRATIVOS","2018-11-28","GRUPO INTERNO DE TRABAJO DE GESTIÓN DE SERVICIOS ADMINISTRATIVOS","2019-01-02","APOYO","GESTION_RECURSOS","GESTION DE RECURSOS ADMINISTRATIVOS","Resol.1257 de 2018","Interno","Físico","Archivos Institucionales - físicos","Papel","Español","INFORMACIÓN PÚBLICA","N/A","N/A","N/A","N/A","N/A","N/A","N/A","N/A","N/A"]
["435-693","INFORMACIÓN","GRUPO INTERNO DE TRABAJO DE GESTIÓN DE SERVICIOS ADMINISTRATIVOS","PLAN Y POLITICA DE SEGURIDAD VIAL","Cumplimiento del marco normativo a nivel nacional, de prevención y seguridad en las vias","GRUPO INTERNO DE TRABAJO DE GESTIÓN DE SERVICIOS ADMINISTRATIVOS","2018-11-28","GRUPO INTERNO DE TRABAJO DE GESTIÓN DE SERVICIOS ADMINISTRATIVOS","2019-01-02","APOYO","GESTION_RECURSOS","GESTION DE RECURSOS ADMINISTRATIVOS","Resol.1257 de 2018","Interno","Físico","Archivos Institucionales - físicos","Papel","Español","INFORMACIÓN PÚBLICA","N/A","N/A","N/A","N/A","N/A","N/A","N/A","N/A","N/A"]
["435-694","INFORMACIÓN","GRUPO INTERNO DE TRABAJO DE GESTIÓN DE SERVICIOS ADMINISTRATIVOS","INFORMES TRIMESTRALES- GESTION INDICADORES","Informes que se deben presentar cada tres meses sobre los indicadores del plan","GRUPO INTERNO DE TRABAJO DE GESTIÓN DE SERVICIOS ADMINISTRATIVOS","2018-11-28","GRUPO INTERNO DE TRABAJO DE GESTIÓN DE SERVICIOS ADMINISTRATIVOS","2019-01-02","APOYO","GESTION_RECURSOS","GESTION DE RECURSOS ADMINISTRATIVOS","Resol.1257 de 2018","Interno","Físico","Archivos Institucionales - físicos","Papel","Español","INFORMACIÓN PÚBLICA","N/A","N/A","N/A","N/A","N/A","N/A","N/A","N/A","N/A"]
["435-695","INFORMACIÓN","GRUPO INTERNO DE TRABAJO DE GESTIÓN DE SERVICIOS ADMINISTRATIVOS","ACTAS DE REUNIÓN Y LISTADOS DE ASISTENCIA","Actas de reunión y listados de asistencia","GRUPO INTERNO DE TRABAJO DE GESTIÓN DE SERVICIOS ADMINISTRATIVOS","2018-11-28","GRUPO INTERNO DE TRABAJO DE GESTIÓN DE SERVICIOS ADMINISTRATIVOS","2019-01-02","APOYO","GESTION_RECURSOS","GESTION DE RECURSOS ADMINISTRATIVOS","Resol.1257 de 2018","Interno","Físico","Archivos Institucionales - físicos","Papel","Español","INFORMACIÓN PÚBLICA","N/A","N/A","N/A","N/A","N/A","N/A","N/A","N/A","N/A"]
["435-696","INFORMACIÓN","GRUPO INTERNO DE TRABAJO DE GESTIÓN DE SERVICIOS ADMINISTRATIVOS","REPORTES DE ACCIDENTES E INCIDENTES DE TRANSITO","Reporte de incidentes y accidentes de transito","GRUPO INTERNO DE TRABAJO DE GESTIÓN DE SERVICIOS ADMINISTRATIVOS","2018-11-28","GRUPO INTERNO DE TRABAJO DE GESTIÓN DE SERVICIOS ADMINISTRATIVOS","2019-01-02","APOYO","GESTION_RECURSOS","GESTION DE RECURSOS ADMINISTRATIVOS","Resol.1257 de 2018","Interno","Físico","Archivos Institucionales - físicos","Papel","Español","INFORMACIÓN PÚBLICA","N/A","N/A","N/A","N/A","N/A","N/A","N/A","N/A","N/A"]
["435-697","INFORMACIÓN","GRUPO INTERNO DE TRABAJO DE GESTIÓN DE SERVICIOS ADMINISTRATIVOS","COMUNICACIONES","Comunicaciones que se generan dentro del plan estrategico de seguridad vial","GRUPO INTERNO DE TRABAJO DE GESTIÓN DE SERVICIOS ADMINISTRATIVOS","2018-11-28","GRUPO INTERNO DE TRABAJO DE FORTALECIMIENTO DE LAS RELACIONES CON LOS GRUPOS DE INTERES","2019-01-02","APOYO","GESTION_RECURSOS","GESTION DE RECURSOS ADMINISTRATIVOS","Resol.1257 de 2018","Interno","Físico","Archivos Institucionales - físicos","Papel","Español","INFORMACIÓN PÚBLICA","N/A","N/A","N/A","N/A","N/A","N/A","N/A","N/A","N/A"]
["435-698","INFORMACIÓN","GRUPO INTERNO DE TRABAJO DE GESTIÓN DE SERVICIOS ADMINISTRATIVOS","SOLICITUDES","Solicitudes varias que llegan a la entidad","GRUPO INTERNO DE TRABAJO DE GESTIÓN DE SERVICIOS ADMINISTRATIVOS","2018-11-28","GRUPO INTERNO DE TRABAJO DE GESTIÓN DE SERVICIOS ADMINISTRATIVOS","2019-01-02","APOYO","GESTION_RECURSOS","GESTION DE RECURSOS ADMINISTRATIVOS","resol 3333 de 2015","Interno","Físico","Archivos Institucionales - físicos","Papel","Español","INFORMACIÓN PÚBLICA","N/A","N/A","N/A","N/A","N/A","N/A","N/A","Dato personal privado ","f. Atender y resolver peticiones, quejas, reclamos y sugerencias."]
["435-699","INFORMACIÓN","GRUPO INTERNO DE TRABAJO DE GESTIÓN DE SERVICIOS ADMINISTRATIVOS","RESPUESTAS Y/O TRAMITES","Son las respuestas que se dan a las diferentes solicitudes radicadas al Ministerio","GRUPO INTERNO DE TRABAJO DE GESTIÓN DE SERVICIOS ADMINISTRATIVOS","2018-11-28","GRUPO INTERNO DE TRABAJO DE GESTIÓN DE SERVICIOS ADMINISTRATIVOS","2019-01-02","APOYO","GESTION_RECURSOS","GESTION DE RECURSOS ADMINISTRATIVOS","resol 3333 de 2015","Interno","Físico","Archivos Institucionales - físicos","Papel","Español","INFORMACIÓN PÚBLICA","N/A","N/A","N/A","N/A","N/A","N/A","N/A","Dato personal privado ","f. Atender y resolver peticiones, quejas, reclamos y sugerencias."]
["436-700","INFORMACIÓN","GRUPO INTERNO DE TRABAJO DE GESTIÓN DE TALENTO HUMANO","Convocatoria","Registro de las actividades del Comité","GRUPO INTERNO DE TRABAJO DE GESTIÓN DE TALENTO HUMANO","2018-11-28","GRUPO INTERNO DE TRABAJO DE GESTIÓN DE TALENTO HUMANO","2019-01-02","APOYO","GESTION_RECURSOS","GESTION DEL TALENTO HUMANO","Resolución 2013 de 1986 ","Interno","Físico","Documentos de Archivo - electrónicos","Base de datos","Español","INFORMACIÓN PÚBLICA CLASIFICADA","N/A","SI","Decreto 103 de 2015 Artículo 18 literal a Ley 1712 de 2014","Ley 1712 de 2014 ","Reserva parcial","2018-11-30","10 AÑOS","Dato semiprivado","d. Formular, ejecutar y evaluar los programas de salud ocupacional y planes de atención a emergencias."]
["436-701","INFORMACIÓN","GRUPO INTERNO DE TRABAJO DE GESTIÓN DE TALENTO HUMANO","Proceso de elección","Registro de las actividades del Comité","GRUPO INTERNO DE TRABAJO DE GESTIÓN DE TALENTO HUMANO","2018-11-28","GRUPO INTERNO DE TRABAJO DE GESTIÓN DE TALENTO HUMANO","2019-01-02","APOYO","GESTION_RECURSOS","GESTION DEL TALENTO HUMANO","Resolución 2013 de 1986","Interno","Físico","Documentos de Archivo - electrónicos","Base de datos","Español","INFORMACIÓN PÚBLICA CLASIFICADA","N/A","SI","Decreto 103 de 2015 Artículo 18 literal a Ley 1712 de 2014","Ley 1712 de 2014 ","Reserva parcial","2018-11-30","10 AÑOS","Dato semiprivado","d. Formular, ejecutar y evaluar los programas de salud ocupacional y planes de atención a emergencias."]
["436-702","INFORMACIÓN","GRUPO INTERNO DE TRABAJO DE GESTIÓN DE TALENTO HUMANO","Resolución de conformación de Copasst","Registro de las actividades del Comité","GRUPO INTERNO DE TRABAJO DE GESTIÓN DE TALENTO HUMANO","2018-11-28","GRUPO INTERNO DE TRABAJO DE GESTIÓN DE TALENTO HUMANO","2019-01-02","APOYO","GESTION_RECURSOS","GESTION DEL TALENTO HUMANO","Resolución 2013 de 1986","Interno","Físico","Documentos de Archivo - electrónicos","Base de datos","Español","INFORMACIÓN PÚBLICA CLASIFICADA","N/A","SI","Decreto 103 de 2015 Artículo 18 literal a Ley 1712 de 2014","Ley 1712 de 2014 ","Reserva parcial","2018-11-30","10 AÑOS","Dato semiprivado","d. Formular, ejecutar y evaluar los programas de salud ocupacional y planes de atención a emergencias."]
["436-703","INFORMACIÓN","GRUPO INTERNO DE TRABAJO DE GESTIÓN DE TALENTO HUMANO","Solicitudes","Registro de las actividades del Comité","GRUPO INTERNO DE TRABAJO DE GESTIÓN DE TALENTO HUMANO","2018-11-28","GRUPO INTERNO DE TRABAJO DE GESTIÓN DE TALENTO HUMANO","2019-01-02","APOYO","GESTION_RECURSOS","GESTION DEL TALENTO HUMANO","Resolución 2013 de 1986","Interno","Físico","Documentos de Archivo - electrónicos","Base de datos","Español","INFORMACIÓN PÚBLICA CLASIFICADA","N/A","SI","Decreto 103 de 2015 Artículo 18 literal a Ley 1712 de 2014","Ley 1712 de 2014 ","Reserva parcial","2018-11-30","10 AÑOS","Dato semiprivado","d. Formular, ejecutar y evaluar los programas de salud ocupacional y planes de atención a emergencias."]
["436-704","INFORMACIÓN","GRUPO INTERNO DE TRABAJO DE GESTIÓN DE TALENTO HUMANO","Lista de chequeo de requisitos","Compendio de Historia laboral de personal de planta ","GRUPO INTERNO DE TRABAJO DE GESTIÓN DE TALENTO HUMANO","2018-11-28","GRUPO INTERNO DE TRABAJO DE GESTIÓN DE TALENTO HUMANO","2019-01-02","APOYO","GESTION_RECURSOS","GESTION DEL TALENTO HUMANO","Ley 594 de 2000 y Archivo General de la Nación","Interno","Físico","Documentos de Archivo - electrónicos","Base de datos","Español","INFORMACIÓN PÚBLICA CLASIFICADA","N/A","SI","Decreto 103 de 2015 Artículo 18 literal a Ley 1712 de 2014","Ley 1712 de 2014","Reserva parcial","2018-11-30","10 AÑOS","Dato semiprivado","e. Mantener actualizada la historia laboral y registros de nómina de funcionarios del Ministerio/Fondo TIC."]
["436-705","INFORMACIÓN","GRUPO INTERNO DE TRABAJO DE GESTIÓN DE TALENTO HUMANO","Hojas de vida de la función pública","Compendio de Historia laboral de personal de planta ",{"$f":"IF(C712=\"\",\"\",C712)","v":"GRUPO INTERNO DE TRABAJO DE GESTIÓN DE TALENTO HUMANO"},"2018-11-28","GRUPO INTERNO DE TRABAJO DE GESTIÓN DE TALENTO HUMANO","2019-01-02","APOYO","GESTION_RECURSOS","GESTION DEL TALENTO HUMANO","Ley 594 de 2000 y Archivo General de la Nación","Interno","Físico","Documentos de Archivo - electrónicos","Base de datos","Español","INFORMACIÓN PÚBLICA CLASIFICADA","N/A","SI","Decreto 103 de 2015 Artículo 18 literal a Ley 1712 de 2014","Ley 1712 de 2014","Reserva parcial","2018-11-30","80 AÑOS","Dato semiprivado","e. Mantener actualizada la historia laboral y registros de nómina de funcionarios del Ministerio/Fondo TIC."]
["436-706","INFORMACIÓN","GRUPO INTERNO DE TRABAJO DE GESTIÓN DE TALENTO HUMANO","Resolución de nombramiento","Compendio de Historia laboral de personal de planta ","GRUPO INTERNO DE TRABAJO DE GESTIÓN DE TALENTO HUMANO","2018-11-28","GRUPO INTERNO DE TRABAJO DE GESTIÓN DE TALENTO HUMANO","2019-01-02","APOYO","GESTION_RECURSOS","GESTION DEL TALENTO HUMANO","Ley 594 de 2000 y Archivo General de la Nación","Interno","Físico","Documentos de Archivo - electrónicos","Base de datos","Español","INFORMACIÓN PÚBLICA CLASIFICADA","N/A","SI","Decreto 103 de 2015 Artículo 18 literal a Ley 1712 de 2014","Ley 1712 de 2014","Reserva parcial","2018-11-30","80 AÑOS","Dato semiprivado","e. Mantener actualizada la historia laboral y registros de nómina de funcionarios del Ministerio/Fondo TIC."]
["436-707","INFORMACIÓN","GRUPO INTERNO DE TRABAJO DE GESTIÓN DE TALENTO HUMANO","Oficio de comunicación de nombramiento","Compendio de Historia laboral de personal de planta ","GRUPO INTERNO DE TRABAJO DE GESTIÓN DE TALENTO HUMANO","2018-11-28","GRUPO INTERNO DE TRABAJO DE GESTIÓN DE TALENTO HUMANO","2019-01-02","APOYO","GESTION_RECURSOS","GESTION DEL TALENTO HUMANO","Ley 594 de 2000 y Archivo General de la Nación","Interno","Físico","Documentos de Archivo - electrónicos","Base de datos","Español","INFORMACIÓN PÚBLICA CLASIFICADA","N/A","SI","Decreto 103 de 2015 Artículo 18 literal a Ley 1712 de 2014","Ley 1712 de 2014","Reserva parcial","2018-11-30","80 AÑOS","Dato semiprivado","e. Mantener actualizada la historia laboral y registros de nómina de funcionarios del Ministerio/Fondo TIC."]
["436-708","INFORMACIÓN","GRUPO INTERNO DE TRABAJO DE GESTIÓN DE TALENTO HUMANO","Oficio de aceptación de nombramiento","Compendio de Historia laboral de personal de planta ","GRUPO INTERNO DE TRABAJO DE GESTIÓN DE TALENTO HUMANO","2018-11-28","GRUPO INTERNO DE TRABAJO DE GESTIÓN DE TALENTO HUMANO","2019-01-02","APOYO","GESTION_RECURSOS","GESTION DEL TALENTO HUMANO","Ley 594 de 2000 y Archivo General de la Nación","Interno","Físico","Documentos de Archivo - electrónicos","Base de datos","Español","INFORMACIÓN PÚBLICA CLASIFICADA","N/A","SI","Decreto 103 de 2015 Artículo 18 literal a Ley 1712 de 2014","Ley 1712 de 2014","Reserva parcial","2018-11-30","80 AÑOS","Dato semiprivado","e. Mantener actualizada la historia laboral y registros de nómina de funcionarios del Ministerio/Fondo TIC."]
["436-709","INFORMACIÓN","GRUPO INTERNO DE TRABAJO DE GESTIÓN DE TALENTO HUMANO","Acta de posesión","Compendio de Historia laboral de personal de planta ","GRUPO INTERNO DE TRABAJO DE GESTIÓN DE TALENTO HUMANO","2018-11-28","GRUPO INTERNO DE TRABAJO DE GESTIÓN DE TALENTO HUMANO","2019-01-02","APOYO","GESTION_RECURSOS","GESTION DEL TALENTO HUMANO","Ley 594 de 2000 y Archivo General de la Nación","Interno","Físico","Documentos de Archivo - electrónicos","Base de datos","Español","INFORMACIÓN PÚBLICA CLASIFICADA","N/A","SI","Decreto 103 de 2015 Artículo 18 literal a Ley 1712 de 2014","Ley 1712 de 2014","Reserva parcial","2018-11-30","80 AÑOS","Dato semiprivado","e. Mantener actualizada la historia laboral y registros de nómina de funcionarios del Ministerio/Fondo TIC."]
["436-710","INFORMACIÓN","GRUPO INTERNO DE TRABAJO DE GESTIÓN DE TALENTO HUMANO","Formulario único de declaración juramentada de bienes y rentas","Compendio de Historia laboral de personal de planta ","GRUPO INTERNO DE TRABAJO DE GESTIÓN DE TALENTO HUMANO","2018-11-28","GRUPO INTERNO DE TRABAJO DE GESTIÓN DE TALENTO HUMANO","2019-01-02","APOYO","GESTION_RECURSOS","GESTION DEL TALENTO HUMANO","Ley 594 de 2000 y Archivo General de la Nación","Interno","Físico","Documentos de Archivo - electrónicos","Base de datos","Español","INFORMACIÓN PÚBLICA CLASIFICADA","N/A","SI","Decreto 103 de 2015 Artículo 18 literal a Ley 1712 de 2014","Ley 1712 de 2014","Reserva parcial","2018-11-30","80 AÑOS","Dato semiprivado","e. Mantener actualizada la historia laboral y registros de nómina de funcionarios del Ministerio/Fondo TIC."]
["436-711","INFORMACIÓN","GRUPO INTERNO DE TRABAJO DE GESTIÓN DE TALENTO HUMANO","Fotocopia de cédula de ciudadanía","Compendio de Historia laboral de personal de planta ","GRUPO INTERNO DE TRABAJO DE GESTIÓN DE TALENTO HUMANO","2018-11-28","GRUPO INTERNO DE TRABAJO DE GESTIÓN DE TALENTO HUMANO","2019-01-02","APOYO","GESTION_RECURSOS","GESTION DEL TALENTO HUMANO","Ley 594 de 2000 y Archivo General de la Nación","Interno","Físico","Documentos de Archivo - electrónicos","Base de datos","Español","INFORMACIÓN PÚBLICA CLASIFICADA","N/A","SI","Decreto 103 de 2015 Artículo 18 literal a Ley 1712 de 2014","Ley 1712 de 2014","Reserva parcial","2018-11-30","80 AÑOS","Dato semiprivado","e. Mantener actualizada la historia laboral y registros de nómina de funcionarios del Ministerio/Fondo TIC."]
["436-712","INFORMACIÓN","GRUPO INTERNO DE TRABAJO DE GESTIÓN DE TALENTO HUMANO","Certificados o diplomas de estudios","Compendio de Historia laboral de personal de planta ","GRUPO INTERNO DE TRABAJO DE GESTIÓN DE TALENTO HUMANO","2018-11-28","GRUPO INTERNO DE TRABAJO DE GESTIÓN DE TALENTO HUMANO","2019-01-02","APOYO","GESTION_RECURSOS","GESTION DEL TALENTO HUMANO","Ley 594 de 2000 y Archivo General de la Nación","Interno","Físico","Documentos de Archivo - electrónicos","Base de datos","Español","INFORMACIÓN PÚBLICA CLASIFICADA","N/A","SI","Decreto 103 de 2015 Artículo 18 literal a Ley 1712 de 2014","Ley 1712 de 2014","Reserva parcial","2018-11-30","80 AÑOS","Dato semiprivado","e. Mantener actualizada la historia laboral y registros de nómina de funcionarios del Ministerio/Fondo TIC."]
["436-713","INFORMACIÓN","GRUPO INTERNO DE TRABAJO DE GESTIÓN DE TALENTO HUMANO","Certificados de experiencia laboral","Compendio de Historia laboral de personal de planta ","GRUPO INTERNO DE TRABAJO DE GESTIÓN DE TALENTO HUMANO","2018-11-28","GRUPO INTERNO DE TRABAJO DE GESTIÓN DE TALENTO HUMANO","2019-01-02","APOYO","GESTION_RECURSOS","GESTION DEL TALENTO HUMANO","Ley 594 de 2000 y Archivo General de la Nación","Interno","Físico","Documentos de Archivo - electrónicos","Base de datos","Español","INFORMACIÓN PÚBLICA CLASIFICADA","N/A","SI","Decreto 103 de 2015 Artículo 18 literal a Ley 1712 de 2014","Ley 1712 de 2014","Reserva parcial","2018-11-30","80 AÑOS","Dato semiprivado","e. Mantener actualizada la historia laboral y registros de nómina de funcionarios del Ministerio/Fondo TIC."]
["436-714","INFORMACIÓN","GRUPO INTERNO DE TRABAJO DE GESTIÓN DE TALENTO HUMANO","Antecedentes judiciales","Compendio de Historia laboral de personal de planta ","GRUPO INTERNO DE TRABAJO DE GESTIÓN DE TALENTO HUMANO","2018-11-28","GRUPO INTERNO DE TRABAJO DE GESTIÓN DE TALENTO HUMANO","2019-01-02","APOYO","GESTION_RECURSOS","GESTION DEL TALENTO HUMANO","Ley 594 de 2000 y Archivo General de la Nación","Interno","Físico","Documentos de Archivo - electrónicos","Base de datos","Español","INFORMACIÓN PÚBLICA CLASIFICADA","N/A","SI","Decreto 103 de 2015 Artículo 18 literal a Ley 1712 de 2014","Ley 1712 de 2014","Reserva parcial","2018-11-30","80 AÑOS","Dato semiprivado","e. Mantener actualizada la historia laboral y registros de nómina de funcionarios del Ministerio/Fondo TIC."]
["436-715","INFORMACIÓN","GRUPO INTERNO DE TRABAJO DE GESTIÓN DE TALENTO HUMANO","Fotocopia libreta militar","Compendio de Historia laboral de personal de planta ","GRUPO INTERNO DE TRABAJO DE GESTIÓN DE TALENTO HUMANO","2018-11-28","GRUPO INTERNO DE TRABAJO DE GESTIÓN DE TALENTO HUMANO","2019-01-02","APOYO","GESTION_RECURSOS","GESTION DEL TALENTO HUMANO","Ley 594 de 2000 y Archivo General de la Nación","Interno","Físico","Documentos de Archivo - electrónicos","Base de datos","Español","INFORMACIÓN PÚBLICA CLASIFICADA","N/A","SI","Decreto 103 de 2015 Artículo 18 literal a Ley 1712 de 2014","Ley 1712 de 2014","Reserva parcial","2018-11-30","80 AÑOS","Dato semiprivado","e. Mantener actualizada la historia laboral y registros de nómina de funcionarios del Ministerio/Fondo TIC."]
["436-716","INFORMACIÓN","GRUPO INTERNO DE TRABAJO DE GESTIÓN DE TALENTO HUMANO","Fotocopia de licencia de conducción","Compendio de Historia laboral de personal de planta ","GRUPO INTERNO DE TRABAJO DE GESTIÓN DE TALENTO HUMANO","2018-11-28","GRUPO INTERNO DE TRABAJO DE GESTIÓN DE TALENTO HUMANO","2019-01-02","APOYO","GESTION_RECURSOS","GESTION DEL TALENTO HUMANO","Ley 594 de 2000 y Archivo General de la Nación","Interno","Físico","Documentos de Archivo - electrónicos","Base de datos","Español","INFORMACIÓN PÚBLICA CLASIFICADA","N/A","SI","Decreto 103 de 2015 Artículo 18 literal a Ley 1712 de 2014","Ley 1712 de 2014","Reserva parcial","2018-11-30","80 AÑOS","Dato semiprivado","e. Mantener actualizada la historia laboral y registros de nómina de funcionarios del Ministerio/Fondo TIC."]
["436-717","INFORMACIÓN","GRUPO INTERNO DE TRABAJO DE GESTIÓN DE TALENTO HUMANO","Certificados de antecedentes disciplinarios","Compendio de Historia laboral de personal de planta ","GRUPO INTERNO DE TRABAJO DE GESTIÓN DE TALENTO HUMANO","2018-11-28","GRUPO INTERNO DE TRABAJO DE GESTIÓN DE TALENTO HUMANO","2019-01-02","APOYO","GESTION_RECURSOS","GESTION DEL TALENTO HUMANO","Ley 594 de 2000 y Archivo General de la Nación","Interno","Físico","Documentos de Archivo - electrónicos","Base de datos","Español","INFORMACIÓN PÚBLICA CLASIFICADA","N/A","SI","Decreto 103 de 2015 Artículo 18 literal a Ley 1712 de 2014","Ley 1712 de 2014","Reserva parcial","2018-11-30","80 AÑOS","Dato semiprivado","e. Mantener actualizada la historia laboral y registros de nómina de funcionarios del Ministerio/Fondo TIC."]
["436-718","INFORMACIÓN","GRUPO INTERNO DE TRABAJO DE GESTIÓN DE TALENTO HUMANO","Certificado de responsabilidad fiscal de contraloría","Compendio de Historia laboral de personal de planta ","GRUPO INTERNO DE TRABAJO DE GESTIÓN DE TALENTO HUMANO","2018-11-28","GRUPO INTERNO DE TRABAJO DE GESTIÓN DE TALENTO HUMANO","2019-01-02","APOYO","GESTION_RECURSOS","GESTION DEL TALENTO HUMANO","Ley 594 de 2000 y Archivo General de la Nación","Interno","Físico","Documentos de Archivo - electrónicos","Base de datos","Español","INFORMACIÓN PÚBLICA CLASIFICADA","N/A","SI","Decreto 103 de 2015 Artículo 18 literal a Ley 1712 de 2014","Ley 1712 de 2014","Reserva parcial","2018-11-30","80 AÑOS","Dato semiprivado","e. Mantener actualizada la historia laboral y registros de nómina de funcionarios del Ministerio/Fondo TIC."]
["436-719","INFORMACIÓN","GRUPO INTERNO DE TRABAJO DE GESTIÓN DE TALENTO HUMANO","Declaración juramentada de embargo de alimentos","Compendio de Historia laboral de personal de planta ","GRUPO INTERNO DE TRABAJO DE GESTIÓN DE TALENTO HUMANO","2018-11-28","GRUPO INTERNO DE TRABAJO DE GESTIÓN DE TALENTO HUMANO","2019-01-02","APOYO","GESTION_RECURSOS","GESTION DEL TALENTO HUMANO","Ley 594 de 2000 y Archivo General de la Nación","Interno","Físico","Documentos de Archivo - electrónicos","Base de datos","Español","INFORMACIÓN PÚBLICA CLASIFICADA","N/A","SI","Decreto 103 de 2015 Artículo 18 literal a Ley 1712 de 2014","Ley 1712 de 2014","Reserva parcial","2018-11-30","80 AÑOS","Dato semiprivado","e. Mantener actualizada la historia laboral y registros de nómina de funcionarios del Ministerio/Fondo TIC."]
["436-720","INFORMACIÓN","GRUPO INTERNO DE TRABAJO DE GESTIÓN DE TALENTO HUMANO","Examen médico de ingreso, periodico y de retiro","Compendio de Historia laboral de personal de planta ","GRUPO INTERNO DE TRABAJO DE GESTIÓN DE TALENTO HUMANO","2018-11-28","GRUPO INTERNO DE TRABAJO DE GESTIÓN DE TALENTO HUMANO","2019-01-02","APOYO","GESTION_RECURSOS","GESTION DEL TALENTO HUMANO","Ley 594 de 2000 y Archivo General de la Nación","Interno","Físico","Documentos de Archivo - electrónicos","Base de datos","Español","INFORMACIÓN PÚBLICA CLASIFICADA","N/A","SI","Decreto 103 de 2015 Artículo 18 literal a Ley 1712 de 2014","Ley 1712 de 2014","Reserva parcial","2018-11-30","80 AÑOS","Dato semiprivado","e. Mantener actualizada la historia laboral y registros de nómina de funcionarios del Ministerio/Fondo TIC."]
["436-721","INFORMACIÓN","GRUPO INTERNO DE TRABAJO DE GESTIÓN DE TALENTO HUMANO","Certificado de afiliación a seguridad social","Compendio de Historia laboral de personal de planta ","GRUPO INTERNO DE TRABAJO DE GESTIÓN DE TALENTO HUMANO","2018-11-28","GRUPO INTERNO DE TRABAJO DE GESTIÓN DE TALENTO HUMANO","2019-01-02","APOYO","GESTION_RECURSOS","GESTION DEL TALENTO HUMANO","Ley 594 de 2000 y Archivo General de la Nación","Interno","Físico","Documentos de Archivo - electrónicos","Base de datos","Español","INFORMACIÓN PÚBLICA CLASIFICADA","N/A","SI","Decreto 103 de 2015 Artículo 18 literal a Ley 1712 de 2014","Ley 1712 de 2014","Reserva parcial","2018-11-30","80 AÑOS","Dato semiprivado","e. Mantener actualizada la historia laboral y registros de nómina de funcionarios del Ministerio/Fondo TIC."]
["436-722","INFORMACIÓN","GRUPO INTERNO DE TRABAJO DE GESTIÓN DE TALENTO HUMANO","Certificación bancaria","Compendio de Historia laboral de personal de planta ","GRUPO INTERNO DE TRABAJO DE GESTIÓN DE TALENTO HUMANO","2018-11-28","GRUPO INTERNO DE TRABAJO DE GESTIÓN DE TALENTO HUMANO","2019-01-02","APOYO","GESTION_RECURSOS","GESTION DEL TALENTO HUMANO","Ley 594 de 2000 y Archivo General de la Nación","Interno","Físico","Documentos de Archivo - electrónicos","Base de datos","Español","INFORMACIÓN PÚBLICA CLASIFICADA","N/A","SI","Decreto 103 de 2015 Artículo 18 literal a Ley 1712 de 2014","Ley 1712 de 2014","Reserva parcial","2018-11-30","80 AÑOS","Dato semiprivado","e. Mantener actualizada la historia laboral y registros de nómina de funcionarios del Ministerio/Fondo TIC."]
["436-723","INFORMACIÓN","GRUPO INTERNO DE TRABAJO DE GESTIÓN DE TALENTO HUMANO","Comunicación funciones empleo","Compendio de Historia laboral de personal de planta ","GRUPO INTERNO DE TRABAJO DE GESTIÓN DE TALENTO HUMANO","2018-11-28","GRUPO INTERNO DE TRABAJO DE GESTIÓN DE TALENTO HUMANO","2019-01-02","APOYO","GESTION_RECURSOS","GESTION DEL TALENTO HUMANO","Ley 594 de 2000 y Archivo General de la Nación","Interno","Físico","Documentos de Archivo - electrónicos","Base de datos","Español","INFORMACIÓN PÚBLICA CLASIFICADA","N/A","SI","Decreto 103 de 2015 Artículo 18 literal a Ley 1712 de 2014","Ley 1712 de 2014","Reserva parcial","2018-11-30","80 AÑOS","Dato semiprivado","e. Mantener actualizada la historia laboral y registros de nómina de funcionarios del Ministerio/Fondo TIC."]
["436-724","INFORMACIÓN","GRUPO INTERNO DE TRABAJO DE GESTIÓN DE TALENTO HUMANO","Embargos","Compendio de Historia laboral de personal de planta ","GRUPO INTERNO DE TRABAJO DE GESTIÓN DE TALENTO HUMANO","2018-11-28","GRUPO INTERNO DE TRABAJO DE GESTIÓN DE TALENTO HUMANO","2019-01-02","APOYO","GESTION_RECURSOS","GESTION DEL TALENTO HUMANO","Ley 594 de 2000 y Archivo General de la Nación","Interno","Físico","Documentos de Archivo - electrónicos","Base de datos","Español","INFORMACIÓN PÚBLICA CLASIFICADA","N/A","SI","Decreto 103 de 2015 Artículo 18 literal a Ley 1712 de 2014","Ley 1712 de 2014","Reserva parcial","2018-11-30","80 AÑOS","Dato semiprivado","e. Mantener actualizada la historia laboral y registros de nómina de funcionarios del Ministerio/Fondo TIC."]
["436-725","INFORMACIÓN","GRUPO INTERNO DE TRABAJO DE GESTIÓN DE TALENTO HUMANO","Certificados de capacitación y actualización","Compendio de Historia laboral de personal de planta ","GRUPO INTERNO DE TRABAJO DE GESTIÓN DE TALENTO HUMANO","2018-11-28","GRUPO INTERNO DE TRABAJO DE GESTIÓN DE TALENTO HUMANO","2019-01-02","APOYO","GESTION_RECURSOS","GESTION DEL TALENTO HUMANO","Ley 594 de 2000 y Archivo General de la Nación","Interno","Físico","Documentos de Archivo - electrónicos","Base de datos","Español","INFORMACIÓN PÚBLICA CLASIFICADA","N/A","SI","Decreto 103 de 2015 Artículo 18 literal a Ley 1712 de 2014","Ley 1712 de 2014","Reserva parcial","2018-11-30","80 AÑOS","Dato semiprivado","e. Mantener actualizada la historia laboral y registros de nómina de funcionarios del Ministerio/Fondo TIC."]
["436-726","INFORMACIÓN","GRUPO INTERNO DE TRABAJO DE GESTIÓN DE TALENTO HUMANO","Solicitud de vacaciones","Compendio de Historia laboral de personal de planta ","GRUPO INTERNO DE TRABAJO DE GESTIÓN DE TALENTO HUMANO","2018-11-28","GRUPO INTERNO DE TRABAJO DE GESTIÓN DE TALENTO HUMANO","2019-01-02","APOYO","GESTION_RECURSOS","GESTION DEL TALENTO HUMANO","Ley 594 de 2000 y Archivo General de la Nación","Interno","Físico","Documentos de Archivo - electrónicos","Base de datos","Español","INFORMACIÓN PÚBLICA CLASIFICADA","N/A","SI","Decreto 103 de 2015 Artículo 18 literal a Ley 1712 de 2014","Ley 1712 de 2014","Reserva parcial","2018-11-30","80 AÑOS","Dato semiprivado","e. Mantener actualizada la historia laboral y registros de nómina de funcionarios del Ministerio/Fondo TIC."]
["436-727","INFORMACIÓN","GRUPO INTERNO DE TRABAJO DE GESTIÓN DE TALENTO HUMANO","Resolución de vacaciones","Compendio de Historia laboral de personal de planta ","GRUPO INTERNO DE TRABAJO DE GESTIÓN DE TALENTO HUMANO","2018-11-28","GRUPO INTERNO DE TRABAJO DE GESTIÓN DE TALENTO HUMANO","2019-01-02","APOYO","GESTION_RECURSOS","GESTION DEL TALENTO HUMANO","Ley 594 de 2000 y Archivo General de la Nación","Interno","Físico","Documentos de Archivo - electrónicos","Base de datos","Español","INFORMACIÓN PÚBLICA CLASIFICADA","N/A","SI","Decreto 103 de 2015 Artículo 18 literal a Ley 1712 de 2014","Ley 1712 de 2014","Reserva parcial","2018-11-30","80 AÑOS","Dato semiprivado","e. Mantener actualizada la historia laboral y registros de nómina de funcionarios del Ministerio/Fondo TIC."]
["436-728","INFORMACIÓN","GRUPO INTERNO DE TRABAJO DE GESTIÓN DE TALENTO HUMANO","Resolución interrupción de vacaciones","Compendio de Historia laboral de personal de planta ","GRUPO INTERNO DE TRABAJO DE GESTIÓN DE TALENTO HUMANO","2018-11-28","GRUPO INTERNO DE TRABAJO DE GESTIÓN DE TALENTO HUMANO","2019-01-02","APOYO","GESTION_RECURSOS","GESTION DEL TALENTO HUMANO","Ley 594 de 2000 y Archivo General de la Nación","Interno","Físico","Documentos de Archivo - electrónicos","Base de datos","Español","INFORMACIÓN PÚBLICA CLASIFICADA","N/A","SI","Decreto 103 de 2015 Artículo 18 literal a Ley 1712 de 2014","Ley 1712 de 2014","Reserva parcial","2018-11-30","80 AÑOS","Dato semiprivado","e. Mantener actualizada la historia laboral y registros de nómina de funcionarios del Ministerio/Fondo TIC."]
["436-729","INFORMACIÓN","GRUPO INTERNO DE TRABAJO DE GESTIÓN DE TALENTO HUMANO","Resolución aplazamiento de vacaciones","Compendio de Historia laboral de personal de planta ","GRUPO INTERNO DE TRABAJO DE GESTIÓN DE TALENTO HUMANO","2018-11-28","GRUPO INTERNO DE TRABAJO DE GESTIÓN DE TALENTO HUMANO","2019-01-02","APOYO","GESTION_RECURSOS","GESTION DEL TALENTO HUMANO","Ley 594 de 2000 y Archivo General de la Nación","Interno","Físico","Documentos de Archivo - electrónicos","Base de datos","Español","INFORMACIÓN PÚBLICA CLASIFICADA","N/A","SI","Decreto 103 de 2015 Artículo 18 literal a Ley 1712 de 2014","Ley 1712 de 2014","Reserva parcial","2018-11-30","80 AÑOS","Dato semiprivado","e. Mantener actualizada la historia laboral y registros de nómina de funcionarios del Ministerio/Fondo TIC."]
["436-730","INFORMACIÓN","GRUPO INTERNO DE TRABAJO DE GESTIÓN DE TALENTO HUMANO","Solicitud de licencias","Compendio de Historia laboral de personal de planta ","GRUPO INTERNO DE TRABAJO DE GESTIÓN DE TALENTO HUMANO","2018-11-28","GRUPO INTERNO DE TRABAJO DE GESTIÓN DE TALENTO HUMANO","2019-01-02","APOYO","GESTION_RECURSOS","GESTION DEL TALENTO HUMANO","Ley 594 de 2000 y Archivo General de la Nación","Interno","Físico","Documentos de Archivo - electrónicos","Base de datos","Español","INFORMACIÓN PÚBLICA CLASIFICADA","N/A","SI","Decreto 103 de 2015 Artículo 18 literal a Ley 1712 de 2014","Ley 1712 de 2014","Reserva parcial","2018-11-30","80 AÑOS","Dato semiprivado","e. Mantener actualizada la historia laboral y registros de nómina de funcionarios del Ministerio/Fondo TIC."]
["436-731","INFORMACIÓN","GRUPO INTERNO DE TRABAJO DE GESTIÓN DE TALENTO HUMANO","Resolución de licencias no remuneradas","Compendio de Historia laboral de personal de planta ","GRUPO INTERNO DE TRABAJO DE GESTIÓN DE TALENTO HUMANO","2018-11-28","GRUPO INTERNO DE TRABAJO DE GESTIÓN DE TALENTO HUMANO","2019-01-02","APOYO","GESTION_RECURSOS","GESTION DEL TALENTO HUMANO","Ley 594 de 2000 y Archivo General de la Nación","Interno","Físico","Documentos de Archivo - electrónicos","Base de datos","Español","INFORMACIÓN PÚBLICA CLASIFICADA","N/A","SI","Decreto 103 de 2015 Artículo 18 literal a Ley 1712 de 2014","Ley 1712 de 2014","Reserva parcial","2018-11-30","80 AÑOS","Dato semiprivado","e. Mantener actualizada la historia laboral y registros de nómina de funcionarios del Ministerio/Fondo TIC."]
["436-732","INFORMACIÓN","GRUPO INTERNO DE TRABAJO DE GESTIÓN DE TALENTO HUMANO","Incapacidades médicas","Compendio de Historia laboral de personal de planta ","GRUPO INTERNO DE TRABAJO DE GESTIÓN DE TALENTO HUMANO","2018-11-28","GRUPO INTERNO DE TRABAJO DE GESTIÓN DE TALENTO HUMANO","2019-01-02","APOYO","GESTION_RECURSOS","GESTION DEL TALENTO HUMANO","Ley 594 de 2000 y Archivo General de la Nación","Interno","Físico","Documentos de Archivo - electrónicos","Base de datos","Español","INFORMACIÓN PÚBLICA CLASIFICADA","N/A","SI","Decreto 103 de 2015 Artículo 18 literal a Ley 1712 de 2014","Ley 1712 de 2014","Reserva parcial","2018-11-30","80 AÑOS","Dato semiprivado","e. Mantener actualizada la historia laboral y registros de nómina de funcionarios del Ministerio/Fondo TIC."]
["436-733","INFORMACIÓN","GRUPO INTERNO DE TRABAJO DE GESTIÓN DE TALENTO HUMANO","Informe de accidente de trabajo","Compendio de Historia laboral de personal de planta ","GRUPO INTERNO DE TRABAJO DE GESTIÓN DE TALENTO HUMANO","2018-11-28","GRUPO INTERNO DE TRABAJO DE GESTIÓN DE TALENTO HUMANO","2019-01-02","APOYO","GESTION_RECURSOS","GESTION DEL TALENTO HUMANO","Ley 594 de 2000 y Archivo General de la Nación","Interno","Físico","Documentos de Archivo - electrónicos","Base de datos","Español","INFORMACIÓN PÚBLICA CLASIFICADA","N/A","SI","Decreto 103 de 2015 Artículo 18 literal a Ley 1712 de 2014","Ley 1712 de 2014","Reserva parcial","2018-11-30","80 AÑOS","Dato semiprivado","e. Mantener actualizada la historia laboral y registros de nómina de funcionarios del Ministerio/Fondo TIC."]
["436-734","INFORMACIÓN","GRUPO INTERNO DE TRABAJO DE GESTIÓN DE TALENTO HUMANO","Resolución por estimulos e incentivos","Compendio de Historia laboral de personal de planta ","GRUPO INTERNO DE TRABAJO DE GESTIÓN DE TALENTO HUMANO","2018-11-28","GRUPO INTERNO DE TRABAJO DE GESTIÓN DE TALENTO HUMANO","2019-01-02","APOYO","GESTION_RECURSOS","GESTION DEL TALENTO HUMANO","Ley 594 de 2000 y Archivo General de la Nación","Interno","Físico","Documentos de Archivo - electrónicos","Base de datos","Español","INFORMACIÓN PÚBLICA CLASIFICADA","N/A","SI","Decreto 103 de 2015 Artículo 18 literal a Ley 1712 de 2014","Ley 1712 de 2014","Reserva parcial","2018-11-30","80 AÑOS","Dato semiprivado","e. Mantener actualizada la historia laboral y registros de nómina de funcionarios del Ministerio/Fondo TIC."]
["436-735","INFORMACIÓN","GRUPO INTERNO DE TRABAJO DE GESTIÓN DE TALENTO HUMANO","Resolución por reconocimiento de pensión  (fondo de pensiones)","Compendio de Historia laboral de personal de planta ","GRUPO INTERNO DE TRABAJO DE GESTIÓN DE TALENTO HUMANO","2018-11-28","GRUPO INTERNO DE TRABAJO DE GESTIÓN DE TALENTO HUMANO","2019-01-02","APOYO","GESTION_RECURSOS","GESTION DEL TALENTO HUMANO","Ley 594 de 2000 y Archivo General de la Nación","Interno","Físico","Documentos de Archivo - electrónicos","Base de datos","Español","INFORMACIÓN PÚBLICA CLASIFICADA","N/A","SI","Decreto 103 de 2015 Artículo 18 literal a Ley 1712 de 2014","Ley 1712 de 2014","Reserva parcial","2018-11-30","80 AÑOS","Dato semiprivado","e. Mantener actualizada la historia laboral y registros de nómina de funcionarios del Ministerio/Fondo TIC."]
["436-736","INFORMACIÓN","GRUPO INTERNO DE TRABAJO DE GESTIÓN DE TALENTO HUMANO","Resolución de reconocimiento de indemnización sustitutiva (fondo de pensiones)","Compendio de Historia laboral de personal de planta ","GRUPO INTERNO DE TRABAJO DE GESTIÓN DE TALENTO HUMANO","2018-11-28","GRUPO INTERNO DE TRABAJO DE GESTIÓN DE TALENTO HUMANO","2019-01-02","APOYO","GESTION_RECURSOS","GESTION DEL TALENTO HUMANO","Ley 594 de 2000 y Archivo General de la Nación","Interno","Físico","Documentos de Archivo - electrónicos","Base de datos","Español","INFORMACIÓN PÚBLICA CLASIFICADA","N/A","SI","Decreto 103 de 2015 Artículo 18 literal a Ley 1712 de 2014","Ley 1712 de 2014","Reserva parcial","2018-11-30","80 AÑOS","Dato semiprivado","e. Mantener actualizada la historia laboral y registros de nómina de funcionarios del Ministerio/Fondo TIC."]
["436-737","INFORMACIÓN","GRUPO INTERNO DE TRABAJO DE GESTIÓN DE TALENTO HUMANO","Valoración de puestos de trabajo (salud ocupacional)","Compendio de Historia laboral de personal de planta ","GRUPO INTERNO DE TRABAJO DE GESTIÓN DE TALENTO HUMANO","2018-11-28","GRUPO INTERNO DE TRABAJO DE GESTIÓN DE TALENTO HUMANO","2019-01-02","APOYO","GESTION_RECURSOS","GESTION DEL TALENTO HUMANO","Ley 594 de 2000 y Archivo General de la Nación","Interno","Físico","Documentos de Archivo - electrónicos","Base de datos","Español","INFORMACIÓN PÚBLICA CLASIFICADA","N/A","SI","Decreto 103 de 2015 Artículo 18 literal a Ley 1712 de 2014","Ley 1712 de 2014","Reserva parcial","2018-11-30","80 AÑOS","Dato semiprivado","e. Mantener actualizada la historia laboral y registros de nómina de funcionarios del Ministerio/Fondo TIC."]
["436-738","INFORMACIÓN","GRUPO INTERNO DE TRABAJO DE GESTIÓN DE TALENTO HUMANO","Solicitud RTS - relación tiempo de servicio","Compendio de Historia laboral de personal de planta ","GRUPO INTERNO DE TRABAJO DE GESTIÓN DE TALENTO HUMANO","2018-11-28","GRUPO INTERNO DE TRABAJO DE GESTIÓN DE TALENTO HUMANO","2019-01-02","APOYO","GESTION_RECURSOS","GESTION DEL TALENTO HUMANO","Ley 594 de 2000 y Archivo General de la Nación","Interno","Físico","Documentos de Archivo - electrónicos","Base de datos","Español","INFORMACIÓN PÚBLICA CLASIFICADA","N/A","SI","Decreto 103 de 2015 Artículo 18 literal a Ley 1712 de 2014","Ley 1712 de 2014","Reserva parcial","2018-11-30","80 AÑOS","Dato semiprivado","e. Mantener actualizada la historia laboral y registros de nómina de funcionarios del Ministerio/Fondo TIC."]
["436-739","INFORMACIÓN","GRUPO INTERNO DE TRABAJO DE GESTIÓN DE TALENTO HUMANO","Solicitud de compensatorios","Compendio de Historia laboral de personal de planta ","GRUPO INTERNO DE TRABAJO DE GESTIÓN DE TALENTO HUMANO","2018-11-28","GRUPO INTERNO DE TRABAJO DE GESTIÓN DE TALENTO HUMANO","2019-01-02","APOYO","GESTION_RECURSOS","GESTION DEL TALENTO HUMANO","Ley 594 de 2000 y Archivo General de la Nación","Interno","Físico","Documentos de Archivo - electrónicos","Base de datos","Español","INFORMACIÓN PÚBLICA CLASIFICADA","N/A","SI","Decreto 103 de 2015 Artículo 18 literal a Ley 1712 de 2014","Ley 1712 de 2014","Reserva parcial","2018-11-30","80 AÑOS","Dato semiprivado","e. Mantener actualizada la historia laboral y registros de nómina de funcionarios del Ministerio/Fondo TIC."]
["436-740","INFORMACIÓN","GRUPO INTERNO DE TRABAJO DE GESTIÓN DE TALENTO HUMANO","Autorizaciones de permisos","Compendio de Historia laboral de personal de planta ","GRUPO INTERNO DE TRABAJO DE GESTIÓN DE TALENTO HUMANO","2018-11-28","GRUPO INTERNO DE TRABAJO DE GESTIÓN DE TALENTO HUMANO","2019-01-02","APOYO","GESTION_RECURSOS","GESTION DEL TALENTO HUMANO","Ley 594 de 2000 y Archivo General de la Nación","Interno","Físico","Documentos de Archivo - electrónicos","Base de datos","Español","INFORMACIÓN PÚBLICA CLASIFICADA","N/A","SI","Decreto 103 de 2015 Artículo 18 literal a Ley 1712 de 2014","Ley 1712 de 2014","Reserva parcial","2018-11-30","80 AÑOS","Dato semiprivado","e. Mantener actualizada la historia laboral y registros de nómina de funcionarios del Ministerio/Fondo TIC."]
["436-741","INFORMACIÓN","GRUPO INTERNO DE TRABAJO DE GESTIÓN DE TALENTO HUMANO","Clasificación tributaria","Compendio de Historia laboral de personal de planta ","GRUPO INTERNO DE TRABAJO DE GESTIÓN DE TALENTO HUMANO","2018-11-28","GRUPO INTERNO DE TRABAJO DE GESTIÓN DE TALENTO HUMANO","2019-01-02","APOYO","GESTION_RECURSOS","GESTION DEL TALENTO HUMANO","Ley 594 de 2000 y Archivo General de la Nación","Interno","Físico","Documentos de Archivo - electrónicos","Base de datos","Español","INFORMACIÓN PÚBLICA CLASIFICADA","N/A","SI","Decreto 103 de 2015 Artículo 18 literal a Ley 1712 de 2014","Ley 1712 de 2014","Reserva parcial","2018-11-30","80 AÑOS","Dato semiprivado","e. Mantener actualizada la historia laboral y registros de nómina de funcionarios del Ministerio/Fondo TIC."]
["436-742","INFORMACIÓN","GRUPO INTERNO DE TRABAJO DE GESTIÓN DE TALENTO HUMANO","Fallo de proceso disciplinario","Compendio de Historia laboral de personal de planta ","GRUPO INTERNO DE TRABAJO DE GESTIÓN DE TALENTO HUMANO","2018-11-28","GRUPO INTERNO DE TRABAJO DE CONTROL INTERNO DISCIPLINARIO","2019-01-02","APOYO","GESTION_RECURSOS","GESTION DEL TALENTO HUMANO","Ley 594 de 2000 y Archivo General de la Nación","Interno","Físico","Documentos de Archivo - electrónicos","Base de datos","Español","INFORMACIÓN PÚBLICA RESERVADA","N/A","SI","Decreto 103 de 2015 Artículo 18 literal a Ley 1712 de 2014","Ley 1712 de 2014","Reserva total","2018-11-30","80 AÑOS","Dato semiprivado","e. Mantener actualizada la historia laboral y registros de nómina de funcionarios del Ministerio/Fondo TIC."]
["436-743","INFORMACIÓN","GRUPO INTERNO DE TRABAJO DE GESTIÓN DE TALENTO HUMANO","Fallo de proceso judicial","Compendio de Historia laboral de personal de planta ","GRUPO INTERNO DE TRABAJO DE GESTIÓN DE TALENTO HUMANO","2018-11-28","GRUPO INTERNO DE TRABAJO DE CONTROL INTERNO DISCIPLINARIO","2019-01-02","APOYO","GESTION_RECURSOS","GESTION DEL TALENTO HUMANO","Ley 594 de 2000 y Archivo General de la Nación","Interno","Físico","Documentos de Archivo - electrónicos","Base de datos","Español","INFORMACIÓN PÚBLICA RESERVADA","N/A","SI","Decreto 103 de 2015 Artículo 18 literal a Ley 1712 de 2014","Ley 1712 de 2014","Reserva total","2018-11-30","80 AÑOS","Dato semiprivado","e. Mantener actualizada la historia laboral y registros de nómina de funcionarios del Ministerio/Fondo TIC."]
["436-744","INFORMACIÓN","GRUPO INTERNO DE TRABAJO DE GESTIÓN DE TALENTO HUMANO","Llamados de atención","Compendio de Historia laboral de personal de planta ","GRUPO INTERNO DE TRABAJO DE GESTIÓN DE TALENTO HUMANO","2018-11-28","GRUPO INTERNO DE TRABAJO DE GESTIÓN DE TALENTO HUMANO","2019-01-02","APOYO","GESTION_RECURSOS","GESTION DEL TALENTO HUMANO","Ley 594 de 2000 y Archivo General de la Nación","Interno","Físico","Documentos de Archivo - electrónicos","Base de datos","Español","INFORMACIÓN PÚBLICA CLASIFICADA","N/A","SI","Decreto 103 de 2015 Artículo 18 literal a Ley 1712 de 2014","Ley 1712 de 2014","Reserva parcial","2018-11-30","80 AÑOS","Dato semiprivado","e. Mantener actualizada la historia laboral y registros de nómina de funcionarios del Ministerio/Fondo TIC."]
["436-745","INFORMACIÓN","GRUPO INTERNO DE TRABAJO DE GESTIÓN DE TALENTO HUMANO","Liquidación de cesantias","Compendio de Historia laboral de personal de planta ","GRUPO INTERNO DE TRABAJO DE GESTIÓN DE TALENTO HUMANO","2018-11-28","GRUPO INTERNO DE TRABAJO DE GESTIÓN DE TALENTO HUMANO","2019-01-02","APOYO","GESTION_RECURSOS","GESTION DEL TALENTO HUMANO","Ley 594 de 2000 y Archivo General de la Nación","Interno","Físico","Documentos de Archivo - electrónicos","Base de datos","Español","INFORMACIÓN PÚBLICA CLASIFICADA","N/A","SI","Decreto 103 de 2015 Artículo 18 literal a Ley 1712 de 2014","Ley 1712 de 2014","Reserva parcial","2018-11-30","80 AÑOS","Dato semiprivado","e. Mantener actualizada la historia laboral y registros de nómina de funcionarios del Ministerio/Fondo TIC."]
["436-746","INFORMACIÓN","GRUPO INTERNO DE TRABAJO DE GESTIÓN DE TALENTO HUMANO","Informe de gestión entrega del cargo","Compendio de Historia laboral de personal de planta ","GRUPO INTERNO DE TRABAJO DE GESTIÓN DE TALENTO HUMANO","2018-11-28","GRUPO INTERNO DE TRABAJO DE GESTIÓN DE TALENTO HUMANO","2019-01-02","APOYO","GESTION_RECURSOS","GESTION DEL TALENTO HUMANO","Ley 594 de 2000 y Archivo General de la Nación","Interno","Físico","Documentos de Archivo - electrónicos","Base de datos","Español","INFORMACIÓN PÚBLICA CLASIFICADA","N/A","SI","Decreto 103 de 2015 Artículo 18 literal a Ley 1712 de 2014","Ley 1712 de 2014","Reserva parcial","2018-11-30","80 AÑOS","Dato semiprivado","e. Mantener actualizada la historia laboral y registros de nómina de funcionarios del Ministerio/Fondo TIC."]
["436-747","INFORMACIÓN","GRUPO INTERNO DE TRABAJO DE GESTIÓN DE TALENTO HUMANO","Certificado expedición bono pensional","Compendio de Historia laboral de personal de planta ","GRUPO INTERNO DE TRABAJO DE GESTIÓN DE TALENTO HUMANO","2018-11-28","GRUPO INTERNO DE TRABAJO DE GESTION PENSIONAL","2019-01-02","APOYO","GESTION_RECURSOS","GESTION DEL TALENTO HUMANO","Ley 594 de 2000 y Archivo General de la Nación","Interno","Físico","Documentos de Archivo - electrónicos","Base de datos","Español","INFORMACIÓN PÚBLICA CLASIFICADA","N/A","SI","Decreto 103 de 2015 Artículo 18 literal a Ley 1712 de 2014","Ley 1712 de 2014","Reserva parcial","2018-11-30","80 AÑOS","Dato semiprivado","e. Mantener actualizada la historia laboral y registros de nómina de funcionarios del Ministerio/Fondo TIC."]
["436-748","INFORMACIÓN","GRUPO INTERNO DE TRABAJO DE GESTIÓN DE TALENTO HUMANO","Carta de renuncia","Compendio de Historia laboral de personal de planta ","GRUPO INTERNO DE TRABAJO DE GESTIÓN DE TALENTO HUMANO","2018-11-28","GRUPO INTERNO DE TRABAJO DE GESTIÓN DE TALENTO HUMANO","2019-01-02","APOYO","GESTION_RECURSOS","GESTION DEL TALENTO HUMANO","Ley 594 de 2000 y Archivo General de la Nación","Interno","Físico","Documentos de Archivo - electrónicos","Base de datos","Español","INFORMACIÓN PÚBLICA CLASIFICADA","N/A","SI","Decreto 103 de 2015 Artículo 18 literal a Ley 1712 de 2014","Ley 1712 de 2014","Reserva parcial","2018-11-30","80 AÑOS","Dato semiprivado","e. Mantener actualizada la historia laboral y registros de nómina de funcionarios del Ministerio/Fondo TIC."]
["436-749","INFORMACIÓN","GRUPO INTERNO DE TRABAJO DE GESTIÓN DE TALENTO HUMANO","Resolución de aceptación de la renuncia","Compendio de Historia laboral de personal de planta ","GRUPO INTERNO DE TRABAJO DE GESTIÓN DE TALENTO HUMANO","2018-11-28","GRUPO INTERNO DE TRABAJO DE GESTIÓN DE TALENTO HUMANO","2019-01-02","APOYO","GESTION_RECURSOS","GESTION DEL TALENTO HUMANO","Ley 594 de 2000 y Archivo General de la Nación","Interno","Físico","Documentos de Archivo - electrónicos","Base de datos","Español","INFORMACIÓN PÚBLICA CLASIFICADA","N/A","SI","Decreto 103 de 2015 Artículo 18 literal a Ley 1712 de 2014","Ley 1712 de 2014","Reserva parcial","2018-11-30","80 AÑOS","Dato semiprivado","e. Mantener actualizada la historia laboral y registros de nómina de funcionarios del Ministerio/Fondo TIC."]
["436-750","INFORMACIÓN","GRUPO INTERNO DE TRABAJO DE GESTIÓN DE TALENTO HUMANO","Evaluaciones de desempeño y competencia","Compendio de Historia laboral de personal de planta ","GRUPO INTERNO DE TRABAJO DE GESTIÓN DE TALENTO HUMANO","2018-11-28","GRUPO INTERNO DE TRABAJO DE GESTIÓN DE TALENTO HUMANO","2019-01-02","APOYO","GESTION_RECURSOS","GESTION DEL TALENTO HUMANO","Ley 594 de 2000 y Archivo General de la Nación","Interno","Físico","Documentos de Archivo - electrónicos","Base de datos","Español","INFORMACIÓN PÚBLICA CLASIFICADA","N/A","SI","Decreto 103 de 2015 Artículo 18 literal a Ley 1712 de 2014","Ley 1712 de 2014","Reserva parcial","2018-11-30","80 AÑOS","Dato semiprivado","e. Mantener actualizada la historia laboral y registros de nómina de funcionarios del Ministerio/Fondo TIC."]
["436-751","INFORMACIÓN","GRUPO INTERNO DE TRABAJO DE GESTIÓN DE TALENTO HUMANO","Investigaciones disciplinarias","Compendio de Historia laboral de personal de planta ","GRUPO INTERNO DE TRABAJO DE GESTIÓN DE TALENTO HUMANO","2018-11-28","GRUPO INTERNO DE TRABAJO DE GESTIÓN DE TALENTO HUMANO","2019-01-02","APOYO","GESTION_RECURSOS","GESTION DEL TALENTO HUMANO","Ley 594 de 2000 y Archivo General de la Nación","Interno","Físico","Documentos de Archivo - electrónicos","Base de datos","Español","INFORMACIÓN PÚBLICA CLASIFICADA","N/A","SI","Decreto 103 de 2015 Artículo 18 literal a Ley 1712 de 2014","Ley 1712 de 2014","Reserva parcial","2018-11-30","80 AÑOS","Dato semiprivado","e. Mantener actualizada la historia laboral y registros de nómina de funcionarios del Ministerio/Fondo TIC."]
["436-752","INFORMACIÓN","GRUPO INTERNO DE TRABAJO DE GESTIÓN DE TALENTO HUMANO","Carta de supresión de cargo","Compendio de Historia laboral de personal de planta ","GRUPO INTERNO DE TRABAJO DE GESTIÓN DE TALENTO HUMANO","2018-11-28","GRUPO INTERNO DE TRABAJO DE GESTIÓN DE TALENTO HUMANO","2019-01-02","APOYO","GESTION_RECURSOS","GESTION DEL TALENTO HUMANO","Ley 594 de 2000 y Archivo General de la Nación","Interno","Físico","Documentos de Archivo - electrónicos","Base de datos","Español","INFORMACIÓN PÚBLICA CLASIFICADA","N/A","SI","Decreto 103 de 2015 Artículo 18 literal a Ley 1712 de 2014","Ley 1712 de 2014","Reserva parcial","2018-11-30","80 AÑOS","Dato semiprivado","e. Mantener actualizada la historia laboral y registros de nómina de funcionarios del Ministerio/Fondo TIC."]
["436-753","INFORMACIÓN","GRUPO INTERNO DE TRABAJO DE GESTIÓN DE TALENTO HUMANO","Resolución encargos","Compendio de Historia laboral de personal de planta ","GRUPO INTERNO DE TRABAJO DE GESTIÓN DE TALENTO HUMANO","2018-11-28","GRUPO INTERNO DE TRABAJO DE GESTIÓN DE TALENTO HUMANO","2019-01-02","APOYO","GESTION_RECURSOS","GESTION DEL TALENTO HUMANO","Ley 594 de 2000 y Archivo General de la Nación","Interno","Físico","Documentos de Archivo - electrónicos","Base de datos","Español","INFORMACIÓN PÚBLICA CLASIFICADA","N/A","SI","Decreto 103 de 2015 Artículo 18 literal a Ley 1712 de 2014","Ley 1712 de 2014","Reserva parcial","2018-11-30","80 AÑOS","Dato semiprivado","e. Mantener actualizada la historia laboral y registros de nómina de funcionarios del Ministerio/Fondo TIC."]
["436-754","INFORMACIÓN","GRUPO INTERNO DE TRABAJO DE GESTIÓN DE TALENTO HUMANO","Resolución de liquidación de prestaciones sociales","Compendio de Historia laboral de personal de planta ","GRUPO INTERNO DE TRABAJO DE GESTIÓN DE TALENTO HUMANO","2018-11-28","GRUPO INTERNO DE TRABAJO DE GESTIÓN DE TALENTO HUMANO","2019-01-02","APOYO","GESTION_RECURSOS","GESTION DEL TALENTO HUMANO","Ley 594 de 2000 y Archivo General de la Nación","Interno","Físico","Documentos de Archivo - electrónicos","Base de datos","Español","INFORMACIÓN PÚBLICA CLASIFICADA","N/A","SI","Decreto 103 de 2015 Artículo 18 literal a Ley 1712 de 2014","Ley 1712 de 2014","Reserva parcial","2018-11-30","80 AÑOS","Dato semiprivado","e. Mantener actualizada la historia laboral y registros de nómina de funcionarios del Ministerio/Fondo TIC."]
["436-755","INFORMACIÓN","GRUPO INTERNO DE TRABAJO DE GESTIÓN DE TALENTO HUMANO","Resolución de indemnización","Compendio de Historia laboral de personal de planta ","GRUPO INTERNO DE TRABAJO DE GESTIÓN DE TALENTO HUMANO","2018-11-28","GRUPO INTERNO DE TRABAJO DE GESTIÓN DE TALENTO HUMANO","2019-01-02","APOYO","GESTION_RECURSOS","GESTION DEL TALENTO HUMANO","Ley 594 de 2000 y Archivo General de la Nación","Interno","Físico","Documentos de Archivo - electrónicos","Base de datos","Español","INFORMACIÓN PÚBLICA CLASIFICADA","N/A","SI","Decreto 103 de 2015 Artículo 18 literal a Ley 1712 de 2014","Ley 1712 de 2014","Reserva parcial","2018-11-30","80 AÑOS","Dato semiprivado","e. Mantener actualizada la historia laboral y registros de nómina de funcionarios del Ministerio/Fondo TIC."]
["436-756","INFORMACIÓN","GRUPO INTERNO DE TRABAJO DE GESTIÓN DE TALENTO HUMANO","Resolución de comisión de servicios","Compendio de Historia laboral de personal de planta ","GRUPO INTERNO DE TRABAJO DE GESTIÓN DE TALENTO HUMANO","2018-11-28","GRUPO INTERNO DE TRABAJO DE GESTIÓN DE TALENTO HUMANO","2019-01-02","APOYO","GESTION_RECURSOS","GESTION DEL TALENTO HUMANO","Ley 594 de 2000 y Archivo General de la Nación","Interno","Físico","Documentos de Archivo - electrónicos","Base de datos","Español","INFORMACIÓN PÚBLICA CLASIFICADA","N/A","SI","Decreto 103 de 2015 Artículo 18 literal a Ley 1712 de 2014","Ley 1712 de 2014","Reserva parcial","2018-11-30","80 AÑOS","Dato semiprivado","e. Mantener actualizada la historia laboral y registros de nómina de funcionarios del Ministerio/Fondo TIC."]
["436-757","INFORMACIÓN","GRUPO INTERNO DE TRABAJO DE GESTIÓN DE TALENTO HUMANO","Paz y salvo","Compendio de Historia laboral de personal de planta ","GRUPO INTERNO DE TRABAJO DE GESTIÓN DE TALENTO HUMANO","2018-11-28","GRUPO INTERNO DE TRABAJO DE GESTIÓN DE TALENTO HUMANO","2019-01-02","APOYO","GESTION_RECURSOS","GESTION DEL TALENTO HUMANO","Ley 594 de 2000 y Archivo General de la Nación","Interno","Físico","Documentos de Archivo - electrónicos","Base de datos","Español","INFORMACIÓN PÚBLICA CLASIFICADA","N/A","SI","Decreto 103 de 2015 Artículo 18 literal a Ley 1712 de 2014","Ley 1712 de 2014","Reserva parcial","2018-11-30","80 AÑOS","Dato semiprivado","e. Mantener actualizada la historia laboral y registros de nómina de funcionarios del Ministerio/Fondo TIC."]
["436-758","INFORMACIÓN","GRUPO INTERNO DE TRABAJO DE GESTIÓN DE TALENTO HUMANO","Solicitud de crédito fondo nacional del ahorro","Compendio de Historia laboral de personal de planta ","GRUPO INTERNO DE TRABAJO DE GESTIÓN DE TALENTO HUMANO","2018-11-28","GRUPO INTERNO DE TRABAJO DE GESTIÓN DE TALENTO HUMANO","2019-01-02","APOYO","GESTION_RECURSOS","GESTION DEL TALENTO HUMANO","Ley 594 de 2000 y Archivo General de la Nación","Interno","Físico","Documentos de Archivo - electrónicos","Base de datos","Español","INFORMACIÓN PÚBLICA CLASIFICADA","N/A","SI","Decreto 103 de 2015 Artículo 18 literal a Ley 1712 de 2014","Ley 1712 de 2014","Reserva parcial","2018-11-30","80 AÑOS","Dato semiprivado","e. Mantener actualizada la historia laboral y registros de nómina de funcionarios del Ministerio/Fondo TIC."]
["436-759","INFORMACIÓN","GRUPO INTERNO DE TRABAJO DE GESTIÓN DE TALENTO HUMANO","Novedades fondo de pensiones","Compendio de Historia laboral de personal de planta ","GRUPO INTERNO DE TRABAJO DE GESTIÓN DE TALENTO HUMANO","2018-11-28","GRUPO INTERNO DE TRABAJO DE GESTIÓN DE TALENTO HUMANO","2019-01-02","APOYO","GESTION_RECURSOS","GESTION DEL TALENTO HUMANO","Ley 594 de 2000 y Archivo General de la Nación","Interno","Físico","Documentos de Archivo - electrónicos","Base de datos","Español","INFORMACIÓN PÚBLICA CLASIFICADA","N/A","SI","Decreto 103 de 2015 Artículo 18 literal a Ley 1712 de 2014","Ley 1712 de 2014","Reserva parcial","2018-11-30","80 AÑOS","Dato semiprivado","e. Mantener actualizada la historia laboral y registros de nómina de funcionarios del Ministerio/Fondo TIC."]
["436-760","INFORMACIÓN","GRUPO INTERNO DE TRABAJO DE GESTIÓN DE TALENTO HUMANO","Solicitud de permiso","Compendio de Historia laboral de personal de planta ","GRUPO INTERNO DE TRABAJO DE GESTIÓN DE TALENTO HUMANO","2018-11-28","GRUPO INTERNO DE TRABAJO DE GESTIÓN DE TALENTO HUMANO","2019-01-02","APOYO","GESTION_RECURSOS","GESTION DEL TALENTO HUMANO","Ley 594 de 2000 y Archivo General de la Nación","Interno","Físico","Documentos de Archivo - electrónicos","Base de datos","Español","INFORMACIÓN PÚBLICA CLASIFICADA","N/A","SI","Decreto 103 de 2015 Artículo 18 literal a Ley 1712 de 2014","Ley 1712 de 2014","Reserva parcial","2018-11-30","80 AÑOS","Dato semiprivado","e. Mantener actualizada la historia laboral y registros de nómina de funcionarios del Ministerio/Fondo TIC."]
["436-761","INFORMACIÓN","GRUPO INTERNO DE TRABAJO DE GESTIÓN DE TALENTO HUMANO","Permisos superiores a 3 días","Compendio de Historia laboral de personal de planta ","GRUPO INTERNO DE TRABAJO DE GESTIÓN DE TALENTO HUMANO","2018-11-28","GRUPO INTERNO DE TRABAJO DE GESTIÓN DE TALENTO HUMANO","2019-01-02","APOYO","GESTION_RECURSOS","GESTION DEL TALENTO HUMANO","Ley 594 de 2000 y Archivo General de la Nación","Interno","Físico","Documentos de Archivo - electrónicos","Base de datos","Español","INFORMACIÓN PÚBLICA CLASIFICADA","N/A","SI","Decreto 103 de 2015 Artículo 18 literal a Ley 1712 de 2014","Ley 1712 de 2014","Reserva parcial","2018-11-30","80 AÑOS","Dato semiprivado","e. Mantener actualizada la historia laboral y registros de nómina de funcionarios del Ministerio/Fondo TIC."]
["436-762","INFORMACIÓN","GRUPO INTERNO DE TRABAJO DE GESTIÓN DE TALENTO HUMANO","Solicitud","Recibida la petición interpuesta por el usuario se tramite conforme lo establece la Ley 1755 de 2015","GRUPO INTERNO DE TRABAJO DE GESTIÓN DE TALENTO HUMANO","2018-11-28","GRUPO INTERNO DE TRABAJO DE GESTIÓN DE TALENTO HUMANO","2019-01-02","APOYO","GESTION_RECURSOS","GESTION DEL TALENTO HUMANO","Ley 1755 de 2015, por medio de la cual se regula el Derecho Fundamental de Petición y se sustituye un título del Código de Procedimiento Administrativo y de lo Contencioso Administrativo.","Interno","Físico","Documentos de Archivo - electrónicos","Base de datos","Español","INFORMACIÓN PÚBLICA","N/A","N/A","N/A","N/A","N/A","N/A","N/A","Dato personal privado ","f. Atender y resolver peticiones, quejas, reclamos y sugerencias."]
["436-763","INFORMACIÓN","GRUPO INTERNO DE TRABAJO DE GESTIÓN DE TALENTO HUMANO","Respuesta y/o trámite","Recibida la petición interpuesta por el usuario se tramite conforme lo establece la Ley 1755 de 2015","GRUPO INTERNO DE TRABAJO DE GESTIÓN DE TALENTO HUMANO","2018-11-28","GRUPO INTERNO DE TRABAJO DE GESTIÓN DE TALENTO HUMANO","2019-01-02","APOYO","GESTION_RECURSOS","GESTION DEL TALENTO HUMANO","Ley 1755 de 2015, por medio de la cual se regula el Derecho Fundamental de Petición y se sustituye un título del Código de Procedimiento Administrativo y de lo Contencioso Administrativo.","Interno","Físico","Documentos de Archivo - electrónicos","Base de datos","Español","INFORMACIÓN PÚBLICA","N/A","N/A","N/A","N/A","N/A","N/A","N/A","Dato personal privado ","f. Atender y resolver peticiones, quejas, reclamos y sugerencias."]
["436-764","INFORMACIÓN","GRUPO INTERNO DE TRABAJO DE GESTIÓN DE TALENTO HUMANO","Plan","Registro de los planes de seguridad y salud en el trabajo ","GRUPO INTERNO DE TRABAJO DE GESTIÓN DE TALENTO HUMANO","2018-11-28","GRUPO INTERNO DE TRABAJO DE GESTIÓN DE TALENTO HUMANO","2019-01-02","APOYO","GESTION_RECURSOS","GESTION DEL TALENTO HUMANO"," Decreto 1072 de 2015, resolución 1111 de 2017 y ley 1562 de 2012","Interno","Físico","Documentos de Archivo - electrónicos","Base de datos","Español","INFORMACIÓN PÚBLICA","https://www.mintic.gov.co/portal/inicio/72779:3-8-Gestion-del-Talento-Humano","N/A","N/A","N/A","N/A","N/A","N/A","N/A","N/A"]
["436-765","INFORMACIÓN","GRUPO INTERNO DE TRABAJO DE GESTIÓN DE TALENTO HUMANO","Cronograma de actividades","Registro de los planes de seguridad y salud en el trabajo ","GRUPO INTERNO DE TRABAJO DE GESTIÓN DE TALENTO HUMANO","2018-11-28","GRUPO INTERNO DE TRABAJO DE GESTIÓN DE TALENTO HUMANO","2019-01-02","APOYO","GESTION_RECURSOS","GESTION DEL TALENTO HUMANO"," Decreto 1072 de 2015, resolución 1111 de 2017 y ley 1562 de 2012","Interno","Físico","Documentos de Archivo - electrónicos","Base de datos","Español","INFORMACIÓN PÚBLICA","https://www.mintic.gov.co/portal/inicio/72779:3-8-Gestion-del-Talento-Humano","N/A","N/A","N/A","N/A","N/A","N/A","N/A","N/A"]
["436-766","INFORMACIÓN","GRUPO INTERNO DE TRABAJO DE GESTIÓN DE TALENTO HUMANO","Matriz de peligros","Registro de los planes de seguridad y salud en el trabajo ","GRUPO INTERNO DE TRABAJO DE GESTIÓN DE TALENTO HUMANO","2018-11-28","GRUPO INTERNO DE TRABAJO DE GESTIÓN DE TALENTO HUMANO","2019-01-02","APOYO","GESTION_RECURSOS","GESTION DEL TALENTO HUMANO"," Decreto 1072 de 2015, resolución 1111 de 2017 y ley 1562 de 2012","Interno","Físico","Documentos de Archivo - electrónicos","Base de datos","Español","INFORMACIÓN PÚBLICA","https://www.mintic.gov.co/portal/inicio/72779:3-8-Gestion-del-Talento-Humano","N/A","N/A","N/A","N/A","N/A","N/A","N/A","N/A"]
["436-767","INFORMACIÓN","GRUPO INTERNO DE TRABAJO DE GESTIÓN DE TALENTO HUMANO","Política de seguridad y salud en el trabajo","Registro de los planes de seguridad y salud en el trabajo ","GRUPO INTERNO DE TRABAJO DE GESTIÓN DE TALENTO HUMANO","2018-11-28","GRUPO INTERNO DE TRABAJO DE GESTIÓN DE TALENTO HUMANO","2019-01-02","APOYO","GESTION_RECURSOS","GESTION DEL TALENTO HUMANO"," Decreto 1072 de 2015, resolución 1111 de 2017 y ley 1562 de 2012","Interno","Físico","Documentos de Archivo - electrónicos","Base de datos","Español","INFORMACIÓN PÚBLICA","https://www.mintic.gov.co/portal/inicio/72779:3-8-Gestion-del-Talento-Humano","N/A","N/A","N/A","N/A","N/A","N/A","N/A","N/A"]
["436-768","INFORMACIÓN","GRUPO INTERNO DE TRABAJO DE GESTIÓN DE TALENTO HUMANO","Manual del sistema de gestión","Registro de los planes de seguridad y salud en el trabajo ","GRUPO INTERNO DE TRABAJO DE GESTIÓN DE TALENTO HUMANO","2018-11-28","GRUPO INTERNO DE TRABAJO DE GESTIÓN DE TALENTO HUMANO","2019-01-02","APOYO","GESTION_RECURSOS","GESTION DEL TALENTO HUMANO"," Decreto 1072 de 2015, resolución 1111 de 2017 y ley 1562 de 2012","Interno","Físico","Documentos de Archivo - electrónicos","Base de datos","Español","INFORMACIÓN PÚBLICA","https://www.mintic.gov.co/portal/inicio/72779:3-8-Gestion-del-Talento-Humano","N/A","N/A","N/A","N/A","N/A","N/A","N/A","N/A"]
["436-769","INFORMACIÓN","GRUPO INTERNO DE TRABAJO DE GESTIÓN DE TALENTO HUMANO","Consolidado de reporte y accidente de trabajo","Registro de los planes de seguridad y salud en el trabajo ",{"$f":"IF(C776=\"\",\"\",C776)","v":"GRUPO INTERNO DE TRABAJO DE GESTIÓN DE TALENTO HUMANO"},"2018-11-28","GRUPO INTERNO DE TRABAJO DE GESTIÓN DE TALENTO HUMANO","2019-01-02","APOYO","GESTION_RECURSOS","GESTION DEL TALENTO HUMANO"," Decreto 1072 de 2015, resolución 1111 de 2017 y ley 1562 de 2012","Interno","Físico","Documentos de Archivo - electrónicos","Base de datos","Español","INFORMACIÓN PÚBLICA","https://www.mintic.gov.co/portal/inicio/72779:3-8-Gestion-del-Talento-Humano","N/A","N/A","N/A","N/A","N/A","N/A","N/A","N/A"]
["436-770","INFORMACIÓN","GRUPO INTERNO DE TRABAJO DE GESTIÓN DE TALENTO HUMANO","Solicitudes y respuestas de EPS y ARL","Registro de los planes de seguridad y salud en el trabajo ","GRUPO INTERNO DE TRABAJO DE GESTIÓN DE TALENTO HUMANO","2018-11-28","GRUPO INTERNO DE TRABAJO DE GESTIÓN DE TALENTO HUMANO","2019-01-02","APOYO","GESTION_RECURSOS","GESTION DEL TALENTO HUMANO"," Decreto 1072 de 2015, resolución 1111 de 2017 y ley 1562 de 2012","Interno","Físico","Documentos de Archivo - electrónicos","Base de datos","Español","INFORMACIÓN PÚBLICA","https://www.mintic.gov.co/portal/inicio/72779:3-8-Gestion-del-Talento-Humano","N/A","N/A","N/A","N/A","N/A","N/A","N/A","N/A"]
["436-771","INFORMACIÓN","GRUPO INTERNO DE TRABAJO DE GESTIÓN DE TALENTO HUMANO","Actividades de prevención y divulgación","Registro de los planes de seguridad y salud en el trabajo ","GRUPO INTERNO DE TRABAJO DE GESTIÓN DE TALENTO HUMANO","2018-11-28","GRUPO INTERNO DE TRABAJO DE GESTIÓN DE TALENTO HUMANO","2019-01-02","APOYO","GESTION_RECURSOS","GESTION DEL TALENTO HUMANO"," Decreto 1072 de 2015, resolución 1111 de 2017 y ley 1562 de 2012","Interno","Físico","Documentos de Archivo - electrónicos","Base de datos","Español","INFORMACIÓN PÚBLICA","https://www.mintic.gov.co/portal/inicio/72779:3-8-Gestion-del-Talento-Humano","N/A","N/A","N/A","N/A","N/A","N/A","N/A","N/A"]
["436-772","INFORMACIÓN","GRUPO INTERNO DE TRABAJO DE GESTIÓN DE TALENTO HUMANO","Programa","Información de los programas de Capacitación, Bienestar, Incentivos, Seguridad y Salud en el Trabajo","GRUPO INTERNO DE TRABAJO DE GESTIÓN DE TALENTO HUMANO","2018-11-28","GRUPO INTERNO DE TRABAJO DE GESTIÓN DE TALENTO HUMANO","2019-01-02","APOYO","GESTION_RECURSOS","GESTION DEL TALENTO HUMANO","Decreto Ley 1567 de 1998","Interno","Físico","Documentos de Archivo - electrónicos","Base de datos","Español","INFORMACIÓN PÚBLICA","https://www.mintic.gov.co/portal/inicio/72779:3-8-Gestion-del-Talento-Humano","N/A","N/A","N/A","N/A","N/A","N/A","N/A","N/A"]
["436-773","INFORMACIÓN","GRUPO INTERNO DE TRABAJO DE GESTIÓN DE TALENTO HUMANO","Diagnóstico de necesidades","Información de los programas de Capacitación, Bienestar, Incentivos, Seguridad y Salud en el Trabajo","GRUPO INTERNO DE TRABAJO DE GESTIÓN DE TALENTO HUMANO","2018-11-28","GRUPO INTERNO DE TRABAJO DE GESTIÓN DE TALENTO HUMANO","2019-01-02","APOYO","GESTION_RECURSOS","GESTION DEL TALENTO HUMANO","Decreto Ley 1567 de 1998","Interno","Físico","Documentos de Archivo - electrónicos","Base de datos","Español","INFORMACIÓN PÚBLICA","https://www.mintic.gov.co/portal/inicio/72779:3-8-Gestion-del-Talento-Humano","N/A","N/A","N/A","N/A","N/A","N/A","N/A","N/A"]
["436-774","INFORMACIÓN","GRUPO INTERNO DE TRABAJO DE GESTIÓN DE TALENTO HUMANO","Consolidado de necesidades","Información de los programas de Capacitación, Bienestar, Incentivos, Seguridad y Salud en el Trabajo","GRUPO INTERNO DE TRABAJO DE GESTIÓN DE TALENTO HUMANO","2018-11-28","GRUPO INTERNO DE TRABAJO DE GESTIÓN DE TALENTO HUMANO","2019-01-02","APOYO","GESTION_RECURSOS","GESTION DEL TALENTO HUMANO","Decreto Ley 1567 de 1998","Interno","Físico","Documentos de Archivo - electrónicos","Base de datos","Español","INFORMACIÓN PÚBLICA","https://www.mintic.gov.co/portal/inicio/72779:3-8-Gestion-del-Talento-Humano","N/A","N/A","N/A","N/A","N/A","N/A","N/A","N/A"]
["436-775","INFORMACIÓN","GRUPO INTERNO DE TRABAJO DE GESTIÓN DE TALENTO HUMANO","Propuestas","Información de los programas de Capacitación, Bienestar, Incentivos, Seguridad y Salud en el Trabajo","GRUPO INTERNO DE TRABAJO DE GESTIÓN DE TALENTO HUMANO","2018-11-28","GRUPO INTERNO DE TRABAJO DE GESTIÓN DE TALENTO HUMANO","2019-01-02","APOYO","GESTION_RECURSOS","GESTION DEL TALENTO HUMANO","Decreto Ley 1567 de 1998","Interno","Físico","Documentos de Archivo - electrónicos","Base de datos","Español","INFORMACIÓN PÚBLICA","https://www.mintic.gov.co/portal/inicio/72779:3-8-Gestion-del-Talento-Humano","N/A","N/A","N/A","N/A","N/A","N/A","N/A","N/A"]
["436-776","INFORMACIÓN","GRUPO INTERNO DE TRABAJO DE GESTIÓN DE TALENTO HUMANO","Acta de aprobación de bienestar y capacitación","Información de los programas de Capacitación, Bienestar, Incentivos, Seguridad y Salud en el Trabajo","GRUPO INTERNO DE TRABAJO DE GESTIÓN DE TALENTO HUMANO","2018-11-28","GRUPO INTERNO DE TRABAJO DE GESTIÓN DE TALENTO HUMANO","2019-01-02","APOYO","GESTION_RECURSOS","GESTION DEL TALENTO HUMANO","Decreto Ley 1567 de 1998","Interno","Físico","Documentos de Archivo - electrónicos","Base de datos","Español","INFORMACIÓN PÚBLICA","https://www.mintic.gov.co/portal/inicio/72779:3-8-Gestion-del-Talento-Humano","N/A","N/A","N/A","N/A","N/A","N/A","N/A","N/A"]
["436-777","INFORMACIÓN","GRUPO INTERNO DE TRABAJO DE GESTIÓN DE TALENTO HUMANO","Divulgación de los planes","Información de los programas de Capacitación, Bienestar, Incentivos, Seguridad y Salud en el Trabajo","GRUPO INTERNO DE TRABAJO DE GESTIÓN DE TALENTO HUMANO","2018-11-28","GRUPO INTERNO DE TRABAJO DE GESTIÓN DE TALENTO HUMANO","2019-01-02","APOYO","GESTION_RECURSOS","GESTION DEL TALENTO HUMANO","Decreto Ley 1567 de 1998","Interno","Físico","Documentos de Archivo - electrónicos","Base de datos","Español","INFORMACIÓN PÚBLICA","https://www.mintic.gov.co/portal/inicio/72779:3-8-Gestion-del-Talento-Humano","N/A","N/A","N/A","N/A","N/A","N/A","N/A","N/A"]
["436-778","INFORMACIÓN","GRUPO INTERNO DE TRABAJO DE GESTIÓN DE TALENTO HUMANO","Otras actividades de capacitación","Información de los programas de Capacitación, Bienestar, Incentivos, Seguridad y Salud en el Trabajo","GRUPO INTERNO DE TRABAJO DE GESTIÓN DE TALENTO HUMANO","2018-11-28","GRUPO INTERNO DE TRABAJO DE GESTIÓN DE TALENTO HUMANO","2019-01-02","APOYO","GESTION_RECURSOS","GESTION DEL TALENTO HUMANO","Decreto Ley 1567 de 1998","Interno","Físico","Documentos de Archivo - electrónicos","Base de datos","Español","INFORMACIÓN PÚBLICA","https://www.mintic.gov.co/portal/inicio/72779:3-8-Gestion-del-Talento-Humano","N/A","N/A","N/A","N/A","N/A","N/A","N/A","N/A"]
["436-779","INFORMACIÓN","GRUPO INTERNO DE TRABAJO DE GESTIÓN DE TALENTO HUMANO","Otras actividades de bienestar y salud en el trabajo","Información de los programas de Capacitación, Bienestar, Incentivos, Seguridad y Salud en el Trabajo","GRUPO INTERNO DE TRABAJO DE GESTIÓN DE TALENTO HUMANO","2018-11-28","GRUPO INTERNO DE TRABAJO DE GESTIÓN DE TALENTO HUMANO","2019-01-02","APOYO","GESTION_RECURSOS","GESTION DEL TALENTO HUMANO","Decreto Ley 1567 de 1998","Interno","Físico","Documentos de Archivo - electrónicos","Base de datos","Español","INFORMACIÓN PÚBLICA","https://www.mintic.gov.co/portal/inicio/72779:3-8-Gestion-del-Talento-Humano","N/A","N/A","N/A","N/A","N/A","N/A","N/A","N/A"]
["436-780","INFORMACIÓN","GRUPO INTERNO DE TRABAJO DE GESTIÓN DE TALENTO HUMANO","Impacto de la capacitación","Información de los programas de Capacitación, Bienestar, Incentivos, Seguridad y Salud en el Trabajo","GRUPO INTERNO DE TRABAJO DE GESTIÓN DE TALENTO HUMANO","2018-11-28","GRUPO INTERNO DE TRABAJO DE GESTIÓN DE TALENTO HUMANO","2019-01-02","APOYO","GESTION_RECURSOS","GESTION DEL TALENTO HUMANO","Decreto Ley 1567 de 1998","Interno","Físico","Documentos de Archivo - electrónicos","Base de datos","Español","INFORMACIÓN PÚBLICA","https://www.mintic.gov.co/portal/inicio/72779:3-8-Gestion-del-Talento-Humano","N/A","N/A","N/A","N/A","N/A","N/A","N/A","N/A"]
["436-781","INFORMACIÓN","GRUPO INTERNO DE TRABAJO DE GESTIÓN DE TALENTO HUMANO","Informe de resultados de impacto","Información de los programas de Capacitación, Bienestar, Incentivos, Seguridad y Salud en el Trabajo","GRUPO INTERNO DE TRABAJO DE GESTIÓN DE TALENTO HUMANO","2018-11-28","GRUPO INTERNO DE TRABAJO DE GESTIÓN DE TALENTO HUMANO","2019-01-02","APOYO","GESTION_RECURSOS","GESTION DEL TALENTO HUMANO","Decreto Ley 1567 de 1998","Interno","Físico","Documentos de Archivo - electrónicos","Base de datos","Español","INFORMACIÓN PÚBLICA","https://www.mintic.gov.co/portal/inicio/72779:3-8-Gestion-del-Talento-Humano","N/A","N/A","N/A","N/A","N/A","N/A","N/A","N/A"]
["436-782","INFORMACIÓN","GRUPO INTERNO DE TRABAJO DE GESTIÓN DE TALENTO HUMANO","Programa","Información del programa de incentivos","GRUPO INTERNO DE TRABAJO DE GESTIÓN DE TALENTO HUMANO","2018-11-28","GRUPO INTERNO DE TRABAJO DE GESTIÓN DE TALENTO HUMANO","2019-01-02","APOYO","GESTION_RECURSOS","GESTION DEL TALENTO HUMANO","Decreto Ley 1567 de 1998","Interno","Físico","Documentos de Archivo - electrónicos","Base de datos","Español","INFORMACIÓN PÚBLICA","https://www.mintic.gov.co/portal/inicio/72779:3-8-Gestion-del-Talento-Humano","N/A","N/A","N/A","N/A","N/A","N/A","N/A","N/A"]
["436-783","INFORMACIÓN","GRUPO INTERNO DE TRABAJO DE GESTIÓN DE TALENTO HUMANO","Evidencias de selección de los mejores servidores por desempeño","Información del programa de incentivos","GRUPO INTERNO DE TRABAJO DE GESTIÓN DE TALENTO HUMANO","2018-11-28","GRUPO INTERNO DE TRABAJO DE GESTIÓN DE TALENTO HUMANO","2019-01-02","APOYO","GESTION_RECURSOS","GESTION DEL TALENTO HUMANO","Decreto Ley 1567 de 1998","Interno","Físico","Documentos de Archivo - electrónicos","Base de datos","Español","INFORMACIÓN PÚBLICA","https://www.mintic.gov.co/portal/inicio/72779:3-8-Gestion-del-Talento-Humano","N/A","N/A","N/A","N/A","N/A","N/A","N/A","N/A"]
["436-784","INFORMACIÓN","GRUPO INTERNO DE TRABAJO DE GESTIÓN DE TALENTO HUMANO","Evidencias de selección de los mejores equipos de trabajo","Información del programa de incentivos","GRUPO INTERNO DE TRABAJO DE GESTIÓN DE TALENTO HUMANO","2018-11-28","GRUPO INTERNO DE TRABAJO DE GESTIÓN DE TALENTO HUMANO","2019-01-02","APOYO","GESTION_RECURSOS","GESTION DEL TALENTO HUMANO","Decreto Ley 1567 de 1998","Interno","Físico","Documentos de Archivo - electrónicos","Base de datos","Español","INFORMACIÓN PÚBLICA","https://www.mintic.gov.co/portal/inicio/72779:3-8-Gestion-del-Talento-Humano","N/A","N/A","N/A","N/A","N/A","N/A","N/A","N/A"]
["436-785","INFORMACIÓN","GRUPO INTERNO DE TRABAJO DE GESTIÓN DE TALENTO HUMANO","Evidencias de selección de los compañeros destacados","Información del programa de incentivos","GRUPO INTERNO DE TRABAJO DE GESTIÓN DE TALENTO HUMANO","2018-11-28","GRUPO INTERNO DE TRABAJO DE GESTIÓN DE TALENTO HUMANO","2019-01-02","APOYO","GESTION_RECURSOS","GESTION DEL TALENTO HUMANO","Decreto Ley 1567 de 1998","Interno","Físico","Documentos de Archivo - electrónicos","Base de datos","Español","INFORMACIÓN PÚBLICA","https://www.mintic.gov.co/portal/inicio/72779:3-8-Gestion-del-Talento-Humano","N/A","N/A","N/A","N/A","N/A","N/A","N/A","N/A"]
["437-786","INFORMACIÓN","GRUPO INTERNO DE TRABAJO DE GESTION PENSIONAL","CERTIFICACION ","LOS DOCUMENTOS CONTENIDOS EN LA AGRUPACIÓN DOCUMENTAL POSEEN CUALIDADES PROPIAS Y CARACTERÍSTICAS ÚNICAS DE LA ENTIDAD, PERO ADEMÁS SON DOCUMENTOS ESENCIALES PARA LOS PROCESOS PENSIONALES DE FUNCIONARIO Y EXFUNCIONARIOS DEL MINISTERIO Y LAS ENTIDADES LIQUIDADAS DE LAS TELECOMUNICADAS DE LA EXTINTA CAPRECOM, ADEMÁS PUEDE SER UN INSUMO ADECUADO PARA INVESTIGACIONES HISTÓRICAS, DEBE CONSERVARSE EN SU TOTALIDAD Y SER TRANSFERIDO UNA VEZ TERMINEN LOS TIEMPOS DE RETENCIÓN AL ARCHIVO HISTÓRICO DE LA NACIÓN","GRUPO INTERNO DE TRABAJO DE GESTION PENSIONAL","2018-11-28","GRUPO INTERNO DE TRABAJO DE FORTALECIMIENTO DE LAS RELACIONES CON LOS GRUPOS DE INTERES","2019-01-02","APOYO","GESTION_RECURSOS","GESTION DEL TALENTO HUMANO","CIRCULAR CONJUNTA No.13 de 2007 EXPEDIDA POR EL MINISTERIO DE HACIENDA Y CREDITO PUBLICO","Interno","Físico","Archivos Institucionales - físicos","papel","Español","INFORMACIÓN PÚBLICA CLASIFICADA","ARCHIVO","SI","CIRCULAR CONJUNTA No.13 de 2007 EXPEDIDA POR EL MINISTERIO DE HACIENDA Y CREDITO PUBLICO","TODA LA INFORMACION QUE SEA DE UN TERCERO NO SE PUBLICA","Sin reserva","2018-11-28",5,"Dato personal privado ","f. Atender y resolver peticiones, quejas, reclamos y sugerencias."]
["437-787","INFORMACIÓN","GRUPO INTERNO DE TRABAJO DE GESTION PENSIONAL"," CERTIFICACION PARA BONO PENSIONAL Y PENSIONES","LOS DOCUMENTOS CONTENIDOS EN LA AGRUPACIÓN DOCUMENTAL POSEEN CUALIDADES PROPIAS Y CARACTERÍSTICAS UNICAS DE LA ENTIDAD, PERO ADEMÁS SON DOCUMENTOS ESENCIALES PARA LOS PROCESOS PENSIONALES DE FUNCIONARIO Y EXFUNCIONARIOS DEL MINISTERIO Y LAS ENTIDADES LIQUIDADAS DE LAS TELECOMUNICADAS DE LA EXTINTA CAPRECOM, ADEMÁS PUEDE SER UN INSUMO ADECUADO PARA INVESTIGACIONES HISTÓRICAS, DEBE CONSERVARSE EN SU TOTALIDAD Y SER TRANSFERIDO UNA VEZ TERMINEN LOS TIEMPOS DE RETENCIÓN AL ARCHIVO HISTÓRICO DE LA NACIÓN","GRUPO INTERNO DE TRABAJO DE GESTION PENSIONAL","2018-11-28","GRUPO INTERNO DE TRABAJO DE FORTALECIMIENTO DE LAS RELACIONES CON LOS GRUPOS DE INTERES","2019-01-02","APOYO","GESTION_RECURSOS","GESTION DEL TALENTO HUMANO","CIRCULAR CONJUNTA No.13 de 2007 EXPEDIDA POR EL MINISTERIO DE HACIENDA Y CREDITO PUBLICO","Interno","Físico","Archivos Institucionales - físicos","Papel","Español","INFORMACIÓN PÚBLICA CLASIFICADA","ARCHIVO","SI","CIRCULAR CONJUNTA No.13 de 2007 EXPEDIDA POR EL MINISTERIO DE HACIENDA Y CREDITO PUBLICO","TODA LA INFORMACION QUE SEA DE UN TERCERO NO SE PUBLICA","Sin reserva","2018-11-28",5,"Dato personal privado ","f. Atender y resolver peticiones, quejas, reclamos y sugerencias."]
["437-788","INFORMACIÓN","GRUPO INTERNO DE TRABAJO DE GESTION PENSIONAL","REQUERIMIENTOS PARA RECONOCER BONO PENSIONAL Y CUOTA PARTE PENSIONAL","LOS DOCUMENTOS CONTENIDOS EN LA AGRUPACIÓN DOCUMENTAL POSEEN CUALIDADES PROPIAS Y CARACTERÍSTICAS UNICAS DE LA ENTIDAD, PERO ADEMÁS SON DOCUMENTOS ESENCIALES PARA LOS PROCESOS PENSIONALES DE FUNCIONARIO Y EXFUNCIONARIOS DEL MINISTERIO Y LAS ENTIDADES LIQUIDADAS DE LAS TELECOMUNICADAS DE LA EXTINTA CAPRECOM, ADEMÁS PUEDE SER UN INSUMO ADECUADO PARA INVESTIGACIONES HISTÓRICAS, DEBE CONSERVARSE EN SU TOTALIDAD Y SER TRANSFERIDO UNA VEZ TERMINEN LOS TIEMPOS DE RETENCIÓN AL ARCHIVO HISTÓRICO DE LA NACIÓN","GRUPO INTERNO DE TRABAJO DE GESTION PENSIONAL","2018-11-28","GRUPO INTERNO DE TRABAJO DE FORTALECIMIENTO DE LAS RELACIONES CON LOS GRUPOS DE INTERES","2019-01-02","APOYO","GESTION_RECURSOS","GESTION DEL TALENTO HUMANO","DECRETO 1748 DE 1995, DECRETO 3798 DE 2003, DECRETO 1513 DE 1998, DECFRETO 1414 DE 2018","Interno","Físico","Archivos Institucionales - físicos","Papel","Español","INFORMACIÓN PÚBLICA CLASIFICADA","ARCHIVO","SI","CIRCULAR CONJUNTA No.13 de 2007 EXPEDIDA POR EL MINISTERIO DE HACIENDA Y CREDITO PUBLICO","TODA LA INFORMACION QUE SEA DE UN TERCERO NO SE PUBLICA","Sin reserva","2018-11-28",5,"Dato personal privado ","f. Atender y resolver peticiones, quejas, reclamos y sugerencias."]
["437-789","INFORMACIÓN","GRUPO INTERNO DE TRABAJO DE GESTION PENSIONAL","INFORMES A OTROS ORGANISMOS","LOS DOCUMENTOS CONTENIDOS EN LA AGRUPACIÓN DOCUMENTAL POSEEN CUALIDADES PROPIAS Y CARACTERÍSTICAS UNICAS DE LA ENTIDAD, PERO ADEMÁS SON DOCUMENTOS ESENCIALES PARA LOS PROCESOS PENSIONALES DE FUNCIONARIO Y EXFUNCIONARIOS DEL MINISTERIO Y LAS ENTIDADES LIQUIDADAS DE LAS TELECOMUNICADAS DE LA EXTINTA CAPRECOM, ADEMÁS PUEDE SER UN INSUMO ADECUADO PARA INVESTIGACIONES HISTÓRICAS, DEBE CONSERVARSE EN SU TOTALIDAD Y SER TRANSFERIDO UNA VEZ TERMINEN LOS TIEMPOS DE RETENCIÓN AL ARCHIVO HISTÓRICO DE LA NACIÓN","GRUPO INTERNO DE TRABAJO DE GESTION PENSIONAL","2018-11-28","GRUPO INTERNO DE TRABAJO DE FORTALECIMIENTO DE LAS RELACIONES CON LOS GRUPOS DE INTERES","2019-01-02","APOYO","GESTION_RECURSOS","GESTION DEL TALENTO HUMANO","DEPENDE EL TIPO DE REQUERIMIENTO","Interno","Físico","Archivos Institucionales - físicos","Papel","Español","INFORMACIÓN PÚBLICA CLASIFICADA","ARCHIVO","SI","CIRCULAR CONJUNTA No.13 de 2007 EXPEDIDA POR EL MINISTERIO DE HACIENDA Y CREDITO PUBLICO","TODA LA INFORMACION QUE SEA DE UN TERCERO NO SE PUBLICA","Sin reserva","2018-11-28",5,"Dato personal privado ","f. Atender y resolver peticiones, quejas, reclamos y sugerencias."]
["437-790","INFORMACIÓN","GRUPO INTERNO DE TRABAJO DE GESTION PENSIONAL","INFORME PARA CALCULO ACTUARIAL ","LOS DOCUMENTOS CONTENIDOS EN LA AGRUPACIÓN DOCUMENTAL POSEEN CUALIDADES PROPIAS Y CARACTERÍSTICAS UNICAS DE LA ENTIDAD, PERO ADEMÁS SON DOCUMENTOS ESENCIALES PARA LOS PROCESOS PENSIONALES DE FUNCIONARIO Y EXFUNCIONARIOS DEL MINISTERIO Y LAS ENTIDADES LIQUIDADAS DE LAS TELECOMUNICADAS DE LA EXTINTA CAPRECOM, ADEMÁS PUEDE SER UN INSUMO ADECUADO PARA INVESTIGACIONES HISTÓRICAS, DEBE CONSERVARSE EN SU TOTALIDAD Y SER TRANSFERIDO UNA VEZ TERMINEN LOS TIEMPOS DE RETENCIÓN AL ARCHIVO HISTÓRICO DE LA NACIÓN","GRUPO INTERNO DE TRABAJO DE GESTION PENSIONAL","2018-11-28","GRUPO INTERNO DE TRABAJO DE FORTALECIMIENTO DE LAS RELACIONES CON LOS GRUPOS DE INTERES","2019-01-02","APOYO","GESTION_RECURSOS","GESTION DEL TALENTO HUMANO","DECRETO 3056 DE 2013, DECRETO 1833 DE 2016","Interno","Físico","Archivos Institucionales - físicos","Papel","Español","INFORMACIÓN PÚBLICA CLASIFICADA","ARCHIVO","SI","CIRCULAR CONJUNTA No.13 de 2007 EXPEDIDA POR EL MINISTERIO DE HACIENDA Y CREDITO PUBLICO","TODA LA INFORMACION QUE SEA DE UN TERCERO NO SE PUBLICA","Sin reserva","2018-11-28",5,"Dato personal privado ","f. Atender y resolver peticiones, quejas, reclamos y sugerencias."]
["437-791","INFORMACIÓN","GRUPO INTERNO DE TRABAJO DE GESTION PENSIONAL","INFORME DE GESTION","LOS INFORME DE GESTION CONTIENEN INFORMACION OFICIAL Y DETALLADA SOBRE EL EJERCICIO DE LAS FUNCIONES DE LAS DEPENDENCIAS Y DE LA ENTIDAD MISMA.ESTA INFORMACION EN EL FUTURO, SERA, MATERIAL PROPICIO PARA SER USADO COMO INSUMO POR PARTE INVESTIGADORES O CIUDADANOS.","GRUPO INTERNO DE TRABAJO DE GESTION PENSIONAL","2018-11-28","GRUPO INTERNO DE TRABAJO DE FORTALECIMIENTO DE LAS RELACIONES CON LOS GRUPOS DE INTERES","2019-01-02","APOYO","GESTION_RECURSOS","GESTION DEL TALENTO HUMANO","DEPENDE EL TIPO DE REQUERIMIENTO","Interno","Físico","Archivos Institucionales - físicos","Papel","Español","INFORMACIÓN PÚBLICA CLASIFICADA","ARCHIVO","SI","CIRCULAR CONJUNTA No.13 de 2007 EXPEDIDA POR EL MINISTERIO DE HACIENDA Y CREDITO PUBLICO","TODA LA INFORMACION QUE SEA DE UN TERCERO NO SE PUBLICA","Sin reserva","2018-11-28",5,"Dato personal privado ","f. Atender y resolver peticiones, quejas, reclamos y sugerencias."]
["437-792","INFORMACIÓN","GRUPO INTERNO DE TRABAJO DE GESTION PENSIONAL","PETICIONES, QUEJAS,RECLAMOS, SUGERENCIAS Y DENUNCIAS","TENIENDO EN CUENTA EL ALTISIMO VOLUMEN DOCUMENTAL ","GRUPO INTERNO DE TRABAJO DE GESTION PENSIONAL","2018-11-28","GRUPO INTERNO DE TRABAJO DE FORTALECIMIENTO DE LAS RELACIONES CON LOS GRUPOS DE INTERES","2019-01-02","APOYO","GESTION_RECURSOS","GESTION DEL TALENTO HUMANO","DEPENDE EL TIPO DE REQUERIMIENTO","Interno","Físico","Archivos Institucionales - físicos","Papel","Español","INFORMACIÓN PÚBLICA","ARCHIVO DE LA ENTIDAD","N/A","N/A","N/A","N/A","N/A","N/A","Datos sensibles","f. Atender y resolver peticiones, quejas, reclamos y sugerencias."]
["434-793","INFORMACIÓN","GRUPO INTERNO DE TRABAJO DE FORTALECIMIENTO DE LAS RELACIONES CON LOS GRUPOS DE INTERES","consecutivo de las comunicaciones ","compilacion de los consecutivos de documentos oficiales ","GRUPO INTERNO DE TRABAJO DE FORTALECIMIENTO DE LAS RELACIONES CON LOS GRUPOS DE INTERES","2018-11-28","GRUPO INTERNO DE TRABAJO DE FORTALECIMIENTO DE LAS RELACIONES CON LOS GRUPOS DE INTERES","2019-01-02","ESTRATEGICO","GESTION_ATENCION_GRUPOS_INTERES","GESTION DE ATENCION A GRUPOS DE INTERES","acuerdo  060  de  2001","Interno","Físico","Documentos de Archivo - físicos","Papel","Español","INFORMACIÓN PÚBLICA","N/A","N/A","N/A","N/A","N/A","N/A","N/A","f. Atender y resolver peticiones, quejas, reclamos y sugerencias.","N/A"]
["434-794","INFORMACIÓN","GRUPO INTERNO DE TRABAJO DE FORTALECIMIENTO DE LAS RELACIONES CON LOS GRUPOS DE INTERES","INFORME ","Documento que informa las PQRSD recibidas y enviadas contiene la informacion relevante sobre las solicitudes y las  respuestas  ","GRUPO INTERNO DE TRABAJO DE FORTALECIMIENTO DE LAS RELACIONES CON LOS GRUPOS DE INTERES","2018-11-28","GRUPO INTERNO DE TRABAJO DE FORTALECIMIENTO DE LAS RELACIONES CON LOS GRUPOS DE INTERES","2019-01-02","ESTRATEGICO","GESTION_ATENCION_GRUPOS_INTERES","GESTION DE ATENCION A GRUPOS DE INTERES","Ley 1712 de 2014","Externo","Digital","Portales, Intranet y Extranet","PDF","Español","INFORMACIÓN PÚBLICA","N/A","N/A","N/A","N/A","N/A","N/A","N/A","f. Atender y resolver peticiones, quejas, reclamos y sugerencias.","N/A"]
["434-795","INFORMACIÓN","GRUPO INTERNO DE TRABAJO DE FORTALECIMIENTO DE LAS RELACIONES CON LOS GRUPOS DE INTERES","FORMATOS Y PLANILLAS PARA EL CONTROL DE CORRESPONDENCIA ","LLEVAR REGISTRO DE LA CORRESPONDENCIA EN REPARTO A LAS AREAS Y RECIBIDA EN LAS VALIJAS ","GRUPO INTERNO DE TRABAJO DE FORTALECIMIENTO DE LAS RELACIONES CON LOS GRUPOS DE INTERES","2018-11-28","GRUPO INTERNO DE TRABAJO DE FORTALECIMIENTO DE LAS RELACIONES CON LOS GRUPOS DE INTERES","2019-01-02","ESTRATEGICO","GESTION_ATENCION_GRUPOS_INTERES","GESTION DE ATENCION A GRUPOS DE INTERES","acuerdo  060  de  2001","Externo","Físico","Archivos Institucionales - físicos","N/A","Español","INFORMACIÓN PÚBLICA","N/A","N/A","N/A","N/A","N/A","N/A","N/A","N/A","N/A"]
["434-796","INFORMACIÓN","GRUPO INTERNO DE TRABAJO DE FORTALECIMIENTO DE LAS RELACIONES CON LOS GRUPOS DE INTERES","SOLICITUDES A LA ENTIDAD","RESPUESTA A LAS SLOICITUDES QUEJAS RECLAMOS DE LOS GRUPOS DE INTERES AL MINISTERIO ","GRUPO INTERNO DE TRABAJO DE FORTALECIMIENTO DE LAS RELACIONES CON LOS GRUPOS DE INTERES","2018-11-28","GRUPO INTERNO DE TRABAJO DE FORTALECIMIENTO DE LAS RELACIONES CON LOS GRUPOS DE INTERES","2019-01-02","ESTRATEGICO","GESTION_ATENCION_GRUPOS_INTERES","GESTION DE ATENCION A GRUPOS DE INTERES","Código Contencioso de Procedimientos Administrativos\nLey 1437 de 2011","Externo","Digital","Archivos Institucionales - electrónico","N/A","Español","INFORMACIÓN PÚBLICA","N/A","N/A","N/A","N/A","N/A","N/A","N/A","Dato personal privado ","f. Atender y resolver peticiones, quejas, reclamos y sugerencias."]
["434-797","INFORMACIÓN","GRUPO INTERNO DE TRABAJO DE FORTALECIMIENTO DE LAS RELACIONES CON LOS GRUPOS DE INTERES","PROGRAMA RSI","DOCUMENTO QUE CONTEMPLA  LAS ACTIVIDADES DE LA ENTIDAD HACIA LOS GRUPOS DE INTERES EN TEMAS RELACIONADOS CON LA OFERTA INSTITUCIONAL ","GRUPO INTERNO DE TRABAJO DE FORTALECIMIENTO DE LAS RELACIONES CON LOS GRUPOS DE INTERES","2018-11-28","GRUPO INTERNO DE TRABAJO DE FORTALECIMIENTO DE LAS RELACIONES CON LOS GRUPOS DE INTERES","2019-01-02","ESTRATEGICO","GESTION_ATENCION_GRUPOS_INTERES","GESTION DE ATENCION A GRUPOS DE INTERES","ISO 26000","Externo","Digital","Archivos Institucionales - electrónico","N/A","Español","INFORMACIÓN PÚBLICA","N/A","N/A","N/A","N/A","N/A","N/A","N/A","N/A","N/A"]
["434-798","INFORMACIÓN","GRUPO INTERNO DE TRABAJO DE FORTALECIMIENTO DE LAS RELACIONES CON LOS GRUPOS DE INTERES","PROGRAMA SERVICIO AL CIUDADANO","DOCUMENTO QUE CONTEMPLA LAS ACTIVIDADES RELACIONADAS PARA MEJORAR LA ATENCION A LOS GRUPOS DE INTERES DE LA ENTIDAD ","GRUPO INTERNO DE TRABAJO DE FORTALECIMIENTO DE LAS RELACIONES CON LOS GRUPOS DE INTERES","2018-11-28","GRUPO INTERNO DE TRABAJO DE FORTALECIMIENTO DE LAS RELACIONES CON LOS GRUPOS DE INTERES","2019-01-02","ESTRATEGICO","GESTION_ATENCION_GRUPOS_INTERES","GESTION DE ATENCION A GRUPOS DE INTERES","Ley 134 de 1994","Externo","Digital","Archivos Institucionales - electrónico","N/A","Español","INFORMACIÓN PÚBLICA","N/A","N/A","N/A","N/A","N/A","N/A","N/A","N/A","N/A"]
["434-799","INFORMACIÓN","GRUPO INTERNO DE TRABAJO DE FORTALECIMIENTO DE LAS RELACIONES CON LOS GRUPOS DE INTERES","PROGRAMA DE GSTION AMBIENTAL","DOCUMENTO QUE CONTIENE LAS ACTIVIDADES RELACIONADAS CON EL COMPROMISO AMBIENTAL DE LA ENTIDAD ","GRUPO INTERNO DE TRABAJO DE FORTALECIMIENTO DE LAS RELACIONES CON LOS GRUPOS DE INTERES","2018-11-28","GRUPO INTERNO DE TRABAJO DE FORTALECIMIENTO DE LAS RELACIONES CON LOS GRUPOS DE INTERES","2019-01-02","ESTRATEGICO","GESTION_ATENCION_GRUPOS_INTERES","GESTION DE ATENCION A GRUPOS DE INTERES"," Ley 99 de 1993","Externo","Digital","Archivos Institucionales - electrónico","XLS","Español","INFORMACIÓN PÚBLICA","N/A","N/A","N/A","N/A","N/A","N/A","N/A","N/A","N/A"]
["433-800","INFORMACIÓN","GRUPO INTERNO DE TRABAJO DE GESTIÓN DE LA INFORMACIÓN","ACTAS DE ELIMINACION ","DOCUMENTO DONDE SE REGISTRA LAS ACTIVIDADES DE ELIMINACION DOCUMENTAL ","GRUPO INTERNO DE TRABAJO DE GESTIÓN DE LA INFORMACIÓN","2018-11-28","GRUPO INTERNO DE TRABAJO DE GESTIÓN DE LA INFORMACIÓN","2019-01-02","APOYO","GESTION_RECURSOS","GESTION DOCUMENTAL","Ley 594 de 2000","Externo","Físico","Archivos Institucionales - físicos","Papel","Español","INFORMACIÓN PÚBLICA","N/A","N/A","N/A","N/A","N/A","N/A","N/A","g. Conservar evidencia de los eventos de entrenamiento y sensibilización realizados, audiencias de adjudicación de contratos, reuniones internas y externas.","N/A"]
["433-801","INFORMACIÓN","GRUPO INTERNO DE TRABAJO DE GESTIÓN DE LA INFORMACIÓN","INFORME DE GESTION ","DOCUMENTO QUE REGISTRA LAS ACTIVIDADES REALIZADAS POR EL GRUPO ","GRUPO INTERNO DE TRABAJO DE GESTIÓN DE LA INFORMACIÓN","2018-11-28","GRUPO INTERNO DE TRABAJO DE GESTIÓN DE LA INFORMACIÓN","2019-01-02","APOYO","GESTION_RECURSOS","GESTION DOCUMENTAL","Ley 594 de 2001","Externo","Físico","Archivos Institucionales - físicos","Papel","Español","INFORMACIÓN PÚBLICA","N/A","N/A","N/A","N/A","N/A","N/A","N/A","N/A","N/A"]
["433-802","INFORMACIÓN","GRUPO INTERNO DE TRABAJO DE GESTIÓN DE LA INFORMACIÓN","BANCO TERMINOLOGICO, CUADRO DE CLASIFICACION DOCUMENTAL, INVENTARIO, MAPA DE PROCESOS,  TRD, TVD","DOCUMENTOS QUE DENOTAN LA ORGANIZACIÓN DOCUMENTAL DE LA ENTIDAD ","GRUPO INTERNO DE TRABAJO DE GESTIÓN DE LA INFORMACIÓN","2018-11-28","GRUPO INTERNO DE TRABAJO DE GESTIÓN DE LA INFORMACIÓN","2019-01-02","APOYO","GESTION_RECURSOS","GESTION DOCUMENTAL","Ley 594 de 2002","Externo","Digital","Sistemas de Trabajo colaborativo","PDF","Español","INFORMACIÓN PÚBLICA","N/A","N/A","N/A","N/A","N/A","N/A","N/A","N/A","N/A"]
["433-803","INFORMACIÓN","GRUPO INTERNO DE TRABAJO DE GESTIÓN DE LA INFORMACIÓN","FORMATOS Y PLANILLAS PARA EL CONTROL DE PRESTAMOS Y SALIDAS DE EXPEDIENTES","FORMATOS Y PLANILLAS PARA EL CONTROL DE PRESTAMOS Y SALIDAS DE EXPEDIENTES","GRUPO INTERNO DE TRABAJO DE GESTIÓN DE LA INFORMACIÓN","2018-11-28","GRUPO INTERNO DE TRABAJO DE GESTIÓN DE LA INFORMACIÓN","2019-01-02","APOYO","GESTION_RECURSOS","GESTION DOCUMENTAL","Ley 594 de 2003","Externo","Digital","Sistemas de Trabajo colaborativo","PDF","Español","INFORMACIÓN PÚBLICA","N/A","N/A","N/A","N/A","N/A","N/A","N/A","N/A","N/A"]
["433-804","INFORMACIÓN","GRUPO INTERNO DE TRABAJO DE GESTIÓN DE LA INFORMACIÓN","ATENCION A PQRSD","RESPUESTA A LAS SLOICITUDES QUEJAS RECLAMOS DE LOS GRUPOS DE INTERES AL MINISTERIO ","GRUPO INTERNO DE TRABAJO DE GESTIÓN DE LA INFORMACIÓN","2018-11-28","GRUPO INTERNO DE TRABAJO DE GESTIÓN DE LA INFORMACIÓN","2019-01-02","APOYO","GESTION_RECURSOS","GESTION DOCUMENTAL","Código Contencioso de Procedimientos Administrativos\nLey 1437 de 2011","Externo","Físico","Documentos de Archivo - físicos","Papel","Español","INFORMACIÓN PÚBLICA","N/A","N/A","N/A","N/A","N/A","N/A","N/A","Dato personal privado ","f. Atender y resolver peticiones, quejas, reclamos y sugerencias."]
["433-805","INFORMACIÓN","GRUPO INTERNO DE TRABAJO DE GESTIÓN DE LA INFORMACIÓN","PLAN INSTITUCIONAL DE ARCHIVO PINAR ","DOCUMENTO DE LOS LINEAMIENTOS PARA TENER EN CUENTA PARA LA APLICACIÓN DE LA NORMA ARCHIVISTICA ","GRUPO INTERNO DE TRABAJO DE GESTIÓN DE LA INFORMACIÓN","2018-11-28","GRUPO INTERNO DE TRABAJO DE GESTIÓN DE LA INFORMACIÓN","2019-01-02","APOYO","GESTION_RECURSOS","GESTION DOCUMENTAL","Ley 594 de 2003\nDecreto 1080 de 2015","Externo","Digital","Sistemas de Información corporativos","PDF","Español","INFORMACIÓN PÚBLICA","N/A","N/A","N/A","N/A","N/A","N/A","N/A","N/A","N/A"]
["433-806","INFORMACIÓN","GRUPO INTERNO DE TRABAJO DE GESTIÓN DE LA INFORMACIÓN","PROGRAMA DE GESTION DOCUMENTAL Y PROGRAMA INTEGRADO DE CONSERVACION ","DOCUMENTOS QUE ORIENTAS LA GESTION ARCHIVISTICA DEL MINISTERIO ","GRUPO INTERNO DE TRABAJO DE GESTIÓN DE LA INFORMACIÓN","2018-11-28","GRUPO INTERNO DE TRABAJO DE GESTIÓN DE LA INFORMACIÓN","2019-01-02","APOYO","GESTION_RECURSOS","GESTION DOCUMENTAL","Ley 594 de 2003\nDecreto 1080 de 2015","Externo","Digital","Sistemas de Trabajo colaborativo","PDF","Español","INFORMACIÓN PÚBLICA","N/A","N/A","N/A","N/A","N/A","N/A","N/A","N/A","N/A"]
["433-807","INFORMACIÓN","GRUPO INTERNO DE TRABAJO DE GESTIÓN DE LA INFORMACIÓN","TRANSFERENCIAS DOCUMENTALES PRIMARAIA Y SECUNDARIAS ","TRANSFERENCIA DE ARCHIVOS HACIA EL CENTRAL Y/O HACIA EL AGN EN CUMPLIMIENTO A LOS TIEMPOS DE RETENCION ","GRUPO INTERNO DE TRABAJO DE GESTIÓN DE LA INFORMACIÓN","2018-11-28","GRUPO INTERNO DE TRABAJO DE GESTIÓN DE LA INFORMACIÓN","2019-01-02","APOYO","GESTION_RECURSOS","GESTION DOCUMENTAL","Ley 594 de 2003\nDecreto 1080 de 2015","Externo","Digital","Sistemas de Trabajo colaborativo","XLS -PDF","Español","INFORMACIÓN PÚBLICA","N/A","N/A","N/A","N/A","N/A","N/A","NO","N/A","N/A"]
["341-808","INFORMACIÓN","GRUPO INTERNO DE TRABAJO DE INDUSTRIA DE TECNOLOGIAS DE LA INFORMACIÓN","Bases de datos empresas beneficiadas_convenio Procolombia","Bases de datos de las empresas beneficiadas dentro del proyecto Procolombia","GRUPO INTERNO DE TRABAJO DE INDUSTRIA DE TECNOLOGIAS DE LA INFORMACIÓN","2018-11-28","GRUPO INTERNO DE TRABAJO DE INDUSTRIA DE TECNOLOGIAS DE LA INFORMACIÓN","2019-01-02","MISIONAL","ACCESO_USO_APROPIACION_TIC","FORTALECIMIENTO DE LA INDUSTRIA TIC","N/A","Interno","Digital","Documentos de Archivo - electrónicos","XLS","Español","INFORMACIÓN PÚBLICA RESERVADA","N/A","SI","Del artículo 18 Y 19 de la Ley 1712 de 2014","literal A\nParágrafo","Reserva total","N/A","N/A","Dato personal privado ","g. Conservar evidencia de los eventos de entrenamiento y sensibilización realizados, audiencias de adjudicación de contratos, reuniones internas y externas."]
["342-809","INFORMACIÓN","GRUPO INTERNO DE TRABAJO DE ESTRATEGIA TALENTO DE TECNOLOGIAS DE LA INFORMACIÓN","Bases de datos de beneficiarios Programación para niños y niñas","Bases de datos de los docentes beneficiarios del proyecto programación para niños y niñas","GRUPO INTERNO DE TRABAJO DE ESTRATEGIA TALENTO DE TECNOLOGIAS DE LA INFORMACIÓN","2018-11-28","GRUPO INTERNO DE TRABAJO DE ESTRATEGIA TALENTO DE TECNOLOGIAS DE LA INFORMACIÓN","2019-01-02","MISIONAL","ACCESO_USO_APROPIACION_TIC","FORTALECIMIENTO DE LA INDUSTRIA TIC","N/A","Interno","Digital","Documentos de Archivo - electrónicos","XLS","Español","INFORMACIÓN PÚBLICA RESERVADA","N/A","SI","Del artículo 18 Y 19 de la Ley 1712 de 2015","literal A\nParágrafo","Reserva total","N/A","N/A","Dato personal privado ","a. Permitir el desarrollo del objeto del Ministerio/Fondo TIC, en los términos de los artículos 1o y 2o del Decreto 1414 de 2017."]
["344-810","INFORMACIÓN","GRUPO INTERNO DE TRABAJO DE INDUSTRIA CREATIVA DIGITAL","Base de datos beneficiarios convocatoria Crea Digital","Información de los beneficiarios de la convocatoria crea digital","GRUPO INTERNO DE TRABAJO DE INDUSTRIA CREATIVA DIGITAL","2018-11-28","GRUPO INTERNO DE TRABAJO DE INDUSTRIA CREATIVA DIGITAL","2019-01-02","MISIONAL","ACCESO_USO_APROPIACION_TIC","FORTALECIMIENTO DE LA INDUSTRIA TIC","N/A","Interno","Digital","Documentos de Archivo - electrónicos","XLS","Español","INFORMACIÓN PÚBLICA RESERVADA","N/A","SI","Del artículo 18 Y 19 de la Ley 1712 de 2016","literal A\nParágrafo","Reserva total","N/A","N/A","Dato personal privado ","a. Permitir el desarrollo del objeto del Ministerio/Fondo TIC, en los términos de los artículos 1o y 2o del Decreto 1414 de 2017."]
["342-811","INFORMACIÓN","GRUPO INTERNO DE TRABAJO DE ESTRATEGIA TALENTO DE TECNOLOGIAS DE LA INFORMACIÓN","Bases de datos de docentes beneficiarios de la estrategia Curriculos naranja","Información de los beneficiarios de la estrategia curriculos naranja","GRUPO INTERNO DE TRABAJO DE ESTRATEGIA TALENTO DE TECNOLOGIAS DE LA INFORMACIÓN","2018-11-28","GRUPO INTERNO DE TRABAJO DE ESTRATEGIA TALENTO DE TECNOLOGIAS DE LA INFORMACIÓN","2019-01-02","MISIONAL","ACCESO_USO_APROPIACION_TIC","FORTALECIMIENTO DE LA INDUSTRIA TIC","N/A","Interno","Digital","Documentos de Archivo - electrónicos","XLS","Español","INFORMACIÓN PÚBLICA RESERVADA","N/A","SI","Del artículo 18 Y 19 de la Ley 1712 de 2017","literal A\nParágrafo","Reserva total","N/A","N/A","Dato personal privado ","a. Permitir el desarrollo del objeto del Ministerio/Fondo TIC, en los términos de los artículos 1o y 2o del Decreto 1414 de 2017."]
["342-812","INFORMACIÓN","GRUPO INTERNO DE TRABAJO DE ESTRATEGIA TALENTO DE TECNOLOGIAS DE LA INFORMACIÓN","Base de datos beneficiarios de Inteligencia Artificial","Información de los beneficiarios de la formación en Inteligencia Artificial","GRUPO INTERNO DE TRABAJO DE ESTRATEGIA TALENTO DE TECNOLOGIAS DE LA INFORMACIÓN","2018-11-28","GRUPO INTERNO DE TRABAJO DE ESTRATEGIA TALENTO DE TECNOLOGIAS DE LA INFORMACIÓN","2019-01-02","MISIONAL","ACCESO_USO_APROPIACION_TIC","FORTALECIMIENTO DE LA INDUSTRIA TIC","N/A","Interno","Digital","Documentos de Archivo - electrónicos","XLS","Español","INFORMACIÓN PÚBLICA RESERVADA","N/A","SI","Del artículo 18 Y 19 de la Ley 1712 de 2018","literal A\nParágrafo","Reserva total","N/A","N/A","Dato personal privado ","a. Permitir el desarrollo del objeto del Ministerio/Fondo TIC, en los términos de los artículos 1o y 2o del Decreto 1414 de 2017."]
["342-813","INFORMACIÓN","GRUPO INTERNO DE TRABAJO DE ESTRATEGIA TALENTO DE TECNOLOGIAS DE LA INFORMACIÓN","Base de datos de beneficiarios de Ciencia de Datos","Información de los beneficiarios de la formación en Ciencia de Datos","GRUPO INTERNO DE TRABAJO DE ESTRATEGIA TALENTO DE TECNOLOGIAS DE LA INFORMACIÓN","2018-11-28","GRUPO INTERNO DE TRABAJO DE ESTRATEGIA TALENTO DE TECNOLOGIAS DE LA INFORMACIÓN","2019-01-02","MISIONAL","ACCESO_USO_APROPIACION_TIC","FORTALECIMIENTO DE LA INDUSTRIA TIC","N/A","Interno","Digital","Documentos de Archivo - electrónicos","XLS","Español","INFORMACIÓN PÚBLICA RESERVADA","N/A","SI","Del artículo 18 Y 19 de la Ley 1712 de 2019","literal A\nParágrafo","Reserva total","N/A","N/A","Dato personal privado ","a. Permitir el desarrollo del objeto del Ministerio/Fondo TIC, en los términos de los artículos 1o y 2o del Decreto 1414 de 2017."]
["343-814","INFORMACIÓN","GRUPO INTERNO DE TRABAJO DE EMPRENDIMIENTO APPS.CO","Base de Datos Beneficiarios Cursos Virtuales","Informacion detallada de los beneficiarios de los cursos virtuales registrados en la platarforma de Apps.co","GRUPO INTERNO DE TRABAJO DE EMPRENDIMIENTO APPS.CO","2018-11-28","GRUPO INTERNO DE TRABAJO DE EMPRENDIMIENTO APPS.CO","2019-01-02","MISIONAL","ACCESO_USO_APROPIACION_TIC","FORTALECIMIENTO DE LA INDUSTRIA TIC","N/A","Interno","Digital","Sistemas de Información corporativos","XLS","Español","INFORMACIÓN PÚBLICA RESERVADA","www.apps.co - uso restringido para usuarios con permisos","N/A","N/A","N/A","N/A","N/A","N/A","Dato personal privado ","a. Permitir el desarrollo del objeto del Ministerio/Fondo TIC, en los términos de los artículos 1o y 2o del Decreto 1414 de 2017."]
["343-815","INFORMACIÓN","GRUPO INTERNO DE TRABAJO DE EMPRENDIMIENTO APPS.CO","Base de Datos Equipos Acompañados en Etapa Temprana y Avanzada","Informacion detallada de los equipos acompañados en etapa temprana y avanzada para cada una de las iteraciones del programa Apps.co ","GRUPO INTERNO DE TRABAJO DE EMPRENDIMIENTO APPS.CO","2018-11-28","GRUPO INTERNO DE TRABAJO DE EMPRENDIMIENTO APPS.CO","2019-01-02","MISIONAL","ACCESO_USO_APROPIACION_TIC","FORTALECIMIENTO DE LA INDUSTRIA TIC","N/A","Interno","Digital","Sistemas de Información corporativos","XLS","Español","INFORMACIÓN PÚBLICA RESERVADA","www.apps.co - uso restringido para usuarios con permisos","N/A","N/A","N/A","N/A","N/A","N/A","Dato personal privado ","a. Permitir el desarrollo del objeto del Ministerio/Fondo TIC, en los términos de los artículos 1o y 2o del Decreto 1414 de 2017."]
["343-816","INFORMACIÓN","GRUPO INTERNO DE TRABAJO DE EMPRENDIMIENTO APPS.CO","Contratos y Convenios","Documentos fisicos de contratos y convenios  de los procesos de contratacion en etapa pre contractual , contractual y post contractual , con evidencias de la ejecucion financiera y tecnica.","GRUPO INTERNO DE TRABAJO DE EMPRENDIMIENTO APPS.CO","2018-11-28","GRUPO INTERNO DE TRABAJO DE EMPRENDIMIENTO APPS.CO","2019-01-02","MISIONAL","ACCESO_USO_APROPIACION_TIC","FORTALECIMIENTO DE LA INDUSTRIA TIC","N/A","Interno","Físico","Documentos de Archivo - físicos","PDF","Español","INFORMACIÓN PÚBLICA RESERVADA","Archivo","N/A","N/A","N/A","N/A","N/A","N/A","N/A","N/A"]
["340-817","INFORMACIÓN","DIRECCIÓN DE DESARROLLO DE LA INDUSTRIA DE TECNOLOGIAS DE LA INFORMACIÓN","Base de datos de las legalizaciones","Base de datos de las legalizaciones de los contratos o convenios de la Dirección","DIRECCIÓN DE DESARROLLO DE LA INDUSTRIA DE TECNOLOGIAS DE LA INFORMACIÓN","2018-11-28","DIRECCIÓN DE DESARROLLO DE LA INDUSTRIA DE TECNOLOGIAS DE LA INFORMACIÓN","2019-01-02","MISIONAL","ACCESO_USO_APROPIACION_TIC","FORTALECIMIENTO DE LA INDUSTRIA TIC","N/A","Interno","Físico","Documentos de Archivo - físicos","PDF","Español","INFORMACIÓN PÚBLICA","N/A","N/A","N/A","N/A","N/A","N/A","N/A","N/A","N/A"]
["",null,null,null,null,""]
["",null,null,null,null,""]
["",null,null,null,null,""]
["",null,null,null,null,""]
["",null,null,null,null,""]
["",null,null,null,null,""]
["",null,null,null,null,""]
["",null,null,null,null,""]
["",null,null,null,null,""]
["",null,null,null,null,""]
["",null,null,null,null,""]
["",null,null,null,null,""]
["",null,null,null,null,""]
["",null,null,null,null,""]
["",null,null,null,null,""]
["",null,null,null,null,{"$f":"IF(C840=\"\",\"\",C840)","v":""}]
["",null,null,null,null,""]
["",null,null,null,null,""]
["",null,null,null,null,""]
["",null,null,null,null,""]
["",null,null,null,null,""]
["",null,null,null,null,""]
[null,null,null,null,null,""]
[null,null,null,null,null,""]
[null,null,null,null,null,""]
[null,null,null,null,null,""]
[null,null,null,null,null,""]
[null,null,null,null,null,""]
[null,null,null,null,null,""]
[null,null,null,null,null,""]
[null,null,null,null,null,""]
[null,null,null,null,null,""]
[null,null,null,null,null,""]
[null,null,null,null,null,""]
[null,null,null,null,null,""]
[null,null,null,null,null,""]
[null,null,null,null,null,""]
[null,null,null,null,null,""]
[null,null,null,null,null,""]
[null,null,null,null,null,""]
[null,null,null,null,null,""]
[null,null,null,null,null,""]
[null,null,null,null,null,""]
[null,null,null,null,null,""]
[null,null,null,null,null,""]
[null,null,null,null,null,""]
[null,null,null,null,null,""]
[null,null,null,null,null,""]
[null,null,null,null,null,""]
[null,null,null,null,null,""]
[null,null,null,null,null,""]
[null,null,null,null,null,""]
[null,null,null,null,null,""]
[null,null,null,null,null,""]
[null,null,null,null,null,""]
[null,null,null,null,null,""]
[null,null,null,null,null,""]
[null,null,null,null,null,""]
[null,null,null,null,null,""]
[null,null,null,null,null,""]
[null,null,null,null,null,""]
[null,null,null,null,null,""]
[null,null,null,null,null,""]
[null,null,null,null,null,""]
[null,null,null,null,null,""]
[null,null,null,null,null,""]
[null,null,null,null,null,""]
[null,null,null,null,null,""]
[null,null,null,null,null,""]
[null,null,null,null,null,""]
[null,null,null,null,null,""]
[null,null,null,null,null,""]
[null,null,null,null,null,""]
[null,null,null,null,null,""]
[null,null,null,null,null,""]
[null,null,null,null,null,""]
[null,null,null,null,null,""]
[null,null,null,null,null,""]
[null,null,null,null,null,""]
[null,null,null,null,null,{"$f":"IF(C904=\"\",\"\",C904)","v":""}]
[null,null,null,null,null,""]
[null,null,null,null,null,""]
[null,null,null,null,null,""]
[null,null,null,null,null,""]
[null,null,null,null,null,""]
[null,null,null,null,null,""]
[null,null,null,null,null,""]
[null,null,null,null,null,""]
[null,null,null,null,null,""]
[null,null,null,null,null,""]
[null,null,null,null,null,""]
[null,null,null,null,null,""]
[null,null,null,null,null,""]
[null,null,null,null,null,""]
[null,null,null,null,null,""]
[null,null,null,null,null,""]
[null,null,null,null,null,""]
[null,null,null,null,null,""]
[null,null,null,null,null,""]
[null,null,null,null,null,""]
[null,null,null,null,null,""]
[null,null,null,null,null,""]
[null,null,null,null,null,""]
[null,null,null,null,null,""]
[null,null,null,null,null,""]
[null,null,null,null,null,""]
[null,null,null,null,null,""]
[null,null,null,null,null,""]
[null,null,null,null,null,""]
[null,null,null,null,null,""]
[null,null,null,null,null,""]
[null,null,null,null,null,""]
[null,null,null,null,null,""]
[null,null,null,null,null,""]
[null,null,null,null,null,""]
[null,null,null,null,null,""]
[null,null,null,null,null,""]
[null,null,null,null,null,""]
[null,null,null,null,null,""]
[null,null,null,null,null,""]
[null,null,null,null,null,""]
[null,null,null,null,null,""]
[null,null,null,null,null,""]
[null,null,null,null,null,""]
[null,null,null,null,null,""]
[null,null,null,null,null,""]
[null,null,null,null,null,""]
[null,null,null,null,null,""]
[null,null,null,null,null,""]
[null,null,null,null,null,""]
[null,null,null,null,null,""]
[null,null,null,null,null,""]
[null,null,null,null,null,""]
[null,null,null,null,null,""]
[null,null,null,null,null,""]
[null,null,null,null,null,""]
[null,null,null,null,null,""]
[null,null,null,null,null,""]
[null,null,null,null,null,""]
[null,null,null,null,null,""]
[null,null,null,null,null,""]
[null,null,null,null,null,""]
[null,null,null,null,null,""]
[null,null,null,null,null,{"$f":"IF(C968=\"\",\"\",C968)","v":""}]
[null,null,null,null,null,""]
[null,null,null,null,null,""]
[null,null,null,null,null,""]
[null,null,null,null,null,""]
[null,null,null,null,null,""]
[null,null,null,null,null,""]
[null,null,null,null,null,""]
[null,null,null,null,null,""]
[null,null,null,null,null,""]
[null,null,null,null,null,""]
[null,null,null,null,null,""]
[null,null,null,null,null,""]
[null,null,null,null,null,""]
[null,null,null,null,null,""]
[null,null,null,null,null,""]
[null,null,null,null,null,""]
[null,null,null,null,null,""]
[null,null,null,null,null,""]
[null,null,null,null,null,""]
[null,null,null,null,null,""]
[null,null,null,null,null,""]
[null,null,null,null,null,""]
[null,null,null,null,null,""]
[null,null,null,null,null,""]
[null,null,null,null,null,""]
[null,null,null,null,null,""]
[null,null,null,null,null,""]
[null,null,null,null,null,""]
[null,null,null,null,null,""]
[null,null,null,null,null,""]
[null,null,null,null,null,""]
[null,null,null,null,null,""]
[null,null,null,null,null,""]
[null,null,null,null,null,""]
[null,null,null,null,null,""]
[null,null,null,null,null,""]
[null,null,null,null,null,""]
[null,null,null,null,null,""]
[null,null,null,null,null,""]
[null,null,null,null,null,""]
[null,null,null,null,null,""]
[null,null,null,null,null,""]

{"sheet":"Hoja1","index":1,"n_rows":0,"n_cols":0,"rows_kept":0,"cut":false,"hidden":true,"merged":[]}

{"sheet":"DATA","index":2,"n_rows":591,"n_cols":19,"rows_kept":591,"cut":false,"hidden":true,"merged":[]}
[null,null,null,"Unido Unidades / Grupos de Trabajo","Unidades / Grupos de Trabajo","Código del área","Series",null,"Código de la Serie","Unido Series","Subseries","Código de la Subserie",null,"Tipo_Activo","Tipo_MacroProceso","ESTRATEGICO","APOYO","EVALUACION","MISIONAL"]
[null,null,null,{"$f":"SUBSTITUTE(E2,\" \",\"\")","v":"DESPACHODELMINISTRO"},"DESPACHO DEL MINISTRO",100,"ESTATUTOS INTERNOS DEL FONDO DE TECNOLOGIAS DE LA INFORMACIÓN Y LAS COMUNICACIONES",{"$f":"SUBSTITUTE(G2,\" \",\"_\")","v":"ESTATUTOS_INTERNOS_DEL_FONDO_DE_TECNOLOGIAS_DE_LA_INFORMACIÓN_Y_LAS_COMUNICACIONES"},10037,{"$f":"_xlfn.CONCAT(H2,I2)","v":"ESTATUTOS_INTERNOS_DEL_FONDO_DE_TECNOLOGIAS_DE_LA_INFORMACIÓN_Y_LAS_COMUNICACIONES10037"},"N/A","N/A",null,"EQUIPAMIENTO AUXILIAR","ESTRATEGICO","ARQUITECTURA_INSTITUCIONAL","GESTION_RECURSOS","ANALISIS_MEJORA_GESTION","ACCESO_USO_APROPIACION_TIC"]
[null,null,null,"DESPACHODELVICEMINISTRODECONECTIVIDADYDIGITALIZACIÓN","DESPACHO DEL VICEMINISTRO DE CONECTIVIDAD Y DIGITALIZACIÓN",200,"INFORMES",{"$f":"SUBSTITUTE(G3,\" \",\"_\")","v":"INFORMES"},10047,{"$f":"_xlfn.CONCAT(H3,I3)","v":"INFORMES10047"},"INFORMES A ENTES DE CONTROL Y VIGILANCIA","100.47.01",null,"HARDWARE","APOYO","COMUNICACION_ESTRATEGICA","GESTION_JURIDICA",null,"GESTION_CONOCIMIENTO_SECTOR_TIC"]
[null,null,null,"DESPACHODELVICEMINISTRODEECONOMIADIGITAL","DESPACHO DEL VICEMINISTRO DE ECONOMIA DIGITAL",300,"POLITICAS","POLITICAS",10069,"POLITICAS10069","INFORMES A OTROS ORGANISMOS","100.47.02",null,"INFORMACIÓN","EVALUACION","COOPERACION_INTERNACIONAL",null,null,"PLANEACION_FORMULACION_POLITICAS_TIC"]
[null,null,null,"DIRECCIÓNDEAPROPIACIÓNDETECNOLOGÍASDELAINFORMACIÓNYLASCOMUNICACIONES","DIRECCIÓN DE APROPIACIÓN DE TECNOLOGÍAS DE LA INFORMACIÓN Y LAS COMUNICACIONES",310,"PROYECTOS","PROYECTOS",10079,"PROYECTOS10079","INFORMES DE GESTIÓN","100.47.16",null,"INSTALACIONES","MISIONAL","GESTION_ATENCION_GRUPOS_INTERES",null,null,"SEGUIMIENTO_CONTROL_POLITICAS_TIC"]
[null,null,null,"DIRECCIÓNDEDESARROLLODELAINDUSTRIADETECNOLOGIASDELAINFORMACIÓN","DIRECCIÓN DE DESARROLLO DE LA INDUSTRIA DE TECNOLOGIAS DE LA INFORMACIÓN",340,"CONCEPTOS","CONCEPTOS",10121,"CONCEPTOS10121","POLITICAS DE DIVULGACIÓN Y PROMOCIÓN DE TECNOLOGIA DE LA INFORMACIÓN Y LAS COMUNCIACIONES","100.69.02",null,"RECURSO HUMANO",null,"MARCO_ESTRATEGICO"]
[null,null,null,"DIRECCIÓNDEGOBIERNODIGITAL","DIRECCIÓN DE GOBIERNO DIGITAL",320,"EVIDENCIAS DE LA REUNIÓN DE LAS ACCIONES INSTITUCIONALES EN EL MARCO DEL CONSENSO SOCIAL","EVIDENCIAS_DE_LA_REUNIÓN_DE_LAS_ACCIONES_INSTITUCIONALES_EN_EL_MARCO_DEL_CONSENSO_SOCIAL",10141,"EVIDENCIAS_DE_LA_REUNIÓN_DE_LAS_ACCIONES_INSTITUCIONALES_EN_EL_MARCO_DEL_CONSENSO_SOCIAL10141","PROYECTOS DE CANALES DE TELEVISIÓN ","100.79.01",null,"SERVICIOS"]
[null,null,null,"DIRECCIÓNDEINDUSTRIADECOMUNICACIONES","DIRECCIÓN DE INDUSTRIA DE COMUNICACIONES",210,"INFORMES","INFORMES",10147,"INFORMES10147","PROYECTOS DE LEY","100.79.06",null,"SOFTWARE"]
[null,null,null,"DIRECCIÓNDEINFRAESTUCTURA","DIRECCIÓN DE INFRAESTUCTURA",230,"PETICIONES QUEJAS RECLAMOS SUGERENCIAS Y DENUNCIAS PQRSD","PETICIONES_QUEJAS_RECLAMOS_SUGERENCIAS_Y_DENUNCIAS_PQRSD",10165,"PETICIONES_QUEJAS_RECLAMOS_SUGERENCIAS_Y_DENUNCIAS_PQRSD10165","CONCEPTOS TÉCNICOS","101.21.05"]
[null,null,null,{"$f":"SUBSTITUTE(E10,\" \",\"\")","v":"DIRECCIÓNDEPROMOCIÓNDETECNOLOGÍASDELAINFORMACIÓNYLASCOMUNICACIONES"},"DIRECCIÓN DE PROMOCIÓN DE TECNOLOGÍAS DE LA INFORMACIÓN Y LAS COMUNICACIONES",240,"PLANES",{"$f":"SUBSTITUTE(G10,\" \",\"_\")","v":"PLANES"},10166,{"$f":"_xlfn.CONCAT(H10,I10)","v":"PLANES10166"},"N/A","N/A"]
[null,null,null,"DIRECCIÓNDETRANSFORMACIÓNDIGITAL","DIRECCIÓN DE TRANSFORMACIÓN DIGITAL",330,"POLITICAS","POLITICAS",10169,"POLITICAS10169","INFORMES DE GESTIÓN","101.47.16"]
[null,null,null,"DIRECCIÓNDEVIGILANCIAYCONTROL","DIRECCIÓN DE VIGILANCIA Y CONTROL",220,"ACTAS","ACTAS",11001,"ACTAS11001","N/A","N/A"]
[null,null,null,"GRUPOINTERNODETRABAJOACTUACIONESADMINISTRATIVASYASESORIACONTRACTUAL","GRUPO INTERNO DE TRABAJO ACTUACIONES ADMINISTRATIVAS Y ASESORIA CONTRACTUAL",132,"CONCEPTOS","CONCEPTOS",11021,"CONCEPTOS11021","PLANES DE SALVAGUARDA ETNICOS","101.66.15"]
[null,null,null,"GRUPOINTERNODETRABAJODEADMINISTRACIÓNDEBIENES","GRUPO INTERNO DE TRABAJO DE ADMINISTRACIÓN DE BIENES",431,"INFORMES","INFORMES",11047,"INFORMES11047","N/A","N/A"]
[null,null,null,"GRUPOINTERNODETRABAJODEAPOYOALAGESTIÓNDECOBROCOACTIVOYGARANTIAS","GRUPO INTERNO DE TRABAJO DE APOYO A LA GESTIÓN DE COBRO COACTIVO Y GARANTIAS","211.2","MANUALES","MANUALES",11060,"MANUALES11060","ACTAS DEL COMITÉ MODELO INTEGRADO DE GESTIÓN","110.01.17"]
[null,null,null,"GRUPOINTERNODETRABAJODECARTERA","GRUPO INTERNO DE TRABAJO DE CARTERA",424,"PETICIONES QUEJAS RECLAMOS SUGERENCIAS Y DENUNCIAS PQRSD","PETICIONES_QUEJAS_RECLAMOS_SUGERENCIAS_Y_DENUNCIAS_PQRSD",11065,"PETICIONES_QUEJAS_RECLAMOS_SUGERENCIAS_Y_DENUNCIAS_PQRSD11065","ACTAS DEL COMITÉ SECTORIAL DE DESARROLLO ADMINISTRATIVO ","110.01.19"]
[null,null,null,"GRUPOINTERNODETRABAJODECIUDADESINTELIGENTES","GRUPO INTERNO DE TRABAJO DE CIUDADES INTELIGENTES","320.2","PLANES","PLANES",11066,"PLANES11066","ACTAS GRUPOS COMITÉS PRIMARIOS","110.01.26"]
[null,null,null,"GRUPOINTERNODETRABAJODECOBROCOACTIVO","GRUPO INTERNO DE TRABAJO DE COBRO COACTIVO",134,"ANTEPROYECTO DEL PRESUPUESTO DE INVERSIÓN","ANTEPROYECTO_DEL_PRESUPUESTO_DE_INVERSIÓN",11108,"ANTEPROYECTO_DEL_PRESUPUESTO_DE_INVERSIÓN11108","CONCEPTOS DE VIABILIDAD A LOS PROYECTOS DE INVERSIÓN","110.21.02"]
[null,null,null,"GRUPOINTERNODETRABAJODECOMUNICACIÓNEXTERNA","GRUPO INTERNO DE TRABAJO DE COMUNICACIÓN EXTERNA",151,"INFORMES","INFORMES",11147,"INFORMES11147","INFORMES A ENTES DE CONTROL Y VIGILANCIA","110.47.01"]
[null,null,null,"GRUPOINTERNODETRABAJODECONCEPTOS","GRUPO INTERNO DE TRABAJO DE CONCEPTOS",131,"PROYECTOS","PROYECTOS",11179,"PROYECTOS11179","INFORMES A OTROS ORGANISMOS","110.47.02"]
[null,null,null,"GRUPOINTERNODETRABAJODECONTABILIDAD","GRUPO INTERNO DE TRABAJO DE CONTABILIDAD",422,"INFORMES","INFORMES",11247,"INFORMES11247","INFORMES DE GESTIÓN","110.47.16"]
[null,null,null,"GRUPOINTERNODETRABAJODECONTRATACIÓN","GRUPO INTERNO DE TRABAJO DE CONTRATACIÓN",401,"PLANES","PLANES",11266,"PLANES11266","MANUALES DE PROCESOS Y PROCEDIMIENTOS","110.60.03"]
[null,null,null,"GRUPOINTERNODETRABAJODECONTROLINTERNODISCIPLINARIO","GRUPO INTERNO DE TRABAJO DE CONTROL INTERNO DISCIPLINARIO",402,"PROYECTOS","PROYECTOS",11279,"PROYECTOS11279","N/A","N/A"]
[null,null,null,{"$f":"SUBSTITUTE(E24,\" \",\"\")","v":"GRUPOINTERNODETRABAJODEEMPRENDIMIENTOAPPS.CO"},"GRUPO INTERNO DE TRABAJO DE EMPRENDIMIENTO APPS.CO",343,"ACTAS","ACTAS",11301,"ACTAS11301","PLANES ANTICORRUPCIÓN Y DE ATENCIÓN AL CIUDADANO","110.66.01"]
[null,null,null,"GRUPOINTERNODETRABAJODEESTADISTICASYESTUDIOSSECTORIALES","GRUPO INTERNO DE TRABAJO DE ESTADISTICAS Y ESTUDIOS SECTORIALES",113,"CERTIFICACIONES ","CERTIFICACIONES_",11314,"CERTIFICACIONES_11314","PLANES DE ATENCIÓN A VICTIMAS Y POBLACIONES VULNERABLES","110.66.06"]
[null,null,null,"GRUPOINTERNODETRABAJODEESTRATEGIATALENTODETECNOLOGIASDELAINFORMACIÓN","GRUPO INTERNO DE TRABAJO DE ESTRATEGIA TALENTO DE TECNOLOGIAS DE LA INFORMACIÓN",342,"ESTUDIOS ","ESTUDIOS_",11339,"ESTUDIOS_11339","PLANES DE EQUIDAD DE GENERO","110.66.08"]
[null,null,null,"GRUPOINTERNODETRABAJODEESTRUCTURACIÓNEINVESTIGACIÓN","GRUPO INTERNO DE TRABAJO DE ESTRUCTURACIÓN E INVESTIGACIÓN",231,"FORMULARIOS UNICOS DE REPORTE DE AVANCES DE LA GESTIÓN FURAG","FORMULARIOS_UNICOS_DE_REPORTE_DE_AVANCES_DE_LA_GESTIÓN_FURAG",11443,"FORMULARIOS_UNICOS_DE_REPORTE_DE_AVANCES_DE_LA_GESTIÓN_FURAG11443","N/A","N/A"]
[null,null,null,"GRUPOINTERNODETRABAJODEFOMENTOREGIONAL","GRUPO INTERNO DE TRABAJO DE FOMENTO REGIONAL",243,"INFORMES","INFORMES",11447,"INFORMES11447","INFORMES DE SEGUIMIENTO A  EJECUCIÓN PRESUPUESTAL","111.47.25"]
[null,null,null,"GRUPOINTERNODETRABAJODEFORTALECIMIENTODELASRELACIONESCONLOSGRUPOSDEINTERES","GRUPO INTERNO DE TRABAJO DE FORTALECIMIENTO DE LAS RELACIONES CON LOS GRUPOS DE INTERES",434,"PETICIONES QUEJAS RECLAMOS SUGERENCIAS Y DENUNCIAS PQRSD","PETICIONES_QUEJAS_RECLAMOS_SUGERENCIAS_Y_DENUNCIAS_PQRSD",11465,"PETICIONES_QUEJAS_RECLAMOS_SUGERENCIAS_Y_DENUNCIAS_PQRSD11465","PROYECTOS DE INVERSIÓN PRESUPUESTAL","111.79.04"]
[null,null,null,"GRUPOINTERNODETRABAJODEGESTIÓNDEESPECTRORADIOÉLECTRICO","GRUPO INTERNO DE TRABAJO DE GESTIÓN DE ESPECTRO RADIOÉLECTRICO","211.1","PROGRAMAS","PROGRAMAS",11478,"PROGRAMAS11478","INFORMES DE GESTIÓN","112.47"]
[null,null,null,"GRUPOINTERNODETRABAJODEGESTIÓNDELAINFORMACIÓN","GRUPO INTERNO DE TRABAJO DE GESTIÓN DE LA INFORMACIÓN",433,"ACTAS","ACTAS",12001,"ACTAS12001","PLANES DE ACCIÓN","112.66.04"]
[null,null,null,"GRUPOINTERNODETRABAJODEGESTIÓNDESERVICIOSADMINISTRATIVOS","GRUPO INTERNO DE TRABAJO DE GESTIÓN DE SERVICIOS ADMINISTRATIVOS",435,"ACUERDOS","ACUERDOS",12004,"ACUERDOS12004","PLANES DE ACCIÓN INSTITUCIONALES","112.66.05"]
[null,null,null,"GRUPOINTERNODETRABAJODEGESTIÓNDETALENTOHUMANO","GRUPO INTERNO DE TRABAJO DE GESTIÓN DE TALENTO HUMANO",436,"INFORMES","INFORMES",12047,"INFORMES12047","PLANES ESTRATÉGICOS SECTORIALES ","112.66.19"]
[null,null,null,"GRUPOINTERNODETRABAJODEGESTIONPENSIONAL","GRUPO INTERNO DE TRABAJO DE GESTION PENSIONAL",437,"INVENTARIOS","INVENTARIOS",12054,"INVENTARIOS12054","PROYECTOS DE GESTIÓN INTERNOS ","112.79.02"]
[null,null,null,"GRUPOINTERNODETRABAJODEINDUSTRIACREATIVADIGITAL","GRUPO INTERNO DE TRABAJO DE INDUSTRIA CREATIVA DIGITAL",344,"PLANES","PLANES",12066,"PLANES12066","ACTAS DE LA MESA TÉCNICA DE ESTADISTICAS TIC","113.01.03"]
[null,null,null,"GRUPOINTERNODETRABAJODEINDUSTRIADETECNOLOGIASDELAINFORMACIÓN","GRUPO INTERNO DE TRABAJO DE INDUSTRIA DE TECNOLOGIAS DE LA INFORMACIÓN",341,"PROCESOS DE INFORMACIÓN SECTORIAL","PROCESOS_DE_INFORMACIÓN_SECTORIAL",12072,"PROCESOS_DE_INFORMACIÓN_SECTORIAL12072","CERTIFICACIONES DE CALIDAD ESTADISTICA","113.14.01"]
[null,null,null,"GRUPOINTERNODETRABAJODEINVESTIGACIÓNDESARROLLOEINNOVACIÓN","GRUPO INTERNO DE TRABAJO DE INVESTIGACIÓN DESARROLLO E INNOVACIÓN","330.1","INFORMES","INFORMES",13047,"INFORMES13047","ESTUDIOS SECTORIALES","113.39.05"]
[null,null,null,"GRUPOINTERNODETRABAJODENOTIFICACIONES","GRUPO INTERNO DE TRABAJO DE NOTIFICACIONES",432,"PETICIONES QUEJAS RECLAMOS SUGERENCIAS Y DENUNCIAS PQRSD","PETICIONES_QUEJAS_RECLAMOS_SUGERENCIAS_Y_DENUNCIAS_PQRSD",13066,"PETICIONES_QUEJAS_RECLAMOS_SUGERENCIAS_Y_DENUNCIAS_PQRSD13066","N/A","N/A"]
[null,null,null,"GRUPOINTERNODETRABAJODEOFERTAREGIONAL","GRUPO INTERNO DE TRABAJO DE OFERTA REGIONAL",241,"PROYECTOS","PROYECTOS",13079,"PROYECTOS13079","INFORMES DE ADMINISTRACIÓN DE RIESGOS","114.47.03"]
[null,null,null,"GRUPOINTERNODETRABAJODEOPERACIONES","GRUPO INTERNO DE TRABAJO DE OPERACIONES",232,"CONCEPTOS","CONCEPTOS",13121,"CONCEPTOS13121","INFORMES DE ARQUITECTURA INSTITUCIONAL - COMPONENTE PROCESOS","114.47.04"]
[null,null,null,"GRUPOINTERNODETRABAJODEPLANEACIÓNYSEGUIMIENTOPRESUPUESTAL","GRUPO INTERNO DE TRABAJO DE PLANEACIÓN Y SEGUIMIENTO PRESUPUESTAL",111,"INFORMES","INFORMES",13147,"INFORMES13147","INFORMES DE CULTURA ORGANIZACIONAL Y APROPIACIÓN DEL MODELO INTEGRADO DE GESTIÓN","114.47.13"]
[null,null,null,"GRUPOINTERNODETRABAJODEPOLITICA","GRUPO INTERNO DE TRABAJO DE POLITICA","320.3","INFORMES","INFORMES",13247,"INFORMES13247","INFORMES DE SEGUIMIENTO A LAS POLÍTICAS DE GESTIÓN Y DESEMPEÑO","114.47.27"]
[null,null,null,"GRUPOINTERNODETRABAJODEPRESUPUESTO","GRUPO INTERNO DE TRABAJO DE PRESUPUESTO",423,"PETICIONES QUEJAS RECLAMOS SUGERENCIAS Y DENUNCIAS PQRSD","PETICIONES_QUEJAS_RECLAMOS_SUGERENCIAS_Y_DENUNCIAS_PQRSD",13266,"PETICIONES_QUEJAS_RECLAMOS_SUGERENCIAS_Y_DENUNCIAS_PQRSD13266","INFORMES DE SEGUIMIENTO, CONTROL Y MEJORA","114.47.29"]
[null,null,null,"GRUPOINTERNODETRABAJODEPROCESOSJUDICIALESYEXTRAJUDICIALES","GRUPO INTERNO DE TRABAJO DE PROCESOS JUDICIALES Y EXTRAJUDICIALES",133,"PROCESOS","PROCESOS",13270,"PROCESOS13270","INFORMES DEL EJE ARTICULADOR - LIDERAZGO, GESTIÓN DEL CONOCIMIENTO E INNOVACIÓN","114.47.30"]
[null,null,null,{"$f":"SUBSTITUTE(E45,\" \",\"\")","v":"GRUPOINTERNODETRABAJODEPROYECTOSREGIONALES"},"GRUPO INTERNO DE TRABAJO DE PROYECTOS REGIONALES",242,"ACTAS",{"$f":"SUBSTITUTE(G45,\" \",\"_\")","v":"ACTAS"},13301,{"$f":"_xlfn.CONCAT(H45,I45)","v":"ACTAS13301"},"N/A","N/A"]
[null,null,null,{"$f":"SUBSTITUTE(E46,\" \",\"\")","v":"GRUPOINTERNODETRABAJODERELACIONESINSTITUCIONALES"},"GRUPO INTERNO DE TRABAJO DE RELACIONES INSTITUCIONALES",233,"ACCIONES CONSTITUCIONALES",{"$f":"SUBSTITUTE(G46,\" \",\"_\")","v":"ACCIONES_CONSTITUCIONALES"},13302,{"$f":"_xlfn.CONCAT(H46,I46)","v":"ACCIONES_CONSTITUCIONALES13302"},"PROGRAMAS DE AMBIENTE Y CULTURA ORGANIZACIONAL","114.78.02"]
[null,null,null,"GRUPOINTERNODETRABAJODESEGUIMIENTOALAEJECUCIÓNCONTRACTUAL","GRUPO INTERNO DE TRABAJO DE SEGUIMIENTO A LA EJECUCIÓN CONTRACTUAL",411,"CONCILIACIONES",{"$f":"SUBSTITUTE(G47,\" \",\"_\")","v":"CONCILIACIONES"},13322,{"$f":"_xlfn.CONCAT(H47,I47)","v":"CONCILIACIONES13322"},"ACTAS DEL COMITÉ DE CONTROL DE CAMBIOS","120.01.09"]
[null,null,null,"GRUPOINTERNODETRABAJODESEGUIMIENTOALAESTRATEGIA","GRUPO INTERNO DE TRABAJO DE SEGUIMIENTO A LA ESTRATEGIA",112,"INFORMES",{"$f":"SUBSTITUTE(G48,\" \",\"_\")","v":"INFORMES"},13347,{"$f":"_xlfn.CONCAT(H48,I48)","v":"INFORMES13347"},"ACTAS DEL COMITÉ DE COOPERACIÓN DEL SISTEMA COLOMBIA TIC","120.01.11"]
[null,null,null,"GRUPOINTERNODETRABAJODESEGUIMIENTOALAGESTIÓNDEINGRESOSDELFONDOTIC","GRUPO INTERNO DE TRABAJO DE SEGUIMIENTO A LA GESTIÓN DE INGRESOS DEL FONDO TIC",412,"PROCESOS",{"$f":"SUBSTITUTE(G49,\" \",\"_\")","v":"PROCESOS"},13370,{"$f":"_xlfn.CONCAT(H49,I49)","v":"PROCESOS13370"},"ACUERDOS DE SERVICIOS ESTRATÉGICOS CON ENTIDADES DEL SECTOR","120.04.07"]
[null,null,null,"GRUPOINTERNODETRABAJODESEGURIDADYPRIVACIDADDELAINFORMACIÓN","GRUPO INTERNO DE TRABAJO DE SEGURIDAD Y PRIVACIDAD DE LA INFORMACIÓN","320.1","ACUERDOS ",{"$f":"SUBSTITUTE(G50,\" \",\"_\")","v":"ACUERDOS_"},13404,{"$f":"_xlfn.CONCAT(H50,I50)","v":"ACUERDOS_13404"},"INFORMES DE ESTADISTICAS SECTORIALES","120.47.15"]
[null,null,null,"GRUPOINTERNODETRABAJODETESORERIA","GRUPO INTERNO DE TRABAJO DE TESORERIA",421,"CUOTAS PARTES PENSIONALES","CUOTAS_PARTES_PENSIONALES",13430,"CUOTAS_PARTES_PENSIONALES13430","INFORMES DE GESTIÓN","120.47.16"]
[null,null,null,"GRUPOINTERNODETRABAJODETRANSFORMACIÓNORGANIZACIONAL","GRUPO INTERNO DE TRABAJO DE TRANSFORMACIÓN ORGANIZACIONAL",114,"INFORMES","INFORMES",13447,"INFORMES13447","INVENTARIOS DE ACTIVOS DE INFORMACIÓN","120.54.01"]
[null,null,null,"GRUPOINTERNODETRABAJOESPECIALIZADODERECURSOSYACTUACIONESADMINISTRATIVAS","GRUPO INTERNO DE TRABAJO ESPECIALIZADO DE RECURSOS Y ACTUACIONES ADMINISTRATIVAS",201,"PROCESOS","PROCESOS",13470,"PROCESOS13470","PLANES INSTITUCIONALES","120.66.20"]
[null,null,null,"GRUPOINTERNODETRABAJOPARAELCONSENSOSOCIAL","GRUPO INTERNO DE TRABAJO PARA EL CONSENSO SOCIAL",101,"ACUERDOS INTERNACIONALES ","ACUERDOS_INTERNACIONALES_",14005,"ACUERDOS_INTERNACIONALES_14005","N/A","N/A"]
[null,null,null,"GRUPOINTERNODETRABAJOTÉCNICODEINNOVACIÓNSOCIALYAPROPIACIÓNENCOMUNIDADES","GRUPO INTERNO DE TRABAJO TÉCNICO DE INNOVACIÓN SOCIAL Y APROPIACIÓN EN COMUNIDADES","310.1","INFORMES","INFORMES",14047,"INFORMES14047","INFORMES DE GESTIÓN","130.47.16"]
[null,null,null,"OFICINAASESORADEPLANEACIÓNYESTUDIOSSECTORIALES","OFICINA ASESORA DE PLANEACIÓN Y ESTUDIOS SECTORIALES",110,"BOLETINES INFORMATIVOS","BOLETINES_INFORMATIVOS",15012,"BOLETINES_INFORMATIVOS15012","INFORME DE PARTICIPACIÓN EN EL COMITÉ DE ESTABILIDAD JURÍDICA","130.47.19"]
[null,null,null,"OFICINAASESORADEPRENSA","OFICINA ASESORA DE PRENSA ",150,"COMUNICADOS DE PRENSA","COMUNICADOS_DE_PRENSA",15020,"COMUNICADOS_DE_PRENSA15020","INFORMES DE PATRIMONIOS AUTONOMOS DE REMANENTES PAR TELECOM","130.47.21"]
[null,null,null,"OFICINAASESORAJURIDICA","OFICINA ASESORA JURIDICA",130,"INFORMES","INFORMES",15047,"INFORMES15047","N/A","N/A"]
[null,null,null,"OFICINADECONTROLINTERNO","OFICINA DE CONTROL INTERNO",160,"PETICIONES QUEJAS RECLAMOS SUGERENCIAS Y DENUNCIAS PQRSD","PETICIONES_QUEJAS_RECLAMOS_SUGERENCIAS_Y_DENUNCIAS_PQRSD",15065,"PETICIONES_QUEJAS_RECLAMOS_SUGERENCIAS_Y_DENUNCIAS_PQRSD15065","PROYECTOS NORMATIVOS","130.79.10"]
[null,null,null,"OFICINADETECNOLOGIASDELAINFORMACIÓN","OFICINA DE TECNOLOGIAS DE LA INFORMACIÓN",120,"INFORMES","INFORMES",15147,"INFORMES15147","CONCEPTOS JUIRDICOS","131.21.04"]
[null,null,null,"OFICINAINTERNACIONAL","OFICINA INTERNACIONAL",140,"PETICIONES QUEJAS RECLAMOS SUGERENCIAS Y DENUNCIAS PQRSD","PETICIONES_QUEJAS_RECLAMOS_SUGERENCIAS_Y_DENUNCIAS_PQRSD",15165,"PETICIONES_QUEJAS_RECLAMOS_SUGERENCIAS_Y_DENUNCIAS_PQRSD15165","INFORMES DE GESTIÓN","131.47.16"]
[null,null,null,"OFICINAPARALAGESTIÓNDEINGRESOSDELFONDO","OFICINA PARA LA GESTIÓN DE INGRESOS DEL FONDO",410,"PLANES","PLANES",15166,"PLANES15166","INFORMES DE GESTIÓN","132.47.16"]
[null,null,null,"SECRETARÍAGENERAL","SECRETARÍA GENERAL",400,"ACTAS","ACTAS",16001,"ACTAS16001","N/A","N/A"]
[null,null,null,"SUBDIRECCIÓNADMINISTRATIVAYDEGESTIÓNHUMANA","SUBDIRECCIÓN ADMINISTRATIVA Y DE GESTIÓN HUMANA",430,"INFORMES","INFORMES",16047,"INFORMES16047","PROCESOS SANCIONATORIOS EN LAS ACTUACIONES ADMINISTRATIVAS","132.70.18"]
[null,null,null,"SUBDIRECCIÓNDEASUNTOSPOSTALES","SUBDIRECCIÓN DE ASUNTOS POSTALES",213,"PETICIONES QUEJAS RECLAMOS SUGERENCIAS Y DENUNCIAS PQRSD","PETICIONES_QUEJAS_RECLAMOS_SUGERENCIAS_Y_DENUNCIAS_PQRSD",16065,"PETICIONES_QUEJAS_RECLAMOS_SUGERENCIAS_Y_DENUNCIAS_PQRSD16065","ACTAS DEL COMITÉ DE CONCILIACIÓN Y DEFENSA JUDICIAL ","133.01.07"]
[null,null,null,"SUBDIRECCIÓNDECOMERCIOELECTRÓNICO","SUBDIRECCIÓN DE COMERCIO ELECTRÓNICO",331,"PLANES","PLANES",16066,"PLANES16066","ACTAS DEL SUCOMITÉ SECTORIAL DE DEFENSA JURIDICA","133.01.25"]
[null,null,null,"SUBDIRECCIÓNDECULTURADIGITAL","SUBDIRECCIÓN DE CULTURA DIGITAL",312,"PROGRAMAS","PROGRAMAS",16078,"PROGRAMAS16078","ACCIONES DE CUMPLIMIENTO","133.02.01"]
[null,null,null,"SUBDIRECCIÓNDEDIGITALIZACIÓNSECTORIAL","SUBDIRECCIÓN DE DIGITALIZACIÓN SECTORIAL",332,"INFORMES","INFORMES",20047,"INFORMES20047","ACCIONES DE GRUPO","133.02.02"]
[null,null,null,{"$f":"SUBSTITUTE(E69,\" \",\"\")","v":"SUBDIRECCIÓNDEESTANDARESYARQUITECTURADETECNOLOGÍADELAINFORMACIÓN"},"SUBDIRECCIÓN DE ESTANDARES Y ARQUITECTURA DE TECNOLOGÍA DE LA INFORMACIÓN",322,"PETICIONES QUEJAS RECLAMOS SUGERENCIAS Y DENUNCIAS PQRSD","PETICIONES_QUEJAS_RECLAMOS_SUGERENCIAS_Y_DENUNCIAS_PQRSD",20065,"PETICIONES_QUEJAS_RECLAMOS_SUGERENCIAS_Y_DENUNCIAS_PQRSD20065","ACCIONES DE INCONSTITUCIONALIDAD","133.02.03"]
[null,null,null,"SUBDIRECCIÓNDEGOBIERNOENLINEA","SUBDIRECCIÓN DE GOBIERNO EN LINEA",321,"INFORMES","INFORMES",20147,"INFORMES20147","ACCIONES DE TUTELA","133.02.04"]
[null,null,null,"SUBDIRECCIÓNDEPROCESOSDEAPROPIACIÓNDETECNOLOGÍASDELAINFORMACIÓNYLASCOMUNICACIONES","SUBDIRECCIÓN DE PROCESOS DE APROPIACIÓN DE TECNOLOGÍAS DE LA INFORMACIÓN Y LAS COMUNICACIONES",311,"INSTRUMENTOS DE CONTROL PARA LAS ACTUACIONES ADMINISTRATIVAS","INSTRUMENTOS_DE_CONTROL_PARA_LAS_ACTUACIONES_ADMINISTRATIVAS",20152,"INSTRUMENTOS_DE_CONTROL_PARA_LAS_ACTUACIONES_ADMINISTRATIVAS20152","ACCIONES POPULARES","133.02.05"]
[null,null,null,"SUBDIRECCIÓNDERADIODIFUSIÓNSONORA","SUBDIRECCIÓN DE RADIO DIFUSIÓN SONORA",212,"PETICIONES QUEJAS RECLAMOS SUGERENCIAS Y DENUNCIAS PQRSD","PETICIONES_QUEJAS_RECLAMOS_SUGERENCIAS_Y_DENUNCIAS_PQRSD",20165,"PETICIONES_QUEJAS_RECLAMOS_SUGERENCIAS_Y_DENUNCIAS_PQRSD20165","CONCILIACIONES EXTRAJUDICIALES","133.22.06"]
[null,null,null,"SUBDIRECCIÓNDEVIGILANCIAYCONTROLDECOMUNICACIONES","SUBDIRECCIÓN DE VIGILANCIA Y CONTROL DE COMUNICACIONES",221,"CONCEPTOS","CONCEPTOS",21021,"CONCEPTOS21021","INFORMES A ENTES DE CONTROL Y VIGILANCIA","133.47.01"]
[null,null,null,"SUBDIRECCIÓNDEVIGILANCIAYCONTROLDERADIODIFUSIÓNSONORA","SUBDIRECCIÓN DE VIGILANCIA Y CONTROL DE RADIODIFUSIÓN SONORA",222,"INFORMES","INFORMES",21047,"INFORMES21047","INFORMES DE GESTIÓN","133.47.16"]
[null,null,null,"SUBDIRECCIÓNDEVIGILANCIAYCONTROLDESERVICIOSPOSTALES","SUBDIRECCIÓN DE VIGILANCIA Y CONTROL DE SERVICIOS POSTALES",223,"PETICIONES QUEJAS RECLAMOS SUGERENCIAS Y DENUNCIAS PQRSD","PETICIONES_QUEJAS_RECLAMOS_SUGERENCIAS_Y_DENUNCIAS_PQRSD",21065,"PETICIONES_QUEJAS_RECLAMOS_SUGERENCIAS_Y_DENUNCIAS_PQRSD21065","PROCESOS JUDICIALES DE AMPARO POLICIVO","133.70.05"]
[null,null,null,"SUBDIRECCIÓNFINANCIERA","SUBDIRECCIÓN FINANCIERA",420,"PROCESOS DE SELECCIÓN OBJETIVA DEL ESPECTRO","PROCESOS_DE_SELECCIÓN_OBJETIVA_DEL_ESPECTRO",21074,"PROCESOS_DE_SELECCIÓN_OBJETIVA_DEL_ESPECTRO21074","PROCESOS JUDICIALES DE CONFLICTOS DE COMPETENCIAS","133.70.06"]
[null,null,null,"SUBDIRECCIÓNPARALAINDUSTRIADECOMUNICACIONES","SUBDIRECCIÓN PARA LA INDUSTRIA DE COMUNICACIONES",211,"PROYECTOS","PROYECTOS",21079,"PROYECTOS21079","PROCESOS JUDICIALES DE CONTROVERSIAS CONTRACTUAL","133.70.07"]
[null,null,null,null,null,null,"INFORMES ","INFORMES_",211147,"INFORMES_211147","PROCESOS JUDICIALES DE LAUDO ARBITRAL","133.70.08"]
[null,null,null,null,null,null,"PETICIONES QUEJAS RECLAMOS SUGERENCIAS Y DENUNCIAS PQRSD","PETICIONES_QUEJAS_RECLAMOS_SUGERENCIAS_Y_DENUNCIAS_PQRSD",211165,"PETICIONES_QUEJAS_RECLAMOS_SUGERENCIAS_Y_DENUNCIAS_PQRSD211165","PROCESOS JUDICIALES DE LIQUIDACIÓN VOLUNTARIA","133.70.09"]
[null,null,null,null,null,null,"PROCESO DE ASIGNACIÓN DIRECTA DEL ESPECTRO RADIOELECTRICO ","PROCESO_DE_ASIGNACIÓN_DIRECTA_DEL_ESPECTRO_RADIOELECTRICO_",211171,"PROCESO_DE_ASIGNACIÓN_DIRECTA_DEL_ESPECTRO_RADIOELECTRICO_211171","PROCESOS JUDICIALES DE NULIDAD","133.70.10"]
[null,null,null,null,null,null,"PROCESOS DE SELECCIÓN OBJETIVA PARA ASIGNACIÓN DEL ESPECTRO RADIOELÉCTRICO","PROCESOS_DE_SELECCIÓN_OBJETIVA_PARA_ASIGNACIÓN_DEL_ESPECTRO_RADIOELÉCTRICO",211175,"PROCESOS_DE_SELECCIÓN_OBJETIVA_PARA_ASIGNACIÓN_DEL_ESPECTRO_RADIOELÉCTRICO211175","PROCESOS JUDICIALES DE NULIDAD POR INSCONSTITUCIONALIDAD","133.70.11"]
[null,null,null,null,null,null,"REGISTRO DE RADIOAFICIONADOS Y RADIOS ITINERANTES","REGISTRO_DE_RADIOAFICIONADOS_Y_RADIOS_ITINERANTES",211181,"REGISTRO_DE_RADIOAFICIONADOS_Y_RADIOS_ITINERANTES211181","PROCESOS JUDICIALES DE NULIDAD Y RESTABLECIMIENTO DEL DERECHO","133.70.12"]
[null,null,null,null,null,null,"REGISTROS DE ASOCIACIONES DE RADIOAFICIONADOS Y DE BANDA CIUDADANA","REGISTROS_DE_ASOCIACIONES_DE_RADIOAFICIONADOS_Y_DE_BANDA_CIUDADANA",211182,"REGISTROS_DE_ASOCIACIONES_DE_RADIOAFICIONADOS_Y_DE_BANDA_CIUDADANA211182","PROCESOS JUDICIALES DE REPARACIÓN DIRECTA","133.70.13"]
[null,null,null,null,null,null,"REGISTROS DE PROVEEDOR DE CAPACIDAD SATELITAL","REGISTROS_DE_PROVEEDOR_DE_CAPACIDAD_SATELITAL",211187,"REGISTROS_DE_PROVEEDOR_DE_CAPACIDAD_SATELITAL211187","PROCESOS JUDICIALES DE RESTITUCIÓN DE TIERRAS","133.70.14"]
[null,null,null,null,null,null,"INFORMES","INFORMES",211247,"INFORMES211247","PROCESOS JUDICIALES EJECUTIVOS","133.70.15"]
[null,null,null,null,null,null,"PETICIONES QUEJAS RECLAMOS SUGERENCIAS Y DENUNCIAS PQRSD","PETICIONES_QUEJAS_RECLAMOS_SUGERENCIAS_Y_DENUNCIAS_PQRSD",211265,"PETICIONES_QUEJAS_RECLAMOS_SUGERENCIAS_Y_DENUNCIAS_PQRSD211265","PROCESOS JUDICIALES ORDINARIO LABORAL","133.70.16"]
[null,null,null,null,null,null,"PROYECTOS","PROYECTOS",211279,"PROYECTOS211279","PROCESOS PENALES","133.70.17"]
[null,null,null,null,null,null,"REGISTROS DE GESTIÓN DE GARANTÍAS Y COBRO COACTIVO",{"$f":"SUBSTITUTE(G88,\" \",\"_\")","v":"REGISTROS_DE_GESTIÓN_DE_GARANTÍAS_Y_COBRO_COACTIVO"},211283,{"$f":"_xlfn.CONCAT(H88,I88)","v":"REGISTROS_DE_GESTIÓN_DE_GARANTÍAS_Y_COBRO_COACTIVO211283"},"PROCESOS Y ACTUACIONES ADMINISTRATIVAS","133.70.20"]
[null,null,null,null,null,null,"ACTAS",{"$f":"SUBSTITUTE(G89,\" \",\"_\")","v":"ACTAS"},21101,{"$f":"_xlfn.CONCAT(H89,I89)","v":"ACTAS21101"},"PROCESOS VERBALES","133.70.19"]
[null,null,null,null,null,null,"PETICIONES QUEJAS RECLAMOS SUGERENCIAS Y DENUNCIAS PQRSD","PETICIONES_QUEJAS_RECLAMOS_SUGERENCIAS_Y_DENUNCIAS_PQRSD",21165,"PETICIONES_QUEJAS_RECLAMOS_SUGERENCIAS_Y_DENUNCIAS_PQRSD21165","ACUERDOS DE LIQUIDACIÓN OBLIGATORIA","134.04.01"]
[null,null,null,null,null,null,"PROYECTOS","PROYECTOS",21179,"PROYECTOS21179","ACUERDOS DE LIQUIDACIÓN VOLUNTARIA","134.04.02"]
[null,null,null,null,null,null,"REGISTROS DE GESTIÓN DE PLANES DE ACCIÓN SEGUIMIENTO Y MEJORA","REGISTROS_DE_GESTIÓN_DE_PLANES_DE_ACCIÓN_SEGUIMIENTO_Y_MEJORA",21184,"REGISTROS_DE_GESTIÓN_DE_PLANES_DE_ACCIÓN_SEGUIMIENTO_Y_MEJORA21184","ACUERDOS DE REESTRUCTURACIÓN DE PASIVOS","134.04.04"]
[null,null,null,null,null,null,"REGISTROS DE LA GESTIÓN  DE TRÁMITES REGISTROS AUTORIZACIONES LICENCIAS Y PERMISOS","REGISTROS_DE_LA_GESTIÓN__DE_TRÁMITES_REGISTROS_AUTORIZACIONES_LICENCIAS_Y_PERMISOS",21185,"REGISTROS_DE_LA_GESTIÓN__DE_TRÁMITES_REGISTROS_AUTORIZACIONES_LICENCIAS_Y_PERMISOS21185","ACUERDOS DE REESTRUCTURACIÓN EMPRESARIAL","134.04.05"]
[null,null,null,null,null,null,"REGISTROS DE PARTICIPACIÓN EN COMISIONES TÉCNICAS O NORMATIVAS","REGISTROS_DE_PARTICIPACIÓN_EN_COMISIONES_TÉCNICAS_O_NORMATIVAS",21186,"REGISTROS_DE_PARTICIPACIÓN_EN_COMISIONES_TÉCNICAS_O_NORMATIVAS21186","ACUERDOS DE REORGANIZACIÓN EMPRESARIAL","134.04.06"]
[null,null,null,null,null,null,"REQUERIMENTOS DE AJUSTES DE BASES DE DATOS","REQUERIMENTOS_DE_AJUSTES_DE_BASES_DE_DATOS",21190,"REQUERIMENTOS_DE_AJUSTES_DE_BASES_DE_DATOS21190","ACUERDO EXTRAJUDICIAL DE VALIDACIÓN","134.04.08"]
[null,null,null,null,null,null,"SOLICITUDES DENEGADAS RECHAZADAS O INADMITIDAS SIN EXPEDIENTE EXISTENTE","SOLICITUDES_DENEGADAS_RECHAZADAS_O_INADMITIDAS_SIN_EXPEDIENTE_EXISTENTE",21195,"SOLICITUDES_DENEGADAS_RECHAZADAS_O_INADMITIDAS_SIN_EXPEDIENTE_EXISTENTE21195","COBRO COACTIVO","134.30.01"]
[null,null,null,null,null,null,"ACTAS","ACTAS",21201,"ACTAS21201","INFORMES A ENTES DE CONTROL Y VIGILANCIA","134.47.01"]
[null,null,null,null,null,null,"ESTUDIOS","ESTUDIOS",21239,"ESTUDIOS21239","INFORMES A OTROS ORGANISMOS","134.47.02"]
[null,null,null,null,null,null,"LICENCIAS DE CONCESIÓN DE SERVICIOS DE RADIODIFUSIÓN SONORA","LICENCIAS_DE_CONCESIÓN_DE_SERVICIOS_DE_RADIODIFUSIÓN_SONORA",21258,{"$f":"_xlfn.CONCAT(H99,I99)","v":"LICENCIAS_DE_CONCESIÓN_DE_SERVICIOS_DE_RADIODIFUSIÓN_SONORA21258"},"INFORMES DE GESTIÓN","134.47.16"]
[null,null,null,null,null,null,"PETICIONES QUEJAS RECLAMOS SUGERENCIAS Y DENUNCIAS PQRSD","PETICIONES_QUEJAS_RECLAMOS_SUGERENCIAS_Y_DENUNCIAS_PQRSD",21265,"PETICIONES_QUEJAS_RECLAMOS_SUGERENCIAS_Y_DENUNCIAS_PQRSD21265","PROCESOS EJECUTIVOS ABIERTOS DE COBRO COACTIVO","134.70.04"]
[null,null,null,null,null,null,"PLANES","PLANES",21266,"PLANES21266","ACUERDOS INTERNACIONALES DE COOPERACIÓN","140.05.01"]
[null,null,null,null,null,null,"POLITICA NACIONAL DE RADIODIFUSIÓN SONORA","POLITICA_NACIONAL_DE_RADIODIFUSIÓN_SONORA",21267,"POLITICA_NACIONAL_DE_RADIODIFUSIÓN_SONORA21267","INFORMES A OTROS ORGANISMOS","140.47.02"]
[null,null,null,null,null,null,"PROCESOS DE SELECCIÓN OBJETIVA ASIGNACIÓN DE LICENCIAS DE RADIODIFUSIÓN SONORA","PROCESOS_DE_SELECCIÓN_OBJETIVA_ASIGNACIÓN_DE_LICENCIAS_DE_RADIODIFUSIÓN_SONORA",21273,"PROCESOS_DE_SELECCIÓN_OBJETIVA_ASIGNACIÓN_DE_LICENCIAS_DE_RADIODIFUSIÓN_SONORA21273","INFORMES DE COMISIONES INTERNACIONALES","140.47.10"]
[null,null,null,null,null,null,"PROYECTOS","PROYECTOS",21279,"PROYECTOS21279","INFORMES DE GESTIÓN","140.47.16"]
[null,null,null,null,null,null,"CONCEPTOS","CONCEPTOS",21321,{"$f":"_xlfn.CONCAT(H105,I105)","v":"CONCEPTOS21321"},null,"150.12.03"]
[null,null,null,null,null,null,"CONVENIOS  DEL CODIGO POSTAL DE LA REPÚBLICA DE COLOMBIA","CONVENIOS__DEL_CODIGO_POSTAL_DE_LA_REPÚBLICA_DE_COLOMBIA",21325,{"$f":"_xlfn.CONCAT(H106,I106)","v":"CONVENIOS__DEL_CODIGO_POSTAL_DE_LA_REPÚBLICA_DE_COLOMBIA21325"},"N/A","N/A"]
[null,null,null,null,null,null,"INFORMES","INFORMES",21347,{"$f":"_xlfn.CONCAT(H107,I107)","v":"INFORMES21347"},"INFORMES DE GESTIÓN ","150.47.16"]
[null,null,null,null,null,null,"INSCRIPCIÓN DE OPERADORES EN EL REGISTRO POSTAL","INSCRIPCIÓN_DE_OPERADORES_EN_EL_REGISTRO_POSTAL",21348,{"$f":"_xlfn.CONCAT(H108,I108)","v":"INSCRIPCIÓN_DE_OPERADORES_EN_EL_REGISTRO_POSTAL21348"},"INFORMES DE GESTIÓN AUDIOVISUALES","150.47.17"]
[null,null,null,null,null,null,"INVENTARIOS DEL MUSEO DE TECNOLOGIAS DE LA INFORMACIÓN Y LAS COMUNICACIONES",{"$f":"SUBSTITUTE(G109,\" \",\"_\")","v":"INVENTARIOS_DEL_MUSEO_DE_TECNOLOGIAS_DE_LA_INFORMACIÓN_Y_LAS_COMUNICACIONES"},21353,{"$f":"_xlfn.CONCAT(H109,I109)","v":"INVENTARIOS_DEL_MUSEO_DE_TECNOLOGIAS_DE_LA_INFORMACIÓN_Y_LAS_COMUNICACIONES21353"},"N/A","N/A"]
[null,null,null,null,null,null,"POLITICA DE SERVICIOS POSTALES","POLITICA_DE_SERVICIOS_POSTALES",21367,"POLITICA_DE_SERVICIOS_POSTALES21367","INFORMES DE GESTIÓN","151.47.16"]
[null,null,null,null,null,null,"RESOLUCIONES DE HABILITACIÓN DE SERVICIOS POSTALES","RESOLUCIONES_DE_HABILITACIÓN_DE_SERVICIOS_POSTALES",21393,"RESOLUCIONES_DE_HABILITACIÓN_DE_SERVICIOS_POSTALES21393","N/A","N/A"]
[null,null,null,null,null,null,"SOLICITUDES DE EMISIONES FILATELICAS","SOLICITUDES_DE_EMISIONES_FILATELICAS",21394,"SOLICITUDES_DE_EMISIONES_FILATELICAS21394","PLANES DE DIVULGACIÓN","151.66.07"]
[null,null,null,null,null,null,"INFORMES","INFORMES",22047,"INFORMES22047","ACTAS DEL COMITÉ DE COORDINACIÓN DEL SISTEMA DE CONTROL INTERNO","160.01.02"]
[null,null,null,null,null,null,"PETICIONES QUEJAS RECLAMOS SUGERENCIAS Y DENUNCIAS PQRSD","PETICIONES_QUEJAS_RECLAMOS_SUGERENCIAS_Y_DENUNCIAS_PQRSD",22065,"PETICIONES_QUEJAS_RECLAMOS_SUGERENCIAS_Y_DENUNCIAS_PQRSD22065","INFORMES A ENTIDADES DE CONTROL Y VIGILANCIA","160.47.01"]
[null,null,null,null,null,null,"PROCESOS ","PROCESOS_",22070,"PROCESOS_22070","INFORMES DE AUDITORIAS DE CALIDAD","160.47.05"]
[null,null,null,null,null,null,"PROGRAMAS","PROGRAMAS",22078,"PROGRAMAS22078","INFORMES DE AUDITORIAS DE GESTIÓN","160.47.06"]
[null,null,null,null,null,null,"ACTUACIONES DE VIGILANCIA Y CONTROL ",{"$f":"SUBSTITUTE(G117,\" \",\"_\")","v":"ACTUACIONES_DE_VIGILANCIA_Y_CONTROL_"},22103,{"$f":"_xlfn.CONCAT(H117,I117)","v":"ACTUACIONES_DE_VIGILANCIA_Y_CONTROL_22103"},"INFORMES DE GESTIÓN","160.47.16"]
[null,null,null,null,null,null,"INFORMES","INFORMES",22147,"INFORMES22147","N/A","N/A"]
[null,null,null,null,null,null,"PETICIONES QUEJAS RECLAMOS SUGERENCIAS Y DENUNCIAS PQRSD","PETICIONES_QUEJAS_RECLAMOS_SUGERENCIAS_Y_DENUNCIAS_PQRSD",22165,"PETICIONES_QUEJAS_RECLAMOS_SUGERENCIAS_Y_DENUNCIAS_PQRSD22165","PLANES DE MEJORAMIENTO DE CALIDAD Y GESTIÓN","160.66.11"]
[null,null,null,null,null,null,"PROCESOS","PROCESOS",22170,"PROCESOS22170","PLANES DE MEJORAMIENTO PARA CONTRALORIA","160.66.13"]
[null,null,null,null,null,null,"PROGRAMAS","PROGRAMAS",22178,"PROGRAMAS22178","PROGRAMAS ANUALES DE AUDITORIAS","160.78.01"]
[null,null,null,null,null,null,"CONCEPTOS","CONCEPTOS",22221,"CONCEPTOS22221","INFORMES DE GESTIÓN","200.47.16"]
[null,null,null,null,null,null,"INFORMES","INFORMES",22247,"INFORMES22247","N/A","N/A"]
[null,null,null,null,null,null,"PETICIONES QUEJAS RECLAMOS SUGERENCIAS Y DENUNCIAS PQRSD","PETICIONES_QUEJAS_RECLAMOS_SUGERENCIAS_Y_DENUNCIAS_PQRSD",22265,"PETICIONES_QUEJAS_RECLAMOS_SUGERENCIAS_Y_DENUNCIAS_PQRSD22265","INFORMES DE GESTIÓN","201.47.16"]
[null,null,null,null,null,null,"PROCESOS","PROCESOS",22270,"PROCESOS22270","N/A","N/A"]
[null,null,null,null,null,null,"PROGRAMAS","PROGRAMAS",22278,"PROGRAMAS22278","N/A","N/A"]
[null,null,null,null,null,null,"CONCEPTOS","CONCEPTOS",22321,"CONCEPTOS22321","CONCEPTOS TÉCNICOS SOBRE SERVICIOS DE TELECOMUNICACIONES ","210.21.06"]
[null,null,null,null,null,null,"INFORMES","INFORMES",22347,"INFORMES22347","INFORMES DE GESTIÓN","210.47.16"]
[null,null,null,null,null,null,"PETICIONES QUEJAS RECLAMOS SUGERENCIAS Y DENUNCIAS QRSD","PETICIONES_QUEJAS_RECLAMOS_SUGERENCIAS_Y_DENUNCIAS_QRSD",22365,"PETICIONES_QUEJAS_RECLAMOS_SUGERENCIAS_Y_DENUNCIAS_QRSD22365","N/A","N/A"]
[null,null,null,null,null,null,"PROCESOS","PROCESOS",22370,"PROCESOS22370","N/A","N/A"]
[null,null,null,null,null,null,"PROGRAMAS","PROGRAMAS",22378,"PROGRAMAS22378","PROYECTOS DE INVERSIÓN","210.79.03"]
[null,null,null,null,null,null,"INFORMES","INFORMES",23047,"INFORMES23047","PROYECTOS POR OBLIGACIONES DE HACER","210.79.12"]
[null,null,null,null,null,null,"PLANES","PLANES",23066,"PLANES23066","ACTAS DEL COMITÉ DE OBLIGACIONES DE HACER","211.01.13"]
[null,null,null,null,null,null,"INFORMES","INFORMES",23147,"INFORMES23147","N/A","N/A"]
[null,null,null,null,null,null,"INFORMES","INFORMES",23247,"INFORMES23247","PROYECTOS TÉCNICOS Y NORMATIVOS","211.79.13"]
[null,null,null,null,null,null,"EVIDENCIAS EN EL MARCO DE LA ARTICULACIÓN TERRITORIAL","EVIDENCIAS_EN_EL_MARCO_DE_LA_ARTICULACIÓN_TERRITORIAL",23342,"EVIDENCIAS_EN_EL_MARCO_DE_LA_ARTICULACIÓN_TERRITORIAL23342","N/A","N/A"]
[null,null,null,null,null,null,"INFORMES","INFORMES",23347,"INFORMES23347","N/A","N/A"]
[null,null,null,null,null,null,"PETICIONES QUEJAS RECLAMOS SUGERENCIAS Y DENUNCIAS PQRSD","PETICIONES_QUEJAS_RECLAMOS_SUGERENCIAS_Y_DENUNCIAS_PQRSD",23365,"PETICIONES_QUEJAS_RECLAMOS_SUGERENCIAS_Y_DENUNCIAS_PQRSD23365","N/A","N/A"]
[null,null,null,null,null,null,"INFORMES","INFORMES",24047,"INFORMES24047","N/A","N/A"]
[null,null,null,null,null,null,"INFORMES","INFORMES",24147,"INFORMES24147","N/A","N/A"]
[null,null,null,null,null,null,"MATRICES DE OFERTA INSTITUCIONAL","MATRICES_DE_OFERTA_INSTITUCIONAL",24161,"MATRICES_DE_OFERTA_INSTITUCIONAL24161","INFORMES DE PARTICIPACIÓN EN COMISIONES TÉCNICAS O NORMATIVAS","211.1.47.18"]
[null,null,null,null,null,null,"PETICIONES QUEJAS RECLAMOS SUGERENCIAS Y DENUNCIAS PQRSD","PETICIONES_QUEJAS_RECLAMOS_SUGERENCIAS_Y_DENUNCIAS_PQRSD",24165,"PETICIONES_QUEJAS_RECLAMOS_SUGERENCIAS_Y_DENUNCIAS_PQRSD24165","N/A","N/A"]
[null,null,null,null,null,null,"INFORMES","INFORMES",24247,"INFORMES24247","N/A","N/A"]
[null,null,null,null,null,null,"PETICIONES QUEJAS RECLAMOS SUGERENCIAS Y DENUNCIAS PQRSD","PETICIONES_QUEJAS_RECLAMOS_SUGERENCIAS_Y_DENUNCIAS_PQRSD",24265,"PETICIONES_QUEJAS_RECLAMOS_SUGERENCIAS_Y_DENUNCIAS_PQRSD24265","N/A","N/A"]
[null,null,null,null,null,null,"INFORMES","INFORMES",24347,"INFORMES24347","N/A","N/A"]
[null,null,null,null,null,null,"PETICIONES QUEJAS RECLAMOS SUGERENCIAS Y DENUNCIAS PQRSD","PETICIONES_QUEJAS_RECLAMOS_SUGERENCIAS_Y_DENUNCIAS_PQRSD",24365,"PETICIONES_QUEJAS_RECLAMOS_SUGERENCIAS_Y_DENUNCIAS_PQRSD24365","N/A","N/A"]
[null,null,null,null,null,null,"INFORMES","INFORMES",30047,"INFORMES30047","N/A","N/A"]
[null,null,null,null,null,null,"PETICIONES QUEJAS RECLAMOS SUGERENCIAS Y DENUNCIAS PQRSD","PETICIONES_QUEJAS_RECLAMOS_SUGERENCIAS_Y_DENUNCIAS_PQRSD",30065,"PETICIONES_QUEJAS_RECLAMOS_SUGERENCIAS_Y_DENUNCIAS_PQRSD30065","INFORMES DE GESTIÓN","211.2.47.16"]
[null,null,null,null,null,null,"PROGRAMAS","PROGRAMAS",30078,"PROGRAMAS30078","N/A","N/A"]
[null,null,null,null,null,null,"PROYECTOS","PROYECTOS",30079,"PROYECTOS30079","PROYECTOS NORMATIVOS Y DE REGLAMENTOS EN MATERIA DE GARANTÍAS","211.2.79.11"]
[null,null,null,null,null,null,"DIAGNÓSTICOS DE POLITICA PÚBLICA DE TI EN POBLACIONES VULNERABLES","DIAGNÓSTICOS_DE_POLITICA_PÚBLICA_DE_TI_EN_POBLACIONES_VULNERABLES",310133,"DIAGNÓSTICOS_DE_POLITICA_PÚBLICA_DE_TI_EN_POBLACIONES_VULNERABLES310133","N/A","N/A"]
[null,null,null,null,null,null,"INFORMES","INFORMES",310147,"INFORMES310147","ACTAS DEL COMITÉ CONSULTIVO DE RADIO COMUNITARIA","212.01.05"]
[null,null,null,null,null,null,"PETICIONES QUEJAS RECLAMOS SUGERENCIAS Y DENUNCIAS PQRSD","PETICIONES_QUEJAS_RECLAMOS_SUGERENCIAS_Y_DENUNCIAS_PQRSD",310165,"PETICIONES_QUEJAS_RECLAMOS_SUGERENCIAS_Y_DENUNCIAS_PQRSD310165","ESTUDIOS DE RADIODIFUSIÓN SONORA","212.39.01"]
[null,null,null,null,null,null,"INFORMES","INFORMES",31047,"INFORMES31047","SOLICITUDES LICENCIAS DE CADENAS RADIALES","212.58.01"]
[null,null,null,null,null,null,"PETICIONES QUEJAS RECLAMOS SUGERENCIAS Y DENUNCIAS PQRSD","PETICIONES_QUEJAS_RECLAMOS_SUGERENCIAS_Y_DENUNCIAS_PQRSD",31065,"PETICIONES_QUEJAS_RECLAMOS_SUGERENCIAS_Y_DENUNCIAS_PQRSD31065","SOLICITUDES LICENCIAS DE EMISORAS COMERCIALES","212.58.02"]
[null,null,null,null,null,null,"INFORMES",{"$f":"SUBSTITUTE(G156,\" \",\"_\")","v":"INFORMES"},31147,{"$f":"_xlfn.CONCAT(H156,I156)","v":"INFORMES31147"},"SOLICITUDES LICENCIAS DE EMISORAS COMUNITARIAS","212.58.03"]
[null,null,null,null,null,null,"PETICIONES QUEJAS RECLAMOS SUGERENCIAS Y DENUNCIAS PQRSD",{"$f":"SUBSTITUTE(G157,\" \",\"_\")","v":"PETICIONES_QUEJAS_RECLAMOS_SUGERENCIAS_Y_DENUNCIAS_PQRSD"},31165,{"$f":"_xlfn.CONCAT(H157,I157)","v":"PETICIONES_QUEJAS_RECLAMOS_SUGERENCIAS_Y_DENUNCIAS_PQRSD31165"},"SOLICITUDES LICENCIAS DE EMISORAS DE INTERÉS PÚBLICO","212.58.04"]
[null,null,null,null,null,null,"PROYECTOS",{"$f":"SUBSTITUTE(G158,\" \",\"_\")","v":"PROYECTOS"},31179,{"$f":"_xlfn.CONCAT(H158,I158)","v":"PROYECTOS31179"},"SOLICITUDES DE LICENCIAS DE TRANSMOVILES","212.58.05"]
[null,null,null,null,null,null,"INFORMES",{"$f":"SUBSTITUTE(G159,\" \",\"_\")","v":"INFORMES"},31247,{"$f":"_xlfn.CONCAT(H159,I159)","v":"INFORMES31247"},"N/A","N/A"]
[null,null,null,null,null,null,"PETICIONES QUEJAS RECLAMOS SUGERENCIAS Y DENUNCIAS PQRSD","PETICIONES_QUEJAS_RECLAMOS_SUGERENCIAS_Y_DENUNCIAS_PQRSD",31265,"PETICIONES_QUEJAS_RECLAMOS_SUGERENCIAS_Y_DENUNCIAS_PQRSD31265","PLANES TÉCNICOS NACIONALES DE RADIODIFUSIÓN SONORA","212.66.22"]
[null,null,null,null,null,null,"ESTRATEGIAS DE SEGURIDAD Y PRIVACIDAD DE LA INFORMACIÓN","ESTRATEGIAS_DE_SEGURIDAD_Y_PRIVACIDAD_DE_LA_INFORMACIÓN",320138,"ESTRATEGIAS_DE_SEGURIDAD_Y_PRIVACIDAD_DE_LA_INFORMACIÓN320138","N/A","N/A"]
[null,null,null,null,null,null,"POLITICAS","POLITICAS",320169,"POLITICAS320169","N/A","N/A"]
[null,null,null,null,null,null,"INFORMES","INFORMES",320247,"INFORMES320247","PROYECTOS DE INVERSIÓN RADIO PÚBLICA","212.79.05"]
[null,null,null,null,null,null,"PETICIONES QUEJAS RECLAMOS SUGERENCIAS Y DENUNCIAS PQRSD","PETICIONES_QUEJAS_RECLAMOS_SUGERENCIAS_Y_DENUNCIAS_PQRSD",320265,"PETICIONES_QUEJAS_RECLAMOS_SUGERENCIAS_Y_DENUNCIAS_PQRSD320265","CONCEPTOS EMITIDOS","213.21.03"]
[null,null,null,null,null,null,"PLANES","PLANES",320266,"PLANES320266","N/A","N/A"]
[null,null,null,null,null,null,"PROGRAMAS","PROGRAMAS",320278,"PROGRAMAS320278","INFORMES DE GESTIÓN","213.47.16"]
[null,null,null,null,null,null,"ESTUDIOS","ESTUDIOS",320339,"ESTUDIOS320339","N/A","N/A"]
[null,null,null,null,null,null,"INFORMES","INFORMES",320347,"INFORMES320347","N/A","N/A"]
[null,null,null,null,null,null,"PETICIONES QUEJAS RECLAMOS SUGERENCIAS Y DENUNCIAS PQRSD","PETICIONES_QUEJAS_RECLAMOS_SUGERENCIAS_Y_DENUNCIAS_PQRSD",320365,"PETICIONES_QUEJAS_RECLAMOS_SUGERENCIAS_Y_DENUNCIAS_PQRSD320365","N/A","N/A"]
[null,null,null,null,null,null,"POLITICAS ",{"$f":"SUBSTITUTE(G170,\" \",\"_\")","v":"POLITICAS_"},320369,{"$f":"_xlfn.CONCAT(H170,I170)","v":"POLITICAS_320369"},"INCOPORACIÓN EN EL REGISTRO POSTAL","213.93.01"]
[null,null,null,null,null,null,"INFORMES","INFORMES",32047,"INFORMES32047","RESOLUCIONES DE HABILITACIÓN DE SERVICIOS POSTALES DE PAGO","213.93.02"]
[null,null,null,null,null,null,"PETICIONES QUEJAS RECLAMOS SUGERENCIAS Y DENUNCIAS PQRSD","PETICIONES_QUEJAS_RECLAMOS_SUGERENCIAS_Y_DENUNCIAS_PQRSD",32065,"PETICIONES_QUEJAS_RECLAMOS_SUGERENCIAS_Y_DENUNCIAS_PQRSD32065","RESOLUCIONES DE HABILITACIÓN DE SERVICIOS POSTALES PARA MENSAJERIA EXPRESA","213.93.03"]
[null,null,null,null,null,null,"PLANES","PLANES",32066,"PLANES32066","N/A","N/A"]
[null,null,null,null,null,null,"PROGRAMAS","PROGRAMAS",32078,"PROGRAMAS32078","INFORMES DE GESTIÓN","220.47.16"]
[null,null,null,null,null,null,"INFORMES","INFORMES",32147,"INFORMES32147","INFORMES DE PRESUNTO INCUMPLIMIENTO","220.47.23"]
[null,null,null,null,null,null,"PETICIONES QUEJAS RECLAMOS SUGERENCIAS Y DENUNCIAS PQRSD","PETICIONES_QUEJAS_RECLAMOS_SUGERENCIAS_Y_DENUNCIAS_PQRSD",32165,"PETICIONES_QUEJAS_RECLAMOS_SUGERENCIAS_Y_DENUNCIAS_PQRSD32165","N/A","N/A"]
[null,null,null,null,null,null,"PLANES","PLANES",32166,"PLANES32166","PROCESOS ADMINISTRATIVOS CONTRA LOS PROVEEDORES","220.70.01"]
[null,null,null,null,null,null,"POLITICAS","POLITICAS",32169,"POLITICAS32169","PROGRAMAS DE VIGILANCIA Y CONTROL PREVENTIVOS","220.78.11"]
[null,null,null,null,null,null,"PROCESOS","PROCESOS",32170,"PROCESOS32170","N/A","N/A"]
[null,null,null,null,null,null,"PROYECTOS","PROYECTOS",32179,"PROYECTOS32179","INFORMES DE GESTIÓN","221.47.16"]
[null,null,null,null,null,null,"ALIANZAS PUBLICO PRIVADAS NACIONALES E INTERNACIONALES","ALIANZAS_PUBLICO_PRIVADAS_NACIONALES_E_INTERNACIONALES",32206,"ALIANZAS_PUBLICO_PRIVADAS_NACIONALES_E_INTERNACIONALES32206","N/A","N/A"]
[null,null,null,null,null,null,"INFORMES","INFORMES",32247,"INFORMES32247","PROCESOS ADMINISTRATIVOS SANCIONATORIOS","221.70.02"]
[null,null,null,null,null,null,"INVESTIGACIONES EN MATERIA DE TECNOLÓGIAS DE LA INFORMACIÓN","INVESTIGACIONES_EN_MATERIA_DE_TECNOLÓGIAS_DE_LA_INFORMACIÓN",32255,"INVESTIGACIONES_EN_MATERIA_DE_TECNOLÓGIAS_DE_LA_INFORMACIÓN32255","PROGRAMAS PREVENTIVOS DE SERVICIOS DE TELECOMUNICACIONES","221.78.15"]
[null,null,null,null,null,null,"PETICIONES QUEJAS RECLAMOS SUGERENCIAS Y DENUNCIAS PQRSD","PETICIONES_QUEJAS_RECLAMOS_SUGERENCIAS_Y_DENUNCIAS_PQRSD",32265,"PETICIONES_QUEJAS_RECLAMOS_SUGERENCIAS_Y_DENUNCIAS_PQRSD32265","CONCEPTOS DE NO PROCEDIBILIDAD","222.21.01"]
[null,null,null,null,null,null,"POLITICAS","POLITICAS",32269,"POLITICAS32269","INFORMES DE GESTIÓN","222.47.16"]
[null,null,null,null,null,null,"INFORMES","INFORMES",330147,"INFORMES330147","N/A","N/A"]
[null,null,null,null,null,null,"PETICIONES QUEJAS RECLAMOS SUGERENCIAS Y DENUNCIAS PQRSD","PETICIONES_QUEJAS_RECLAMOS_SUGERENCIAS_Y_DENUNCIAS_PQRSD",330165,"PETICIONES_QUEJAS_RECLAMOS_SUGERENCIAS_Y_DENUNCIAS_PQRSD330165","PROCESOS ADMNISTRATIVOS SANCIONATORIOS","222.70.02"]
[null,null,null,null,null,null,"ACTAS","ACTAS",33001,"ACTAS33001","PROGRAMAS PREVENTIVOS DE SERVICIOS DE RADIODIFUSIÓN SONORA","222.78.14"]
[null,null,null,null,null,null,"INFORMES","INFORMES",33047,"INFORMES33047","CONCEPTOS DE NO PROCEDIBILIDAD","223.21.01"]
[null,null,null,null,null,null,"PETICIONES QUEJAS RECLAMOS SUGERENCIAS Y DENUNCIAS PQRSD","PETICIONES_QUEJAS_RECLAMOS_SUGERENCIAS_Y_DENUNCIAS_PQRSD",33065,"PETICIONES_QUEJAS_RECLAMOS_SUGERENCIAS_Y_DENUNCIAS_PQRSD33065","INFORMES DE GESTIÓN","223.47.16"]
[null,null,null,null,null,null,"INFORMES ","INFORMES_",33147,"INFORMES_33147","N/A","N/A"]
[null,null,null,null,null,null,"PETICIONES QUEJAS RECLAMOS SUGERENCIAS Y DENUNCIAS PQRSD","PETICIONES_QUEJAS_RECLAMOS_SUGERENCIAS_Y_DENUNCIAS_PQRSD",33165,"PETICIONES_QUEJAS_RECLAMOS_SUGERENCIAS_Y_DENUNCIAS_PQRSD33165","PROCESOS ADMINISTRATIVOS SANCIONATORIOS","223.70.02"]
[null,null,null,null,null,null,"INFORMES","INFORMES",33247,"INFORMES33247","PROGRAMAS PREVENTIVOS DE SERVICIOS POSTALES","223.78.16"]
[null,null,null,null,null,null,"PETICIONES QUEJAS RECLAMOS SUGERENCIAS Y DENUNCIAS PQRSD","PETICIONES_QUEJAS_RECLAMOS_SUGERENCIAS_Y_DENUNCIAS_PQRSD",33265,"PETICIONES_QUEJAS_RECLAMOS_SUGERENCIAS_Y_DENUNCIAS_PQRSD33265","INFORMES A ENTES DE CONTROL Y VIGILANCIA","230.47.01"]
[null,null,null,null,null,null,"ESTUDIOS","ESTUDIOS",33939,"ESTUDIOS33939","INFORMES A OTROS ORGANISMOS","230.47.02"]
[null,null,null,null,null,null,"ESTUDIOS","ESTUDIOS",34039,"ESTUDIOS34039","INFORMES DE GESTIÓN","230.47.16"]
[null,null,null,null,null,null,"INFORMES","INFORMES",34047,"INFORMES34047","INFORMES DE SEGUIMIENTO DE CALIDAD","230.47.28"]
[null,null,null,null,null,null,"PETICIONES QUEJAS RECLAMOS SUGERENCIAS Y DENUNCIAS PQRSD","PETICIONES_QUEJAS_RECLAMOS_SUGERENCIAS_Y_DENUNCIAS_PQRSD",34065,"PETICIONES_QUEJAS_RECLAMOS_SUGERENCIAS_Y_DENUNCIAS_PQRSD34065","PLANES DE MEJORAMIENTO","230.66.10"]
[null,null,null,null,null,null,"INFORMES","INFORMES",34147,"INFORMES34147","INFORMES DE GESTIÓN","231.47.16"]
[null,null,null,null,null,null,"PETICIONES QUEJAS RECLAMOS SUGERENCIAS Y DENUNCIAS PQRSD","PETICIONES_QUEJAS_RECLAMOS_SUGERENCIAS_Y_DENUNCIAS_PQRSD",34165,"PETICIONES_QUEJAS_RECLAMOS_SUGERENCIAS_Y_DENUNCIAS_PQRSD34165","INFORMES DE GESTIÓN","232.47.16"]
[null,null,null,null,null,null,"INFORMES","INFORMES",34247,"INFORMES34247","N/A","N/A"]
[null,null,null,null,null,null,"PETICIONES QUEJAS RECLAMOS SUGERENCIAS Y DENUNCIAS PQRSD",{"$f":"SUBSTITUTE(G202,\" \",\"_\")","v":"PETICIONES_QUEJAS_RECLAMOS_SUGERENCIAS_Y_DENUNCIAS_PQRSD"},34265,{"$f":"_xlfn.CONCAT(H202,I202)","v":"PETICIONES_QUEJAS_RECLAMOS_SUGERENCIAS_Y_DENUNCIAS_PQRSD34265"},"INFORMES A ENTES DE CONTROL Y VIGILANCIA","233.47.01"]
[null,null,null,null,null,null,"INFORMES","INFORMES",34347,"INFORMES34347","N/A","N/A"]
[null,null,null,null,null,null,"PETICIONES QUEJAS RECLAMOS SUGERENCIAS Y DENUNCIAS  PQRSD","PETICIONES_QUEJAS_RECLAMOS_SUGERENCIAS_Y_DENUNCIAS__PQRSD",34365,"PETICIONES_QUEJAS_RECLAMOS_SUGERENCIAS_Y_DENUNCIAS__PQRSD34365","INFORMES A ENTES DE CONTROL Y VIGILANCIA","240.47.01"]
[null,null,null,null,null,null,"INFORMES ","INFORMES_",34447,"INFORMES_34447","INFORMES DE GESTIÓN","240.47.16"]
[null,null,null,null,null,null,"PETICIONES QUEJAS RECLAMOS SUGERENCIAS Y DENUNCIAS PQRSD","PETICIONES_QUEJAS_RECLAMOS_SUGERENCIAS_Y_DENUNCIAS_PQRSD",34465,"PETICIONES_QUEJAS_RECLAMOS_SUGERENCIAS_Y_DENUNCIAS_PQRSD34465","INFORMES DE GESTIÓN","241.47.16"]
[null,null,null,null,null,null,"ACTAS","ACTAS",40001,"ACTAS40001","N/A","N/A"]
[null,null,null,null,null,null,"CIRCULARES ","CIRCULARES_",40016,"CIRCULARES_40016","N/A","N/A"]
[null,null,null,null,null,null,"DECRETOS ","DECRETOS_",40032,"DECRETOS_40032","INFORMES DE GESTIÓN","242.47.16"]
[null,null,null,null,null,null,"MANUALES","MANUALES",40060,"MANUALES40060","N/A","N/A"]
[null,null,null,null,null,null,"PETICIONES QUEJAS RECLAMOS SUGERENCIAS Y DENUNCIAS PQRSD","PETICIONES_QUEJAS_RECLAMOS_SUGERENCIAS_Y_DENUNCIAS_PQRSD",40065,"PETICIONES_QUEJAS_RECLAMOS_SUGERENCIAS_Y_DENUNCIAS_PQRSD40065","INFORMES DE GESTIÓN","243.47.16"]
[null,null,null,null,null,null,"RESOLUCIONES","RESOLUCIONES",40092,"RESOLUCIONES40092","N/A","N/A"]
[null,null,null,null,null,null,"ACTAS","ACTAS",40101,"ACTAS40101","INFORMES DE GESTIÓN","300.47.16"]
[null,null,null,null,null,null,"CONTRATOS","CONTRATOS",40124,"CONTRATOS40124","N/A","N/A"]
[null,null,null,null,null,null,"CONVENIOS","CONVENIOS",40126,"CONVENIOS40126","PROGRAMAS DE CIUDADES INTELIGENTES","300.78.04"]
[null,null,null,null,null,null,"INFORMES","INFORMES",40147,"INFORMES40147","PROGRAMAS DE EMPRENDIMIENTO DIGITAL","300.78.05"]
[null,null,null,null,null,null,"PETICIONES QUEJAS RECLAMOS SUGERENCIAS Y DENUNCIAS PQRSD","PETICIONES_QUEJAS_RECLAMOS_SUGERENCIAS_Y_DENUNCIAS_PQRSD",40165,"PETICIONES_QUEJAS_RECLAMOS_SUGERENCIAS_Y_DENUNCIAS_PQRSD40165","PROYECTOS DE INVERSIÓN","300.79.03"]
[null,null,null,null,null,null,"INFORMES","INFORMES",40247,"INFORMES40247","N/A","N/A"]
[null,null,null,null,null,null,"PETICIONES QUEJAS RECLAMOS SUGERENCIAS Y DENUNCIAS PQRSD","PETICIONES_QUEJAS_RECLAMOS_SUGERENCIAS_Y_DENUNCIAS_PQRSD",40265,"PETICIONES_QUEJAS_RECLAMOS_SUGERENCIAS_Y_DENUNCIAS_PQRSD40265","INFORMES DE GESTIÓN","310.1.47.16"]
[null,null,null,null,null,null,"PROCESOS DISCIPLINARIOS","PROCESOS_DISCIPLINARIOS",40276,"PROCESOS_DISCIPLINARIOS40276","N/A","N/A"]
[null,null,null,null,null,null,"PROCESOS ORDINARIOS","PROCESOS_ORDINARIOS",40277,"PROCESOS_ORDINARIOS40277","INFORMES DE GESTIÓN","310.47.16"]
[null,null,null,null,null,null,"ACTAS","ACTAS",41001,"ACTAS41001","N/A","N/A"]
[null,null,null,null,null,null,"ANTEPROYECTO DE INGRESOS DEL FONDO","ANTEPROYECTO_DE_INGRESOS_DEL_FONDO",41007,"ANTEPROYECTO_DE_INGRESOS_DEL_FONDO41007","INFORMES DE COMISIÓN","311.47.09"]
[null,null,null,null,null,null,"INFORMES","INFORMES",41047,"INFORMES41047","N/A","N/A"]
[null,null,null,null,null,null,"PETICIONES QUEJAS RECLAMOS SUGERENCIAS Y DENUNCIAS PQRSD","PETICIONES_QUEJAS_RECLAMOS_SUGERENCIAS_Y_DENUNCIAS_PQRSD",41065,"PETICIONES_QUEJAS_RECLAMOS_SUGERENCIAS_Y_DENUNCIAS_PQRSD41065","PROYECTOS DE INVERSIÓN","311.79.03"]
[null,null,null,null,null,null,"PLANES","PLANES",41066,"PLANES41066","INFORMES DE GESTIÓN","312.47.16"]
[null,null,null,null,null,null,"RESOLUCIONES","RESOLUCIONES",41092,"RESOLUCIONES41092","N/A","N/A"]
[null,null,null,null,null,null,"ACTAS","ACTAS",41101,"ACTAS41101","N/A","N/A"]
[null,null,null,null,null,null,"INFORMES","INFORMES",41147,"INFORMES41147","POLÍTICAS DE PROTECCIÓN DE LA INFORMACIÓN PÚBLICA","320.1.69.04"]
[null,null,null,null,null,null,"ACTAS","ACTAS",41201,"ACTAS41201","INFORMES DE GESTIÓN","320.2.47"]
[null,null,null,null,null,null,"INFORMES","INFORMES",41247,"INFORMES41247","N/A","N/A"]
[null,null,null,null,null,null,"INFORMES","INFORMES",42047,"INFORMES42047","PLANES DE MONITOREO Y EVALUACIÓN DE CIUDADES INTELIGENTES","320.2.66.14"]
[null,null,null,null,null,null,"PETICIONES QUEJAS RECLAMOS SUGERENCIAS Y DENUNCIAS PQRSD","PETICIONES_QUEJAS_RECLAMOS_SUGERENCIAS_Y_DENUNCIAS_PQRSD",42065,"PETICIONES_QUEJAS_RECLAMOS_SUGERENCIAS_Y_DENUNCIAS_PQRSD42065","PROGRAMAS DE CIUDADES INTELIGENTES","320.2.78.04"]
[null,null,null,null,null,null,"ACUERDOS ",{"$f":"SUBSTITUTE(G234,\" \",\"_\")","v":"ACUERDOS_"},42104,{"$f":"_xlfn.CONCAT(H234,I234)","v":"ACUERDOS_42104"},"ESTUDIOS EN MATERIA DE GOBIERNO DIGITAL","320.3.39.02"]
[null,null,null,null,null,null,"BOLETINES","BOLETINES",42112,"BOLETINES42112","INFORMES DE GESTIÓN","320.3.47.16"]
[null,null,null,null,null,null,"CERTIFICADOS ","CERTIFICADOS_",42115,"CERTIFICADOS_42115","N/A","N/A"]
[null,null,null,null,null,null,"CONCILIACIONES","CONCILIACIONES",42122,"CONCILIACIONES42122","POLITICAS DE GOBIERNO DIGITAL","320.3.69.03"]
[null,null,null,null,null,null,"CUENTAS BANCARIAS","CUENTAS_BANCARIAS",42127,"CUENTAS_BANCARIAS42127","INFORMES DE GESTIÓN","320.47.16"]
[null,null,null,null,null,null,"DECLARACIONES TRIBUTARIAS ","DECLARACIONES_TRIBUTARIAS_",42131,"DECLARACIONES_TRIBUTARIAS_42131","N/A","N/A"]
[null,null,null,null,null,null,"EMBARGOS","EMBARGOS",42134,"EMBARGOS42134","PLANES DE ACCIÓN","320.66.04"]
[null,null,null,null,null,null,"EVALUACIÓN Y SEGUIMIENTO DE CONVENIOS BANCARIOS",{"$f":"SUBSTITUTE(G241,\" \",\"_\")","v":"EVALUACIÓN_Y_SEGUIMIENTO_DE_CONVENIOS_BANCARIOS"},42140,{"$f":"_xlfn.CONCAT(H241,I241)","v":"EVALUACIÓN_Y_SEGUIMIENTO_DE_CONVENIOS_BANCARIOS42140"},"PROGRAMAS DE TECNOLOGIAS DE LA INFORMACIÓN EN LAS ENTIDADES DEL ESTADO","320.78.10"]
[null,null,null,null,null,null,"INFORMES","INFORMES",42147,"INFORMES42147","INFORMES A OTROS ORGANISMOS","321.47.02"]
[null,null,null,null,null,null,"LEGALIZACIONES","LEGALIZACIONES",42156,"LEGALIZACIONES42156","INFORMES DE GESTIÓN","321.47.16"]
[null,null,null,null,null,null,"LIBROS AUXILIARES","LIBROS_AUXILIARES",42157,"LIBROS_AUXILIARES42157","N/A","N/A"]
[null,null,null,null,null,null,"NÓMINA","NÓMINA",42162,"NÓMINA42162","PLANES ESTRATEGICOS DE GOBIERNO ELECTRONICO DEL ESTADO","321.66.18"]
[null,null,null,null,null,null,"ORDENES DE PAGO","ORDENES_DE_PAGO",42164,"ORDENES_DE_PAGO42164","POLITICAS DE TRÁMITES Y SERVICIOS DE LA INFORMACIÒN ESTATAL","321.69.05"]
[null,null,null,null,null,null,"PETICIONES QUEJAS RECLAMOS SUGERENCIAS Y DENUNCIAS PQRSD","PETICIONES_QUEJAS_RECLAMOS_SUGERENCIAS_Y_DENUNCIAS_PQRSD",42165,"PETICIONES_QUEJAS_RECLAMOS_SUGERENCIAS_Y_DENUNCIAS_PQRSD42165","PROCESOS DE INFRAESTRUCTURA TECNOLOGICA","321.70.03"]
[null,null,null,null,null,null,"PLANES","PLANES",42166,"PLANES42166","PROYECTOS DE TRAMITES, SERVICIOS, DATOS, TRANSPARENCIA Y PARTICIPACIÓN","321.79.09"]
[null,null,null,null,null,null,"RECAUDOS",{"$f":"SUBSTITUTE(G249,\" \",\"_\")","v":"RECAUDOS"},42180,{"$f":"_xlfn.CONCAT(H249,I249)","v":"RECAUDOS42180"},"N/A","N/A"]
[null,null,null,null,null,null,"REINTEGROS DIRECCIÓN DEL TESORO NACIONAL MINISTERIO","REINTEGROS_DIRECCIÓN_DEL_TESORO_NACIONAL_MINISTERIO",42189,"REINTEGROS_DIRECCIÓN_DEL_TESORO_NACIONAL_MINISTERIO42189","INFORMES DE GESTIÓN","322.47.16"]
[null,null,null,null,null,null,"ACTAS","ACTAS",42201,"ACTAS42201","N/A","N/A"]
[null,null,null,null,null,null,"COMPROBANTES CONTABLES","COMPROBANTES_CONTABLES",42218,"COMPROBANTES_CONTABLES42218","N/A","N/A"]
[null,null,null,null,null,null,"CONCILIACIONES ","CONCILIACIONES_",42222,"CONCILIACIONES_42222","EVALUACIÓNES DE POLITICAS GESTIÓN DE TECNOLOGÍAS DE LA INFORMACIÓN Y SEGURIDAD DE LA INFORMACIÓN","322.69.01"]
[null,null,null,null,null,null,"ESTADOS FINANCIEROS","ESTADOS_FINANCIEROS",42236,"ESTADOS_FINANCIEROS42236","POLÍTICAS PÚBLICAS DE GESTIÓN DE TECNOLOGÍAS DE LA INFORMACIÓN Y SEGURIDAD DE LA INFORMACIÓN","322.69.02"]
[null,null,null,null,null,null,"INFORMES","INFORMES",42247,"INFORMES42247","INFORMES DE GESTIÓN","330.1.47.16"]
[null,null,null,null,null,null,"PETICIONES QUEJAS RECLAMOS SUGERENCIAS Y DENUNCIAS PQRSD","PETICIONES_QUEJAS_RECLAMOS_SUGERENCIAS_Y_DENUNCIAS_PQRSD",42265,"PETICIONES_QUEJAS_RECLAMOS_SUGERENCIAS_Y_DENUNCIAS_PQRSD42265","N/A","N/A"]
[null,null,null,null,null,null,"BALANCES PRESUPUESTALES","BALANCES_PRESUPUESTALES",42311,"BALANCES_PRESUPUESTALES42311","ACTAS DE LA COMISIÓN INTERSECTORIAL PARA EL DESARROLLO DE LA ECONOMIA DIGITAL","330.01.02"]
[null,null,null,null,null,null,"CERTIFICADOS","CERTIFICADOS",42315,"CERTIFICADOS42315","ESTUDIOS EN TRANSFORMACIÓN DIGITAL","330.39.04"]
[null,null,null,null,null,null,"INFORMES",{"$f":"SUBSTITUTE(G259,\" \",\"_\")","v":"INFORMES"},42347,{"$f":"_xlfn.CONCAT(H259,I259)","v":"INFORMES42347"},"INFORMES A ENTES DE CONTROL Y VIGILANCIA","330.47.01"]
[null,null,null,null,null,null,"PETICIONES QUEJAS RECLAMOS SUGERENCIAS Y DENUNCIAS PQRSD","PETICIONES_QUEJAS_RECLAMOS_SUGERENCIAS_Y_DENUNCIAS_PQRSD",42365,"PETICIONES_QUEJAS_RECLAMOS_SUGERENCIAS_Y_DENUNCIAS_PQRSD42365","INFORMES DE GESTIÓN","330.47.16"]
[null,null,null,null,null,null,"PROYECTOS","PROYECTOS",42379,"PROYECTOS42379","N/A","N/A"]
[null,null,null,null,null,null,"REGISTROS PRESUPUESTALES","REGISTROS_PRESUPUESTALES",42388,"REGISTROS_PRESUPUESTALES42388","INFORMES DE GESTIÓN","331.47.16"]
[null,null,null,null,null,null,"RESERVAS PRESUPUESTALES","RESERVAS_PRESUPUESTALES",42391,"RESERVAS_PRESUPUESTALES42391","N/A","N/A"]
[null,null,null,null,null,null,"CERTIFICACIONES","CERTIFICACIONES",42414,"CERTIFICACIONES42414","INFORMES DE GESTIÓN","332.47.16"]
[null,null,null,null,null,null,"COBROS","COBROS",42417,"COBROS42417","N/A","N/A"]
[null,null,null,null,null,null,"ESTADOS DE CUENTA","ESTADOS_DE_CUENTA",42435,"ESTADOS_DE_CUENTA42435","ESTUDIOS EN MATERIA DE INDUSTRIA DE TECNOLOGÍA DE LA INFORMACIÓN","340.39.03"]
[null,null,null,null,null,null,"INFORMES","INFORMES",42447,"INFORMES42447","INFORMES A ENTES DE CONTROL Y VIGILANCIA","340.47.01"]
[null,null,null,null,null,null,"LIQUIDACIÓN DE DERECHOS","LIQUIDACIÓN_DE_DERECHOS",42459,"LIQUIDACIÓN_DE_DERECHOS42459","INFORMES DE GESTIÓN","340.47.16"]
[null,null,null,null,null,null,"PETICIONES QUEJAS RECLAMOS SUGERENCIAS Y DENUNCIAS PQRSD","PETICIONES_QUEJAS_RECLAMOS_SUGERENCIAS_Y_DENUNCIAS_PQRSD",42465,"PETICIONES_QUEJAS_RECLAMOS_SUGERENCIAS_Y_DENUNCIAS_PQRSD42465","N/A","N/A"]
[null,null,null,null,null,null,"PLANES","PLANES",42466,"PLANES42466","INFORMES DE GESTIÓN","341.47.16"]
[null,null,null,null,null,null,"ACTAS","ACTAS",43001,"ACTAS43001","N/A","N/A"]
[null,null,null,null,null,null,"INFORMES","INFORMES",43047,"INFORMES43047","INFORMES DE GESTIÓN","342.47.16"]
[null,null,null,null,null,null,"PETICIONES QUEJAS RECLAMOS SUGERENCIAS Y DENUNCIAS PQRSD","PETICIONES_QUEJAS_RECLAMOS_SUGERENCIAS_Y_DENUNCIAS_PQRSD",43065,"PETICIONES_QUEJAS_RECLAMOS_SUGERENCIAS_Y_DENUNCIAS_PQRSD43065","N/A","N/A"]
[null,null,null,null,null,null,"PLANES","PLANES",43066,"PLANES43066","INFORMES DE GESTIÓN","343.47.16"]
[null,null,null,null,null,null,"ACTAS","ACTAS",43101,"ACTAS43101","N/A","N/A"]
[null,null,null,null,null,null,"AUTORIZACIONES DE ENTRADA Y SALIDA DE ELEMENTOS","AUTORIZACIONES_DE_ENTRADA_Y_SALIDA_DE_ELEMENTOS",43110,"AUTORIZACIONES_DE_ENTRADA_Y_SALIDA_DE_ELEMENTOS43110","INFORMES DE GESTIÓN","344.47.16"]
[null,null,null,null,null,null,"COMPROBANTES DE ALMACEN","COMPROBANTES_DE_ALMACEN",43119,"COMPROBANTES_DE_ALMACEN43119","N/A","N/A"]
[null,null,null,null,null,null,"HISTORIALES DE BIENES INMUEBLES","HISTORIALES_DE_BIENES_INMUEBLES",43144,"HISTORIALES_DE_BIENES_INMUEBLES43144","ACTAS DE REUNIÓN DEL SINDICATO NACIONAL DE TRABAJADORES DEL MINISTERO DE TECNOLOGIAS DE LA INFORMACIÓN Y LAS COMUNICACIONES","400.01.04"]
[null,null,null,null,null,null,"INFORMES","INFORMES",43147,"INFORMES43147","ACTAS DEL COMITÉ DIRECTIVO","400.01.16"]
[null,null,null,null,null,null,"INSTRUMENTOS DE CONTROL PARA ADMINISTRACIÓN DE BIENES",{"$f":"SUBSTITUTE(G280,\" \",\"_\")","v":"INSTRUMENTOS_DE_CONTROL_PARA_ADMINISTRACIÓN_DE_BIENES"},43151,{"$f":"_xlfn.CONCAT(H280,I280)","v":"INSTRUMENTOS_DE_CONTROL_PARA_ADMINISTRACIÓN_DE_BIENES43151"},"ACTAS DEL CONSEJO DE LA MEDALLA AL MERITO","400.01.21"]
[null,null,null,null,null,null,"INVENTARIOS ","INVENTARIOS_",43154,"INVENTARIOS_43154","N/A","N/A"]
[null,null,null,null,null,null,"PETICIONES QUEJAS RECLAMOS SUGERENCIAS Y DENUNCIAS PQRSD","PETICIONES_QUEJAS_RECLAMOS_SUGERENCIAS_Y_DENUNCIAS_PQRSD",43165,"PETICIONES_QUEJAS_RECLAMOS_SUGERENCIAS_Y_DENUNCIAS_PQRSD43165","N/A","N/A"]
[null,null,null,null,null,null,"INFORMES","INFORMES",43247,"INFORMES43247","MANUALES DE CONTRATACIÓN","400.60.01"]
[null,null,null,null,null,null,"NOTIFICACIONES POR AVISO DE ACTOS ADMINISTRATIVOS","NOTIFICACIONES_POR_AVISO_DE_ACTOS_ADMINISTRATIVOS",43263,"NOTIFICACIONES_POR_AVISO_DE_ACTOS_ADMINISTRATIVOS43263","MANUALES DE FUNCIONES Y DE COMPETENCIAS LABORALES","400.60.02"]
[null,null,null,null,null,null,"PETICIONES QUEJAS RECLAMOS SUGERENCIAS Y DENUNCIAS PQRSD","PETICIONES_QUEJAS_RECLAMOS_SUGERENCIAS_Y_DENUNCIAS_PQRSD",43265,"PETICIONES_QUEJAS_RECLAMOS_SUGERENCIAS_Y_DENUNCIAS_PQRSD43265","N/A","N/A"]
[null,null,null,null,null,null,"ACTAS","ACTAS",43301,"ACTAS43301","RESOLUCIONES DEL FONDO DE TECNOLOGIAS DE LA INFORMACIÓN Y LAS COMUNICACIONES","400.92.03"]
[null,null,null,null,null,null,"INFORMES","INFORMES",43347,"INFORMES43347","RESOLUCIONES DEL MINISTERIO","400.92.04"]
[null,null,null,null,null,null,"INSTRUMENTOS ARCHIVISTICOS","INSTRUMENTOS_ARCHIVISTICOS",43349,"INSTRUMENTOS_ARCHIVISTICOS43349","ACTAS DEL COMITÉ DE CONTRATACIÓN","401.01.08"]
[null,null,null,null,null,null,"INSTRUMENTOS DE CONTROL","INSTRUMENTOS_DE_CONTROL",43350,"INSTRUMENTOS_DE_CONTROL43350","ACTAS DEL COMITÉ DE SEGUIMIENTO AL PLAN ANUAL DE ADQUISICIONES","401.01.14"]
[null,null,null,null,null,null,"PETICIONES QUEJAS RECLAMOS SUGERENCIAS Y DENUNCIAS PQRSD","PETICIONES_QUEJAS_RECLAMOS_SUGERENCIAS_Y_DENUNCIAS_PQRSD",43365,"PETICIONES_QUEJAS_RECLAMOS_SUGERENCIAS_Y_DENUNCIAS_PQRSD43365","CONTRATOS DE ARRENDAMIENTO DEL FONDO ","401.24.01"]
[null,null,null,null,null,null,"PLANES","PLANES",43366,"PLANES43366","CONTRATOS DE ARRENDAMIENTO DEL MINISTERIO","401.24.02"]
[null,null,null,null,null,null,"PROGRAMAS","PROGRAMAS",43378,"PROGRAMAS43378","CONTRATOS DE CIENCIA, TECNOLOGÍA E INNOVACIÓN DEL FONDO","401.24.03"]
[null,null,null,null,null,null,"TRANSFERENCIAS DOCUMENTALES","TRANSFERENCIAS_DOCUMENTALES",43396,"TRANSFERENCIAS_DOCUMENTALES43396","CONTRATOS DE CIENCIA, TECNOLOGÍA E INNOVACIÓN DEL MINISTERIO","401.24.04"]
[null,null,null,null,null,null,"CONSECUTIVO DE COMUNICACIONES OFICIALES","CONSECUTIVO_DE_COMUNICACIONES_OFICIALES",43423,"CONSECUTIVO_DE_COMUNICACIONES_OFICIALES43423","CONTRATOS DE COMODATO DEL FONDO","401.24.05"]
[null,null,null,null,null,null,"INFORMES","INFORMES",43447,"INFORMES43447","CONTRATOS DE COMODATO DEL MINISTERIO","401.24.06"]
[null,null,null,null,null,null,"INSTRUMENTOS DE CONTROL","INSTRUMENTOS_DE_CONTROL",43450,"INSTRUMENTOS_DE_CONTROL43450","CONTRATOS DE COMPRAVENTA DEL FONDO","401.24.07"]
[null,null,null,null,null,null,"PETICIONES QUEJAS RECLAMOS SUGERENCIAS Y DENUNCIAS PQRSD","PETICIONES_QUEJAS_RECLAMOS_SUGERENCIAS_Y_DENUNCIAS_PQRSD",43465,"PETICIONES_QUEJAS_RECLAMOS_SUGERENCIAS_Y_DENUNCIAS_PQRSD43465","CONTRATOS DE COMPRAVENTA DEL MINISTERIO","401.24.08"]
[null,null,null,null,null,null,"PROGRAMAS","PROGRAMAS",43478,"PROGRAMAS43478","CONTRATOS DE CONSULTORIA DEL FONDO","401.24.09"]
[null,null,null,null,null,null,"AUTORIZACIONES DE COMISIONES AL EXTERIOR","AUTORIZACIONES_DE_COMISIONES_AL_EXTERIOR",43509,"AUTORIZACIONES_DE_COMISIONES_AL_EXTERIOR43509","CONTRATOS DE CONSULTORIA DEL MINISTERIO","401.24.10"]
[null,null,null,null,null,null,"HISTORIALES DE VEHÍCULOS","HISTORIALES_DE_VEHÍCULOS",43545,"HISTORIALES_DE_VEHÍCULOS43545","CONTRATOS DE INTERVENTORÍA DEL FONDO","401.24.11"]
[null,null,null,null,null,null,"INSTRUMENTOS DE CONTROL","INSTRUMENTOS_DE_CONTROL",43550,"INSTRUMENTOS_DE_CONTROL43550","CONTRATOS DE INTERVENTORÍA DEL MINISTERIO","401.24.12"]
[null,null,null,null,null,null,"PETICIONES QUEJAS RECLAMOS SUGERENCIAS Y DENUNCIAS PQRSD","PETICIONES_QUEJAS_RECLAMOS_SUGERENCIAS_Y_DENUNCIAS_PQRSD",43565,"PETICIONES_QUEJAS_RECLAMOS_SUGERENCIAS_Y_DENUNCIAS_PQRSD43565","CONTRATOS DE OBRA DEL FONDO","401.24.13"]
[null,null,null,null,null,null,"PLANES","PLANES",43566,"PLANES43566","CONTRATOS DE OBRA DEL MINISTERIO           ","401.24.14"]
[null,null,null,null,null,null,"ACTAS","ACTAS",43601,"ACTAS43601","CONTRATOS DE PRESTACIÓN DE SERVICIOS DEL FONDO        ","401.24.15"]
[null,null,null,null,null,null,"HISTORIAS LABORALES","HISTORIAS_LABORALES",43646,"HISTORIAS_LABORALES43646","CONTRATOS DE PRESTACIÓN DE SERVICIOS DEL MINISTERIO     ","401.24.16"]
[null,null,null,null,null,null,"PETICIONES QUEJAS RECLAMOS SUGERENCIAS Y DENUNCIAS PQRSD","PETICIONES_QUEJAS_RECLAMOS_SUGERENCIAS_Y_DENUNCIAS_PQRSD",43665,"PETICIONES_QUEJAS_RECLAMOS_SUGERENCIAS_Y_DENUNCIAS_PQRSD43665","CONTRATOS DE PRESTACIÓN DE SERVICIOS PROFESIONALES O APOYO A GESTIÓN DEL FONDO","401.24.17"]
[null,null,null,null,null,null,"PLANES","PLANES",43666,"PLANES43666","CONTRATOS DE PRESTACIÓN DE SERVICIOS PROFESIONALES O APOYO A GESTIÓN DEL MINISTERIO","401.24.18"]
[null,null,null,null,null,null,"PROGRAMAS","PROGRAMAS",43678,"PROGRAMAS43678","CONTRATOS DE SUMINISTROS DEL FONDO          ","401.24.19"]
[null,null,null,null,null,null,"BONOS PENSIONALES","BONOS_PENSIONALES",43713,"BONOS_PENSIONALES43713","CONTRATOS DE SUMINISTROS DEL MINISTERIO","401.24.20"]
[null,null,null,null,null,null,"CERTIFICACIONES","CERTIFICACIONES",43714,"CERTIFICACIONES43714","CONTRATOS INTERADMINISTRATIVOS DEL FONDO","401.24.21"]
[null,null,null,null,null,null,"CUENTAS POR COBRAR","CUENTAS_POR_COBRAR",43728,"CUENTAS_POR_COBRAR43728","CONTRATOS INTERADMINISTRATIVOS DEL MINISTERIO","401.24.22"]
[null,null,null,null,null,null,"CUENTAS POR PAGAR","CUENTAS_POR_PAGAR",43729,"CUENTAS_POR_PAGAR43729","CONVENIOS DE ASOCIACIÓN DEL FONDO","401.26.01"]
[null,null,null,null,null,null,"INFORMES","INFORMES",43747,"INFORMES43747","CONVENIOS DE ASOCIACIÓN DEL MINISTERIO","401.26.02"]
[null,null,null,null,null,null,"PETICIONES QUEJAS RECLAMOS SUGERENCIAS Y DENUNCIAS PQRSD","PETICIONES_QUEJAS_RECLAMOS_SUGERENCIAS_Y_DENUNCIAS_PQRSD",43765,"PETICIONES_QUEJAS_RECLAMOS_SUGERENCIAS_Y_DENUNCIAS_PQRSD43765","CONVENIOS DE COOPERACIÓN DEL FONDO","401.26.03"]
[null,null,null,null,null,null,null,null,null,null,"CONVENIOS DE COOPERACIÓN DEL MINISTERIO","401.26.04"]
[null,null,null,null,null,null,null,null,null,null,"CONVENIOS INTERADMINISTRATIVOS DEL FONDO","401.26.05"]
[null,null,null,null,null,null,null,null,null,null,"CONVENIOS INTERADMINISTRATIVOS DEL MINISTERIO","401.27.06"]
[null,null,null,null,null,null,null,null,null,null,"INFORMES A ENTES DE CONTROL Y VIGILANCIA","401.47.01"]
[null,null,null,null,null,null,null,null,null,null,"N/A","N/A"]
[null,null,null,null,null,null,null,null,null,null,"INFORMES DE GESTIÓN","402.47.16"]
[null,null,null,null,null,null,null,null,null,null,"N/A","N/A"]
[null,null,null,null,null,null,null,null,null,null,"PROCESOS DISCIPLINARIOS VERBALES","402.76.01"]
[null,null,null,null,null,null,null,null,null,null,"PROCESOS ORDINARIOS DE AUTOS INHIBITORIOS","402.77.01"]
[null,null,null,null,null,null,null,null,null,null,"PROCESOS ORDINARIOS DE INDAGACIÓN PRELIMINAR","402.77.02"]
[null,null,null,null,null,null,null,null,null,null,"PROCESOS ORDINARIOS DE INVESTIGACIÓN DISCIPLINARIA","402.77.03"]
[null,null,null,null,null,null,null,null,null,null,"ACTAS DEL COMITÉ DE CONTROL Y SEGUIMIENTO DEL FONDO DE TECNOLOGÍAS DE LA INFORMACIÓN Y LAS COMUNICACIONES ","410.01.10"]
[null,null,null,null,null,null,null,null,null,null,"N/A","N/A"]
[null,null,null,null,null,null,null,null,null,null,"INFORMES A ENTES DE CONTROL Y VIGILANCIA","410.47.01"]
[null,null,null,null,null,null,null,null,null,null,"INFORMES DE CONTROL Y SEGUIMIENTO DEL FONDO","410.47.12"]
[null,null,null,null,null,null,null,null,null,null,"N/A","N/A"]
[null,null,null,null,null,null,null,null,null,null,"PLANES DE MEJORAMIENTO","410.66.10"]
[null,null,null,null,null,null,null,null,null,null,"RESOLUCIONES DE SUBSIDIOS A INTERNET","410.92.01"]
[null,null,null,null,null,null,null,null,null,null,"RESOLUCIONES DE SUBSIDIOS DE TELEFONIA PÚBLICA BASICA CONMUNATADA ","410.92.02"]
[null,null,null,null,null,null,null,null,null,null,"ACTAS DEL SUBCOMITÉ DE ASUNTOS PRECONTRACTUALES","411.01.22"]
[null,null,null,null,null,null,null,null,null,null,"ACTAS DEL  SUBCOMITÉ DE SEGUIMIENTO CORRECTIVO Y PREVENTIVO","411.01.23"]
[null,null,null,null,null,null,null,null,null,null,"INFORMES DE GESTIÓN","411.47.16"]
[null,null,null,null,null,null,null,null,null,null,"ACTAS DEL SUBCOMITÉ DE SEGUIMIENTO INGRESOS DEL FONDO","412.01.24"]
[null,null,null,null,null,null,null,null,null,null,"INFORMES DE SEGUIMIENTO A LA GESTIÓN DE INGRESOS DEL FONDO","412.47.26"]
[null,null,null,null,null,null,null,null,null,null,"INFORMES A ENTES DE CONTROL Y VIGILANCIA.","420.47.01"]
[null,null,null,null,null,null,null,null,null,null,"INFORMES DE GESTIÓN","420.47.16"]
[null,null,null,null,null,null,null,null,null,null,"INFORMES DE PATRIMONIOS AUTONOMOS","420.47.20"]
[null,null,null,null,null,null,null,null,null,null,"N/A","N/A"]
[null,null,null,null,null,null,null,null,null,null,"ACUERDOS DE PAGO","421.04.03"]
[null,null,null,null,null,null,null,null,null,null,"BOLETINES DE CAJA Y BANCOS FONDO","421.12.01"]
[null,null,null,null,null,null,null,null,null,null,"BOLETINES DE CAJA Y BANCOS MINISTERIO","421.12.02"]
[null,null,null,null,null,null,null,null,null,null,"CERTIFICADOS DE ICA IVA Y RENTA","421.15.03"]
[null,null,null,null,null,null,null,null,null,null,"CONCILIACIONES BANCARIAS CUENTA ÚNICA NACIONAL","421.22.02"]
[null,null,null,null,null,null,null,null,null,null,"CONCILIACIONES BANCARIAS FONDO ","421.22.03"]
[null,null,null,null,null,null,null,null,null,null,"CONCILIACIONES BANCARIAS MINISTERIO","421.22.04"]
[null,null,null,null,null,null,null,null,null,null,"CUENTAS BANCARIAS DEL FONDO","421.27.01"]
[null,null,null,null,null,null,null,null,null,null,"CUENTAS BANCARIAS DEL MINISTERIO ","421.27.02"]
[null,null,null,null,null,null,null,null,null,null,"CLASIFICACIÓN TRIBUTARIA CONTRATISTAS PN FONDO","421.31.01"]
[null,null,null,null,null,null,null,null,null,null,"DECLARACIONES TRIBUTARIAS DE OBRA PÚBLICA FONDO","421.31.02"]
[null,null,null,null,null,null,null,null,null,null,"DECLARACIONES TRIBUTARIAS DE OBRA PÚBLICA MINISTERIO","421.31.03"]
[null,null,null,null,null,null,null,null,null,null,"DECLARACIONES TRIBUTARIAS DE RETENCIÓN EN LA FUENTE FONDO","421.31.04"]
[null,null,null,null,null,null,null,null,null,null,"DECLARACIONES TRIBUTARIAS DE RETENCIÓN EN LA FUENTE MINISTERIO","421.31.05"]
[null,null,null,null,null,null,null,null,null,null,"DECLARACIONES TRBUTARIAS ESTAMPILLAS FONDO","421.31.06"]
[null,null,null,null,null,null,null,null,null,null,"DECLARACIONES TRBUTARIAS ESTAMPILLAS MINISTERIO","421.31.07"]
[null,null,null,null,null,null,null,null,null,null,"DECLARACIONES TRIBUTARIAS ICA FONDO","421.31.08"]
[null,null,null,null,null,null,null,null,null,null,"DECLARACIONES TRIBUTARIAS ICA MNISTERIO","421.31.09"]
[null,null,null,null,null,null,null,null,null,null,"EMBARGOS FONDO","421.34.01"]
[null,null,null,null,null,null,null,null,null,null,"EMBARGOS MINISTERIO","421.34.02"]
[null,null,null,null,null,null,null,null,null,null,"N/A","N/A"]
[null,null,null,null,null,null,null,null,null,null,"INFORMES A OTROS ORGANISMOS","421.47.02"]
[null,null,null,null,null,null,null,null,null,null,"INFORMES DE CONSTITUCIÓN DE CUENTAS POR PAGAR","421.47.11"]
[null,null,null,null,null,null,null,null,null,null,"LEGALIZACIONES DE CAJA MENOR FONDO","421.56.01"]
[null,null,null,null,null,null,null,null,null,null,"LEGALIZACIONES DE VIATICOS","421.56.02"]
[null,null,null,null,null,null,null,null,null,null,"LIBROS AUXILIARES DE BANCO MINISTERIO","421.57.01"]
[null,null,null,null,null,null,null,null,null,null,"N/A","N/A"]
[null,null,null,null,null,null,null,null,null,null,"ORDENES DE PAGO DEL FONDO","421.64.01"]
[null,null,null,null,null,null,null,null,null,null,"ORDENES DE PAGO DEL MINISTERIO","421.64.02"]
[null,null,null,null,null,null,null,null,null,null,"N/A","N/A"]
[null,null,null,null,null,null,null,null,null,null,"PLANES ANUALES DE CAJA PAC","421.66.02"]
[null,null,null,null,null,null,null,null,null,null,"PLANES DE INVERSIÓN DEL FONDO - PORTAFOLIO","421.66.09"]
[null,null,null,null,null,null,null,null,null,null,"N/A","N/A"]
[null,null,null,null,null,null,null,null,null,null,"N/A","N/A"]
[null,null,null,null,null,null,null,null,null,null,"ACTAS DEL COMITÉ TÉCNICO DE SOSTENIBILIDAD DEL SISTEMA DE CONTABILIDAD","422.01.20"]
[null,null,null,null,null,null,null,null,null,null,"COMPROBANTES CONTABLES DE AJUSTE","422.18.01"]
[null,null,null,null,null,null,null,null,null,null,"COMPROBANTES CONTABLES DE EGRESO","422.18.02"]
[null,null,null,null,null,null,null,null,null,null,"COMPROBANTES CONTABLES DE INGRESO","422.18.03"]
[null,null,null,null,null,null,null,null,null,null,"CONCILIACIONES BANCARIAS","422.22.01"]
[null,null,null,null,null,null,null,null,null,null,"CONCILIACIONES DE OPERACIONES RECIPROCAS","422.22.05"]
[null,null,null,null,null,null,null,null,null,null,"N/A","N/A"]
[null,null,null,null,null,null,null,null,null,null,"INFORMES A ENTES DE CONTROL Y VIGILANCIA","422.47.01"]
[null,null,null,null,null,null,null,null,null,null,"INFORMES A OTROS ORGANISMOS","422.47.02"]
[null,null,null,null,null,null,null,null,null,null,"N/A","N/A"]
[null,null,null,null,null,null,null,null,null,null,"N/A","N/A"]
[null,null,null,null,null,null,null,null,null,null,"CERTIFICADOS DE DISPONIBILIDAD PRESUPUESTAL FONDO","423.15.01"]
[null,null,null,null,null,null,null,null,null,null,"CERTIFICADOS DE DISPONIBILIDAD PRESUPUESTAL MINISTERIO","423.15.02"]
[null,null,null,null,null,null,null,null,null,null,"INFORMES A ENTES DE CONTROL Y VIGILANCIA","423.47.01"]
[null,null,null,null,null,null,null,null,null,null,"INFORMES A OTROS ORGANISMOS","423.47.02"]
[null,null,null,null,null,null,null,null,null,null,"INFORMES DE EJECUCIÓN PRESUPUESTAL","423.47.14"]
[null,null,null,null,null,null,null,null,null,null,"N/A","N/A"]
[null,null,null,null,null,null,null,null,null,null,"PROYECTOS DE INVERSIÓN","423.79.03"]
[null,null,null,null,null,null,null,null,null,null,"PROYECTOS DE PRESUPUESTO DEL FONDO","423.79.07"]
[null,null,null,null,null,null,null,null,null,null,"PROYECTOS DE PRESUPUESTO DEL MINISTERIO","423.79.08"]
[null,null,null,null,null,null,null,null,null,null,"REGISTROS PRESUPUESTALES DE COMPROMISO FONDO","423.88.01"]
[null,null,null,null,null,null,null,null,null,null,"REGISTROS PRESUPUESTALES DE COMPROMISO MNISTERIO","423.88.02"]
[null,null,null,null,null,null,null,null,null,null,"RESERVAS PRESUPUESTALES Y CUENTAS POR PAGAR DEL FONDO","423.91.01"]
[null,null,null,null,null,null,null,null,null,null,"RESERVAS PRESUPUESTALES Y CUENTAS POR PAGAR DEL MINISTERIO","423.91.02"]
[null,null,null,null,null,null,null,null,null,null,"CERTIFICACIONES DE CUMPLIMIENTO","424.14.02"]
[null,null,null,null,null,null,null,null,null,null,"COBROS COACTIVOS","424.17.01"]
[null,null,null,null,null,null,null,null,null,null,"COBROS PERSUASIVOS","424.17.02"]
[null,null,null,null,null,null,null,null,null,null,"N/A","N/A"]
[null,null,null,null,null,null,null,null,null,null,"INFORMES DE REVISIÓN DE AUTOLIQUIDACIONES","424.47.24"]
[null,null,null,null,null,null,null,null,null,null,"N/A","N/A"]
[null,null,null,null,null,null,null,null,null,null,"N/A","N/A"]
[null,null,null,null,null,null,null,null,null,null,"PLANES DE MEJORAMIENTO DE LOS RECURSOS DEL FONDO","424.66.12"]
[null,null,null,null,null,null,null,null,null,null,"ACTAS DEL COMITÉ DEL COORDINADOR DE TELETRABAJO","430.01.15"]
[null,null,null,null,null,null,null,null,null,null,"INFORMES A ENTES DE CONTROL Y VIGILANCIA","430.47.01"]
[null,null,null,null,null,null,null,null,null,null,"INFORMES A OTROS ORGANISMOS","430.47.02"]
[null,null,null,null,null,null,null,null,null,null,"INFORMES DE GESTIÓN","430.47.16"]
[null,null,null,null,null,null,null,null,null,null,"N/A","N/A"]
[null,null,null,null,null,null,null,null,null,null,"PLANES ANUALES DE COMPRAS","430.66.03"]
[null,null,null,null,null,null,null,null,null,null,"ACTAS DEL COMITÉ DE ADMINISTRATCIÓN DE BIENES","431.01.06"]
[null,null,null,null,null,null,null,null,null,null,"N/A","N/A"]
[null,null,null,null,null,null,null,null,null,null,"COMPROBANTES DE EGRESOS DE ELEMENTOS DE CONSUMO","431.19.01"]
[null,null,null,null,null,null,null,null,null,null,"COMPROBANTES DE EGRESOS DE ELEMENTOS DEVOLUTIVOS","431.19.02"]
[null,null,null,null,null,null,null,null,null,null,"COMPROBANTES DE INGRESOS DE BIENES","431.19.03"]
[null,null,null,null,null,null,null,null,null,null,"COMPROANTES DE INGRESOS DE ELEMENTOS DE CONSUMO","431.19.04"]
[null,null,null,null,null,null,null,null,null,null,"COMPROBANTES DE TRASLADO Y  REINTEGRO DE BIENES ENTRE FUNCIONARIOS","431.19.05"]
[null,null,null,null,null,null,null,null,null,null,"N/A","N/A"]
[null,null,null,null,null,null,null,null,null,null,"INFORMES A ENTES DE CONTROL Y VIGILANCIA","431.47.01"]
[null,null,null,null,null,null,null,null,null,null,"INFORMES DE GESTIÓN","431.47.16"]
[null,null,null,null,null,null,null,null,null,null,"ACTAS DE BAJA DE BIENES","431.51.01"]
[null,null,null,null,null,null,null,null,null,null,"ACTAS DE DECOMISOS DE BIENES","431.51.02"]
[null,null,null,null,null,null,null,null,null,null,"FORMATO DE TRASLADO Y REINTEGRO DE BIENES","431.51.03"]
[null,null,null,null,null,null,null,null,null,null,"INVENTARIOS DE ALMACEN","431.54.02"]
[null,null,null,null,null,null,null,null,null,null,"INVENTARIOS DE ELEMENTOS DEVOLUTIVOS","431.54.03"]
[null,null,null,null,null,null,null,null,null,null,"INVENTARIOS Y CONCILIACIONES DE ACTIVOS FIJOS","431.54.04"]
[null,null,null,null,null,null,null,null,null,null,"N/A","N/A"]
[null,null,null,null,null,null,null,null,null,null,"INFORMES A ENTES DE CONTROL Y VIGILANCIA","432.47.01"]
[null,null,null,null,null,null,null,null,null,null,"INFORMES DE GESTIÓN","432.47.16"]
[null,null,null,null,null,null,null,null,null,null,"N/A","N/A"]
[null,null,null,null,null,null,null,null,null,null,"N/A","N/A"]
[null,null,null,null,null,null,null,null,null,null,"ACTAS DE ELIMINACIÓN DOCUMENTAL","433.01.01"]
[null,null,null,null,null,null,null,null,null,null,"MODELOS DE REQUISITOS PARA LA GESTIÓN DE DOCUMENTOS ELECTRÓNICOS","433.39.05"]
[null,null,null,null,null,null,null,null,null,null,"INFORMES DE AUTENTICACIONES","433.47.07"]
[null,null,null,null,null,null,null,null,null,null,"INFORMES DE GESTIÓN","433.47.16"]
[null,null,null,null,null,null,null,null,null,null,"BANCO TERMINOLOGICO","433.49.01"]
[null,null,null,null,null,null,null,null,null,null,"CUADRO DE CLASIFICACIÓN DOCUMENTAL ","433.49.02"]
[null,null,null,null,null,null,null,null,null,null,"INVENTARIO DOCUMENTAL","433.49.03"]
[null,null,null,null,null,null,null,null,null,null,"MAPA DE PROCESOS","433.49.04"]
[null,null,null,null,null,null,null,null,null,null,"TABLAS DE RETENCIÓN DOCUMENTAL","433.49.06"]
[null,null,null,null,null,null,null,null,null,null,"TABLAS DE VALORACIÓN DOCUMENTAL","433.49.07"]
[null,null,null,null,null,null,null,null,null,null,"INSTRUMENTOS DE CONTROL DE SALIDA DE EXPEDIENTES","433.50.02"]
[null,null,null,null,null,null,null,null,null,null,"N/A","N/A"]
[null,null,null,null,null,null,null,null,null,null,"PLANES INSTITUCIONALES DE ARCHIVOS - PINAR","433.66.21"]
[null,null,null,null,null,null,null,null,null,null,"PROGRAMAS DE GESTIÓN DOCUMENTAL","433.78.06"]
[null,null,null,null,null,null,null,null,null,null,"PROGRAMAS DEL SISTEMA INTEGRADO DE CONSERVACIÓN DOCUMENTAL","433.78.12"]
[null,null,null,null,null,null,null,null,null,null,"TRANSFERENCIAS DOCUMENTALES PRIMARIAS","433.96.01"]
[null,null,null,null,null,null,null,null,null,null,"TRANSFERENCIAS DOCUMENTALES SECUNDARIAS","433.96.02"]
[null,null,null,null,null,null,null,null,null,null,"ACTAS DEL COMITÉ PARITARIO DE SEGURIDAD Y SALUD EN EL TRABAJO","434.01.18"]
[null,null,null,null,null,null,null,null,null,null,"N/A","N/A"]
[null,null,null,null,null,null,null,null,null,null,"INFORMES DE PQRSD Y DERECHOS DE PETICIÓN","434.47.22"]
[null,null,null,null,null,null,null,null,null,null,"INSTRUMENTOS DE CONTROL DE CORRESPONDENCIA","434.50.01"]
[null,null,null,null,null,null,null,null,null,null,"N/A","N/A"]
[null,null,null,null,null,null,null,null,null,null,"PROGRAMAS DE RESPONSABILIDAD SOCIAL","434.78.08"]
[null,null,null,null,null,null,null,null,null,null,"PROGRAMAS DE SERVICIO AL CIUDADANO","434.78.09"]
[null,null,null,null,null,null,null,null,null,null,"PROGRAMAS INSTITUCIONALES DE GESTIÓN AMBIENTAL","434.78.13"]
[null,null,null,null,null,null,null,null,null,null,"N/A","N/A"]
[null,null,null,null,null,null,null,null,null,null,"N/A","N/A"]
[null,null,null,null,null,null,null,null,null,null,"INSTRUMENTOS DE CONTROL DE VEHICULOS","435.50.03"]
[null,null,null,null,null,null,null,null,null,null,"PLANES DE SEGURIDAD VIAL","435.65.16"]
[null,null,null,null,null,null,null,null,null,null,"N/A","N/A"]
[null,null,null,null,null,null,null,null,null,null,"N/A","N/A"]
[null,null,null,null,null,null,null,null,null,null,"N/A","N/A"]
[null,null,null,null,null,null,null,null,null,null,"N/A","N/A"]
[null,null,null,null,null,null,null,null,null,null,"PLANES DE SEGURIDAD Y SALUD EN EL TRABAJO","436.66.17"]
[null,null,null,null,null,null,null,null,null,null,"PROGRAMAS DE CAPACITACIÓN, BIENESTAR, INCENTIVOS, SEGURIDAD Y SALUD EN EL TRABAJO","436.78.03"]
[null,null,null,null,null,null,null,null,null,null,"PROGRAMAS DE INCENTIVOS","436.78.07"]
[null,null,null,null,null,null,null,null,null,null,"N/A","N/A"]
[null,null,null,null,null,null,null,null,null,null,"CERTIFICACIONES PARA BONO PENSIONAL Y PENSIONES","437.14.03"]
[null,null,null,null,null,null,null,null,null,null,"CUENTAS POR COBRAR DE CUOTAS PARTES PENSIONALES","437.28.01"]
[null,null,null,null,null,null,null,null,null,null,"CUENTAS POR PAGAR DE CUOTAS PARTES PENSIONALES","437.29.01"]
[null,null,null,null,null,null,null,null,null,null,"INFORMES A OTROS ORGANISMOS","437.47.02"]
[null,null,null,null,null,null,null,null,null,null,"INFORMES DE CÁLCULO ACTUARIAL","437.47.08"]
[null,null,null,null,null,null,null,null,null,null,"INFORMES DE GESTIÓN","437.47.16"]
[null,null,null,null,null,null,null,null,null,null,"N/A","N/A"]
[]
[]
[]
[]
[]
[]
[]
[]
[]
[]
[]
[]
[]
[]
[]
[]
[]
[]
[]
[]
[]
[]
[]
[]
[]
[]
[]
[]
[]
[]
[]
[]
[]
[]
[]
[]
[]
[]
[]
[]
[]
[]
[]
[]
[]
[]
[]
[]
[]
[]
[]
[]
[]
[]
[]
[]
[]
[]
[]
[]
[]
[]
[]
[]
[]
[]
[]
[]
[]
[]
[]
[]
[]
[]
[]
[]
[]
[]
[]
[]
[]
[]
[]
[]
[]
[]
[]
[]
[]
[]
[]
[]
[]
[]
[]
[]
[]
[]
[]
[]
[]
[]
[]
[]
[]
[]
[]
[]
[]
[]
[]
[null,null,null,null,437,"GRUPO INTERNO DE TRABAJO DE GESTION PENSIONAL"]

{"sheet":"Lista_Datos","index":3,"n_rows":480,"n_cols":65,"rows_kept":480,"cut":false,"hidden":true,"merged":[[0,64,1,64],[0,53,1,53],[0,54,1,54],[0,55,1,55],[0,57,1,57],[0,58,1,58],[0,59,1,59],[0,60,1,60],[0,61,1,61],[0,62,1,62],[0,63,1,63],[0,52,1,52],[0,48,1,48],[0,45,1,45],[0,39,1,39],[0,40,1,40],[0,41,1,41],[0,42,1,42],[0,43,1,43],[0,44,1,44],[0,46,1,46],[0,47,1,47],[0,49,1,49],[0,50,1,50],[0,51,1,51],[0,36,1,36],[0,37,1,37],[0,38,1,38],[0,13,1,13],[0,31,1,31],[0,32,1,32],[0,33,1,33],[0,34,1,34],[0,35,1,35],[0,12,1,12],[0,15,0,18],[0,19,0,30],[0,14,1,14],[0,0,1,0],[0,1,1,1],[0,4,1,4],[0,5,1,5],[0,6,1,6],[0,7,1,7],[0,8,1,8],[0,9,1,9],[0,10,1,10],[0,11,1,11],[0,3,1,3],[0,2,1,2]]}
["Identificador ","Oficina","Código del área","Unidades / Grupos de Trabajo","Código de la Serie","Series","Código de la Subserie","Subseries","Nombre","Descripción","Tipo ","Nombre del Responsable de la Producción de la Información\n(Propietario del Activo)","Nombre del Responsable de la Información\n(Custodio del Activo)","Fecha de Generación de la Información o Ingreso del Activo","Tipo","Macroproceso",null,null,null,"Proceso",null,null,null,null,null,null,null,null,null,null,null,"Documento_MIG","Código Documento MIG","Norma, Ley o Función que lo Justifica ","Origen","Soporte_del_Registro","Medio_de_Conservación","Formato","Idioma","Confidencialidad","Valor","Integridad","Valor","Disponibilidad","Valor","Criticidad del Activo","Información_Publicada","Lugar de Consulta o Ubicación","Objetivo legítimo de la Excepción","Fundamento Constitucional o Legal","Fundamento Jurídico de la Excepción","Excepción_Tota_o_Parcial","Fecha de Calificación\nDD/MM/AAAA","Tiempo que Cobija la Clasificación"," ¿Contiene Datos Personales?","Tipo de Datos Personales","Finalidad de la Recoleccion de los Datos Personales","Cuenta con las  Autorizaciones para el Tratamiento de los Datos Personales","¿Existe Transferencia Internacional de Datos Personales?","¿Es un Conjunto de Datos Estratégico?","¿Es un Dato Abierto?","Tipo Clasificación de Dato Publicado","URL de Publicación en Datos.gov.co","Cobertura Geográfica","Tipo de Información"]
[null,null,null,null,null,null,null,null,null,null,null,null,null,null,null,"EVALUACION","APOYO","ESTRATEGICO","MISIONAL","ANALISIS_MEJORA_GESTION","GESTION_RECURSOS","GESTION_JURIDICA","ARQUITECTURA_INSTITUCIONAL","COMUNICACION_ESTRATEGICA","COOPERACION_INTERNACIONAL","GESTION_ATENCION_GRUPOS_INTERES","MARCO_ESTRATEGICO","ACCESO_USO_APROPIACION_TIC","GESTION_CONOCIMIENTO_SECTOR_TIC","PLANEACION_FORMULACION_POLITICAS_TIC","SEGUIMIENTO_CONTROL_POLITICAS_TIC",null,null,null,null,null,null,null,null,null,null,null,null,null,null,null,null,null,null,null,null,null,null,null,null,null,"FRDP"]
["Se Genera Automaticamente","Desp. Vice-Min de Conectividad y Digitalización",100,"DESPACHO DEL MINISTRO","100.37","ESTATUTOS INTERNOS DEL FONDO DE TECNOLOGIAS DE LA INFORMACIÓN Y LAS COMUNICACIONES",null,null,"Campo de texto","Campo de texto","INFORMACIÓN","Desp. Vice-Min de Conectividad y Digitalización","Desp. Vice-Min de Conectividad y Digitalización","Campo de Fecha","ESTRATEGICO","ANALISIS_MEJORA_GESTION","GESTION_RECURSOS","ARQUITECTURA_INSTITUCIONAL","ACCESO_USO_APROPIACION_TIC","EVALUACION Y APOYO AL CONTROL DE LA GESTION","GESTION DE COMPRAS Y CONTRATACION","GESTION JURIDICA","FORTALECIMIENTO ORGANIZACIONAL","COMUNICACION ESTRATEGICA","GESTION INTERNACIONAL","GESTION DE ATENCION A GRUPOS DE INTERES","DIRECCIONAMIENTO ESTRATEGICO","ACCESO A LAS TIC","GESTION DE LA INFORMACION SECTORIAL","PLANEACION Y FORMULACION DE POLITICAS TIC","SEGUIMIENTO Y EVALUACION DE POLITICAS TIC","SI","Campo de texto","Campo de texto","Externo","Digital","Documentos de Archivo - físicos","API","Español","INFORMACIÓN PÚBLICA RESERVADA",{"$f":"IF(AP3=\"ALTA\",3,IF(AP3=\"MEDIA\",2,IF(AP3=\"BAJA\",1,IF(AP3=\"\",\"ESCOJA OPCION!\",3))))","v":3},"ALTA",3,"ALTA",3,"ALTA","Publicada (Interno - Intranet)","Campo de texto","SI","Campo de texto","Campo de texto","Reserva parcial","Campo de Fecha","Campo de texto","SI","Dato personal privado ","a)       Permitir el desarrollo del objeto del Ministerio/Fondo TIC, en los términos de los artículos 1o y 2o del Decreto 1414 de 2017.","SI","SI","SI","SI","Agricultura y Desarrollo Rural","Campo de texto","INTERNACIONAL","Estructurado"]
[null,"Desp. Vice-Min de Economía Digital",100,"DESPACHO DEL MINISTRO","100.47","INFORMES","100.47.01","Informes a Entes de Control y Vigilancia",null,null,"HARDWARE","Desp. Vice-Min de Economía Digital","Desp. Vice-Min de Economía Digital",null,"MISIONAL",null,"GESTION_JURIDICA","COMUNICACION_ESTRATEGICA","GESTION_CONOCIMIENTO_SECTOR_TIC",null,"GESTION DE RECURSOS ADMINISTRATIVOS",null,"GESTION DE TECNOLOGIAS DE LA INFORMACION ",null,null,null,null,"FORTALECIMIENTO DE LA INDUSTRIA TIC","I+D+I",null,"VIGILANCIA Y CONTROL","NO",null,null,"Interno","Físico","Documentos de Archivo - electrónicos","Base de datos","Francés","INFORMACIÓN PÚBLICA CLASIFICADA",2,"MEDIA",2,"MEDIA",2,"MEDIA","No publicada",null,"NO",null,null,"Reserva total",null,null,"NO","Dato personal público","b)       Desarrollar los estudios previos y procesos de selección para la contratación oficial del Ministerio/Fondo TIC destinada a garantizar el funcionamiento de la entidad y la ejecución de proyectos y el desarrollo de esquemas de gerencia de proyectos.","NO","NO","NO","NO","Ambiente y Desarrollo Sostenible",null,"NACIONAL","Semiestructurado"]
[null,"Despacho del Ministro ",100,"DESPACHO DEL MINISTRO","100.69","POLITICAS","100.47.02","Informes a Otros Organismos",null,null,"SOFTWARE","Despacho del Ministro ","Despacho del Ministro ",null,"APOYO",null,null,"COOPERACION_INTERNACIONAL","PLANEACION_FORMULACION_POLITICAS_TIC",null,"GESTION DEL TALENTO HUMANO",null,"GESTION DELCONOCIMIENTO",null,null,null,null,"GESTION DE LA INDUSTRIA DE LAS COMUNICACIONES",null,null,null,"N/A",null,null,"N/A","N/A","Archivos Institucionales - físicos","BWF ","Ingles","INFORMACIÓN PÚBLICA",1,"BAJA",1,"BAJA",1,"BAJA","Publicada (Externo - Internet)",null,"N/A",null,null,"Sin reserva",null,null,null,"Dato semiprivado","c)       Realizar la selección, contratación y/o vinculación de servidores públicos y contratistas de prestación de servicios de la entidad.","N/A","N/A","N/A","N/A","Ciencia, Tecnología e Innovación",null,"DEPARTAMENTAL","No estructurado"]
[null,"Dir. Apropiación de TIC",100,"DESPACHO DEL MINISTRO","100.79","PROYECTOS","100.47.16","Informes de Gestión",null,null,"SERVICIOS","Dir. Apropiación de TIC","Dir. Apropiación de TIC",null,"EVALUACION",null,null,"GESTION_ATENCION_GRUPOS_INTERES","SEGUIMIENTO_CONTROL_POLITICAS_TIC",null,"GESTION DOCUMENTAL",null,null,null,null,null,null,"USO Y APROPIACION DE LAS TIC",null,null,null,null,null,null,null,null,"Archivos Institucionales - electrónico","CGM  ","Inglés y Español","NO CLASIFICADA",3,"NO CLASIFICADA",3,"NO CLASIFICADA",3,"ALTA",null,null,null,null,null,"N/A",null,null,null,"Datos sensibles","d)       Formular, ejecutar y evaluar los programas de salud ocupacional y planes de atención a emergencias.",null,null,null,null,"Comercio, Industria y Turismo",null,"MUNICIPAL","N/A"]
[null,"Dir. de Desarrollo de la Industria TIC",100,"DESPACHO DEL MINISTRO","101.21","CONCEPTOS","100.69.02","Politicas de Divulgación y Promoción de Tecnologia de la Información y las Comunciaciones",null,null,"RECURSO HUMANO","Dir. de Desarrollo de la Industria TIC","Dir. de Desarrollo de la Industria TIC",null,null,null,null,"MARCO_ESTRATEGICO",null,null,"GESTION FINANCIERA",null,null,null,null,null,null,null,null,null,null,null,null,null,null,null,"Sistemas de Información corporativos","CSV","N/A",null,null,null,null,null,null,null,null,null,null,null,null,null,null,null,null,"N/A","e)       Mantener actualizada la historia laboral y registros de nómina de funcionarios del Ministerio/Fondo TIC.",null,null,null,null,"Cultura",null,"N/A"]
[null,"Dir. de Industria de Comunicaciones",100,"DESPACHO DEL MINISTRO","101.41","EVIDENCIAS DE LA REUNIÓN DE LAS ACCIONES INSTITUCIONALES EN EL MARCO DEL CONSENSO SOCIAL","100.79.01","Proyectos de Canales de Televisión ",null,null,"INSTALACIONES","Dir. de Industria de Comunicaciones","Dir. de Industria de Comunicaciones",null,null,null," ",null,null,null,null,null,null,null,null,null,null,null,null,null,null,null,null,null,null,null,"Sistemas de Trabajo colaborativo","dBase ",null,null,null,null,null,null,null,null,null,null,null,null,null,null,null,null,null,null,"f)         Atender y resolver peticiones, quejas, reclamos y sugerencias.",null,null,null,null,"DataJam - Desarrollo Rural"]
[null,"Dir. de Transformación Digital",100,"DESPACHO DEL MINISTRO","101.47","INFORMES","100.79.06","Proyectos de Ley",null,null,"EQUIPAMIENTO AUXILIA","Dir. de Transformación Digital","Dir. de Transformación Digital",null,null,null,null,null,null,null,null,null,null,null,null,null,null,null,null,null,null,null,null,null,null,null,"Sistema de Administración de Documentos","DXF",null,null,null,null,null,null,null,null,null,null,null,null,null,null,null,null,null,null,"g)       Conservar evidencia de los eventos de entrenamiento y sensibilización realizados, audiencias de adjudicación de contratos, reuniones internas y externas.",null,null,null,null,"Datathon Latam 2017"]
[null,"Dir. Gobierno Digital",101,"GRUPO INTERNO DE TRABAJO PARA EL CONSENSO SOCIAL","101.65","PETICIONES, QUEJAS, RECLAMOS, SUGERENCIAS Y DENUNCIAS - PQRSD","101.21.05","Conceptos Técnicos",null,null,null,"Dir. Gobierno Digital","Dir. Gobierno Digital",null,null,null,null,null,null,null,null,null,null,null,null,null,null,null,null,null,null,null,null,null,null,null,"Sistemas de Mensajería Electrónica","EML ",null,null,null,null,null,null,null,null,null,null,null,null,null,null,null,null,null,null,"h)       Atender requerimientos de información de entes de control tanto internos como externos.",null,null,null,null,"Deporte y Recreación"]
[null,"Dir. Promoción de TIC",101,"GRUPO INTERNO DE TRABAJO PARA EL CONSENSO SOCIAL","101.66","PLANES",null,null,null,null,null,"Dir. Promoción de TIC","Dir. Promoción de TIC",null,null,null,null,null,null,null,null,null,null,null,null,null,null,null,null,null,null,null,null,null,null,null,"Portales, Intranet y Extranet","GZIP",null,null,null,null,null,null,null,null,null,null,null,null,null,null,null,null,null,null,"i)         Efectuar la convocatoria y generar evidencia de la realización de sesiones de rendición de cuentas y participación ciudadana.",null,null,null,null,"Economía y Finanzas"]
[null,"Dir. Vigilancia y Control",101,"GRUPO INTERNO DE TRABAJO PARA EL CONSENSO SOCIAL","101.69","POLITICAS","101.47.16","Informes de Gestión",null,null,null,"Dir. Vigilancia y Control","Dir. Vigilancia y Control",null,null,null,null,null,null,null,null,null,null,null,null,null,null,null,null,null,null,null,null,null,null,null,"Sistemas de Bases de Datos","HTML (Página Web)",null,null,null,null,null,null,null,null,null,null,null,null,null,null,null,null,null,null,"j)         Medir y realizar seguimiento a los niveles de satisfacción. de los usuarios de los servicios del Ministerio TIC, a través de encuestas.",null,null,null,null,"Educación"]
[null,"Dir. de Infraestructura",101,"GRUPO INTERNO DE TRABAJO PARA EL CONSENSO SOCIAL","110.01","ACTAS",null,null,null,null,null,"Dir. de Infraestructura","Dir. de Infraestructura",null,null,null,null,null,null,null,null,null,null,null,null,null,null,null,null,null,null,null,null,null,null,null,"Disco duros, servidores, discos o medios portables, cintas o medios de video y audio (análogo o digital), etc.","JPEG",null,null,null,null,null,null,null,null,null,null,null,null,null,null,null,null,null,null,"k)       Registrar y/o autorizar el ingreso a las instalaciones del Edificio Murillo Toro o cualquier edificación que sea utilizada para cumplir la misión del Ministerio/Fondo TIC.",null,null,null,null,"Estadísticas Nacionales"]
[null,"GIT de Conceptos",101,"GRUPO INTERNO DE TRABAJO PARA EL CONSENSO SOCIAL","110.21","CONCEPTOS","101.66.15","Planes de Salvaguarda Etnicos",null,null,null,"GIT de Conceptos","GIT de Conceptos",null,null,null,null,null,null,null,null,null,null,null,null,null,null,null,null,null,null,null,null,null,null,null,"Cintas y medios de soporte (back up o contingencia).","JPG",null,null,null,null,null,null,null,null,null,null,null,null,null,null,null,null,null,null,"l)         Realizar análisis de seguridad para garantizar la protección de las personas y los bienes materiales que se encuentren en las instalaciones referidas en el literal k de este numeral.",null,null,null,null,"Función pública"]
[null,"GIT de Cobro Coactivo",101,"GRUPO INTERNO DE TRABAJO PARA EL CONSENSO SOCIAL","110.47","INFORMES ",null,null,null,null,null,"GIT de Cobro Coactivo","GIT de Cobro Coactivo",null,null,null,null,null,null,null,null,null,null,null,null,null,null,null,null,null,null,null,null,null,null,null,"Uso de tecnologías en la nube","JSON",null,null,null,null,null,null,null,null,null,null,null,null,null,null,null,null,null,null,"N/A",null,null,null,null,"Gastos Gubernamentales"]
[null,"GIT de Procesos Judiciales y Extrajudiciales",110,"OFICINA ASESORA DE PLANEACIÓN Y ESTUDIOS SECTORIALES","110.60","MANUALES","110.01.17","Actas del Comité Modelo Integrado de Gestión",null,null,null,"GIT de Procesos Judiciales y Extrajudiciales","GIT de Procesos Judiciales y Extrajudiciales",null,null,null,null,null,null,null,null,null,null,null,null,null,null,null,null,null,null,null,null,null,null,null,"N/A","KML",null,null,null,null,null,null,null,null,null,null,null,null,null,null,null,null,null,null,null,null,null,null,null,"Hacienda y Crédito Público"]
[null,"GIT de Actuaciones Administrativas y Asesoría Contractual",110,"OFICINA ASESORA DE PLANEACIÓN Y ESTUDIOS SECTORIALES","110.65","PETICIONES, QUEJAS, RECLAMOS, SUGERENCIAS Y DENUNCIAS - PQRSD","110.01.19","Actas del Comité Sectorial de Desarrollo Administrativo ",null,null,null,"GIT de Actuaciones Administrativas y Asesoría Contractual","GIT de Actuaciones Administrativas y Asesoría Contractual",null,null,null,null,null,null,null,null,null,null,null,null,null,null,null,null,null,null,null,null,null,null,null,null,"KML-KMZ",null,null,null,null,null,null,null,null,null,null,null,null,null,null,null,null,null,null,null,null,null,null,null,"Inclusión Social y Reconciliación"]
[null,"GIT para el Consenso Social",110,"OFICINA ASESORA DE PLANEACIÓN Y ESTUDIOS SECTORIALES","110.66","PLANES","110.01.26","Actas Grupos Comités Primarios",null,null,null,"GIT para el Consenso Social","GIT para el Consenso Social",null,null,null,null,null,null,null,null,null,null,null,null,null,null,null,null,null,null,null,null,null,null,null,null,"Maildir ",null,null,null,null,null,null,null,null,null,null,null,null,null,null,null,null,null,null,null,null,null,null,null,"Justicia y Derecho"]
[null,"GIT de Seguimiento a la Ejecución Contractual",110,"OFICINA ASESORA DE PLANEACIÓN Y ESTUDIOS SECTORIALES","111.08","ANTEPROYECTO DEL PRESUPUESTO DE INVERSIÓN","110.21.02","Conceptos de Viabilidad a los Proyectos de Inversión",null,null,null,"GIT de Seguimiento a la Ejecución Contractual","GIT de Seguimiento a la Ejecución Contractual",null,null,null,null,null,null,null,null,null,null,null,null,null,null,null,null,null,null,null,null,null,null,null,null,"MBOX ",null,null,null,null,null,null,null,null,null,null,null,null,null,null,null,null,null,null,null,null,null,null,null,"Mapas Nacionales"]
[null,"GIT de Seguimiento a la Gestión de Ingresos del Fondo TIC",110,"OFICINA ASESORA DE PLANEACIÓN Y ESTUDIOS SECTORIALES","111.47","INFORMES","110.47.01","Informes a Entes de Control y Vigilancia",null,null,null,"GIT de Seguimiento a la Gestión de Ingresos del Fondo TIC","GIT de Seguimiento a la Gestión de Ingresos del Fondo TIC",null,null,null,null,null,null,null,null,null,null,null,null,null,null,null,null,null,null,null,null,null,null,null,null,"MNG ",null,null,null,null,null,null,null,null,null,null,null,null,null,null,null,null,null,null,null,null,null,null,null,"Minas y Energía"]
[null,"GIT de Gestión del Talento Humano ",110,"OFICINA ASESORA DE PLANEACIÓN Y ESTUDIOS SECTORIALES","111.79","PROYECTOS","110.47.02","Informes a Otros Organismos",null,null,null,"GIT de Gestión del Talento Humano ","GIT de Gestión del Talento Humano ",null,null,null,null,null,null,null,null,null,null,null,null,null,null,null,null,null,null,null,null,null,null,null,null,"MP3 ",null,null,null,null,null,null,null,null,null,null,null,null,null,null,null,null,null,null,null,null,null,null,null,"Ordenamiento Territorial"]
[null,"GIT de Gestión Pensional",110,"OFICINA ASESORA DE PLANEACIÓN Y ESTUDIOS SECTORIALES","112.47","INFORMES","110.47.16","Informes de Gestión",null,null,null,"GIT de Gestión Pensional","GIT de Gestión Pensional",null,null,null,null,null,null,null,null,null,null,null,null,null,null,null,null,null,null,null,null,null,null,null,null,"ODF",null,null,null,null,null,null,null,null,null,null,null,null,null,null,null,null,null,null,null,null,null,null,null,"Organismos de Control"]
[null,"GIT de Gestión de Servicios Administrativos",110,"OFICINA ASESORA DE PLANEACIÓN Y ESTUDIOS SECTORIALES","112.66","PLANES","110.60.03","Manuales de Procesos y Procedimientos",null,null,null,"GIT de Gestión de Servicios Administrativos","GIT de Gestión de Servicios Administrativos",null,null,null,null,null,null,null,null,null,null,null,null,null,null,null,null,null,null,null,null,null,null,null,null,"Office OpenXML ",null,null,null,null,null,null,null,null,null,null,null,null,null,null,null,null,null,null,null,null,null,null,null,"Participación ciudadana"]
[null,"GIT de Fortalecimiento de las Relaciones con los Grupos de Interés",110,"OFICINA ASESORA DE PLANEACIÓN Y ESTUDIOS SECTORIALES","112.79","PROYECTOS",null,null,null,null,null,"GIT de Fortalecimiento de las Relaciones con los Grupos de Interés","GIT de Fortalecimiento de las Relaciones con los Grupos de Interés",null,null,null,null,null,null,null,null,null,null,null,null,null,null,null,null,null,null,null,null,null,null,null,null,"OOXML",null,null,null,null,null,null,null,null,null,null,null,null,null,null,null,null,null,null,null,null,null,null,null,"Presupuestos Gubernamentales"]
[null,"GIT de Gestión de la Información",110,"OFICINA ASESORA DE PLANEACIÓN Y ESTUDIOS SECTORIALES","113.01","ACTAS","110.66.01","Planes Anticorrupción y de Atención al Ciudadano",null,null,null,"GIT de Gestión de la Información","GIT de Gestión de la Información",null,null,null,null,null,null,null,null,null,null,null,null,null,null,null,null,null,null,null,null,null,null,null,null,"OpenDocument",null,null,null,null,null,null,null,null,null,null,null,null,null,null,null,null,null,null,null,null,null,null,null,"Resultados Electorales"]
[null,"GIT de Administración de Bienes",110,"OFICINA ASESORA DE PLANEACIÓN Y ESTUDIOS SECTORIALES","113.14","CERTIFICACIONES ","110.66.06","Planes de Atención a Victimas y Poblaciones Vulnerables",null,null,null,"GIT de Administración de Bienes","GIT de Administración de Bienes",null,null,null,null,null,null,null,null,null,null,null,null,null,null,null,null,null,null,null,null,null,null,null,null,"Papel",null,null,null,null,null,null,null,null,null,null,null,null,null,null,null,null,null,null,null,null,null,null,null,"Salud y Protección Social"]
[null,"GIT de Notificaciones",110,"OFICINA ASESORA DE PLANEACIÓN Y ESTUDIOS SECTORIALES","113.39","ESTUDIOS ","110.66.08","Planes de Equidad de Genero",null,null,null,"GIT de Notificaciones","GIT de Notificaciones",null,null,null,null,null,null,null,null,null,null,null,null,null,null,null,null,null,null,null,null,null,null,null,null,"PDF",null,null,null,null,null,null,null,null,null,null,null,null,null,null,null,null,null,null,null,null,null,null,null,"Seguridad y Defensa"]
[null,"GIT de Contratación",111,"GRUPO INTERNO DE TRABAJO DE PLANEACIÓN Y SEGUIMIENTO PRESUPUESTAL","114.43","FORMULARIOS UNICOS DE REPORTE DE AVANCES DE LA GESTIÓN - FURAG",null,null,null,null,null,"GIT de Contratación","GIT de Contratación",null,null,null,null,null,null,null,null,null,null,null,null,null,null,null,null,null,null,null,null,null,null,null,null,"PNG ",null,null,null,null,null,null,null,null,null,null,null,null,null,null,null,null,null,null,null,null,null,null,null,"Trabajo"]
[null,"GIT de Control Interno Disciplinario",111,"GRUPO INTERNO DE TRABAJO DE PLANEACIÓN Y SEGUIMIENTO PRESUPUESTAL","114.47","INFORMES","111.47.25","Informes de Seguimiento a  Ejecución Presupuestal",null,null,null,"GIT de Control Interno Disciplinario","GIT de Control Interno Disciplinario",null,null,null,null,null,null,null,null,null,null,null,null,null,null,null,null,null,null,null,null,null,null,null,null,"RDF-XML",null,null,null,null,null,null,null,null,null,null,null,null,null,null,null,null,null,null,null,null,null,null,null,"Transporte"]
[null,"GIT de Contabilidad",111,"GRUPO INTERNO DE TRABAJO DE PLANEACIÓN Y SEGUIMIENTO PRESUPUESTAL","114.65","PETICIONES, QUEJAS, RECLAMOS, SUGERENCIAS Y DENUNCIAS - PQRSD","111.79.04","Proyectos de Inversión Presupuestal",null,null,null,"GIT de Contabilidad","GIT de Contabilidad",null,null,null,null,null,null,null,null,null,null,null,null,null,null,null,null,null,null,null,null,null,null,null,null,"SHP",null,null,null,null,null,null,null,null,null,null,null,null,null,null,null,null,null,null,null,null,null,null,null,"Vivienda, Ciudad y Territorio"]
[null,"GIT de Cartera",112,"GRUPO INTERNO DE TRABAJO DE SEGUIMIENTO A LA ESTRATEGIA","114.78","PROGRAMAS","112.47","Informes de Gestión",null,null,null,"GIT de Cartera","GIT de Cartera",null,null,null,null,null,null,null,null,null,null,null,null,null,null,null,null,null,null,null,null,null,null,null,null,"SIARD ",null,null,null,null,null,null,null,null,null,null,null,null,null,null,null,null,null,null,null,null,null,null,null,"N/A"]
[null,"GIT de Presupuesto",112,"GRUPO INTERNO DE TRABAJO DE SEGUIMIENTO A LA ESTRATEGIA","120.01","ACTAS","112.66.04","Planes de Acción",null,null,null,"GIT de Presupuesto","GIT de Presupuesto",null,null,null,null,null,null,null,null,null,null,null,null,null,null,null,null,null,null,null,null,null,null,null,null,"SPARQL"]
[null,"GIT de Tesorería",112,"GRUPO INTERNO DE TRABAJO DE SEGUIMIENTO A LA ESTRATEGIA","120.04","ACUERDOS","112.66.05","Planes de Acción Institucionales",null,null,null,"GIT de Tesorería","GIT de Tesorería",null,null,null,null,null,null,null,null,null,null,null,null,null,null,null,null,null,null,null,null,null,null,null,null,"SQL"]
[null,"GIT de Gestión de Espectro Radioeléctrico",112,"GRUPO INTERNO DE TRABAJO DE SEGUIMIENTO A LA ESTRATEGIA","120.47","INFORMES","112.66.19","Planes Estratégicos Sectoriales ",null,null,null,"GIT de Gestión de Espectro Radioeléctrico","GIT de Gestión de Espectro Radioeléctrico",null,null,null,null,null,null,null,null,null,null,null,null,null,null,null,null,null,null,null,null,null,null,null,null,"SVG "]
[null,"GIT de Apoyo a la Gestión de Cobro Coactivo y Garantías",112,"GRUPO INTERNO DE TRABAJO DE SEGUIMIENTO A LA ESTRATEGIA","120.54","INVENTARIOS","112.79.02","Proyectos de Gestión Internos ",null,null,null,"GIT de Apoyo a la Gestión de Cobro Coactivo y Garantías","GIT de Apoyo a la Gestión de Cobro Coactivo y Garantías",null,null,null,null,null,null,null,null,null,null,null,null,null,null,null,null,null,null,null,null,null,null,null,null,"Texto Plano "]
[null,"GIT de Estructuración e Investigación",113,"GRUPO INTERNO DE TRABAJO DE ESTADISTICAS Y ESTUDIOS SECTORIALES","120.66","PLANES","113.01.03","Actas de la Mesa Técnica de Estadisticas TIC",null,null,null,"GIT de Estructuración e Investigación","GIT de Estructuración e Investigación",null,null,null,null,null,null,null,null,null,null,null,null,null,null,null,null,null,null,null,null,null,null,null,null,"TIFF"]
[null,"GIT de Operaciones",113,"GRUPO INTERNO DE TRABAJO DE ESTADISTICAS Y ESTUDIOS SECTORIALES","120.72","PROCESOS DE INFORMACIÓN SECTORIAL","113.14.01","Certificaciones de Calidad Estadistica",null,null,null,"GIT de Operaciones","GIT de Operaciones",null,null,null,null,null,null,null,null,null,null,null,null,null,null,null,null,null,null,null,null,null,null,null,null,"TMX"]
[null,"GIT de Relaciones Institucionales",113,"GRUPO INTERNO DE TRABAJO DE ESTADISTICAS Y ESTUDIOS SECTORIALES","130.47","INFORMES","113.39.05","Estudios Sectoriales",null,null,null,"GIT de Relaciones Institucionales","GIT de Relaciones Institucionales",null,null,null,null,null,null,null,null,null,null,null,null,null,null,null,null,null,null,null,null,null,null,null,null,"WAVE"]
[null,"GIT de Oferta Regional",114,"GRUPO INTERNO DE TRABAJO DE TRANSFORMACIÓN ORGANIZACIONAL","130.66","PETICIONES, QUEJAS, RECLAMOS, SUGERENCIAS Y DENUNCIAS - PQRSD",null,null,null,null,null,"GIT de Oferta Regional","GIT de Oferta Regional",null,null,null,null,null,null,null,null,null,null,null,null,null,null,null,null,null,null,null,null,null,null,null,null,"WMS"]
[null,"GIT de Proyectos Regionales",114,"GRUPO INTERNO DE TRABAJO DE TRANSFORMACIÓN ORGANIZACIONAL","130.79","PROYECTOS","114.47.03","Informes de Administración de Riesgos",null,null,null,"GIT de Proyectos Regionales","GIT de Proyectos Regionales",null,null,null,null,null,null,null,null,null,null,null,null,null,null,null,null,null,null,null,null,null,null,null,null,"XLS"]
[null,"GIT de Fomento Regional",114,"GRUPO INTERNO DE TRABAJO DE TRANSFORMACIÓN ORGANIZACIONAL","131.21","CONCEPTOS","114.47.04","Informes de Arquitectura Institucional - Componente Procesos",null,null,null,"GIT de Fomento Regional","GIT de Fomento Regional",null,null,null,null,null,null,null,null,null,null,null,null,null,null,null,null,null,null,null,null,null,null,null,null,"XLS -PDF"]
[null,"GIT Especializado de Recursos y Actuaciones Administrativas",114,"GRUPO INTERNO DE TRABAJO DE TRANSFORMACIÓN ORGANIZACIONAL","131.47","INFORMES","114.47.13","Informes de Cultura Organizacional y Apropiación del Modelo Integrado de Gestión",null,null,null,"GIT Especializado de Recursos y Actuaciones Administrativas","GIT Especializado de Recursos y Actuaciones Administrativas",null,null,null,null,null,null,null,null,null,null,null,null,null,null,null,null,null,null,null,null,null,null,null,null,"XML"]
[null,"Grupo Técnico de Innovación Social y Comunidades",114,"GRUPO INTERNO DE TRABAJO DE TRANSFORMACIÓN ORGANIZACIONAL","132.47","INFORMES","114.47.27","Informes de Seguimiento a las Políticas de Gestión y Desempeño",null,null,null,"Grupo Técnico de Innovación Social y Comunidades","Grupo Técnico de Innovación Social y Comunidades",null,null,null,null,null,null,null,null,null,null,null,null,null,null,null,null,null,null,null,null,null,null,null,null,"XPDL "]
[null,"Grupo Interno de Política",114,"GRUPO INTERNO DE TRABAJO DE TRANSFORMACIÓN ORGANIZACIONAL","132.66","PETICIONES, QUEJAS, RECLAMOS, SUGERENCIAS Y DENUNCIAS - PQRSD","114.47.29","Informes de Seguimiento, Control y Mejora",null,null,null,"Grupo Interno de Política","Grupo Interno de Política",null,null,null,null,null,null,null,null,null,null,null,null,null,null,null,null,null,null,null,null,null,null,null,null,"XPM "]
[null,"Grupo Interno de Ciudades Inteligentes",114,"GRUPO INTERNO DE TRABAJO DE TRANSFORMACIÓN ORGANIZACIONAL","132.70","PROCESOS","114.47.30","Informes del Eje Articulador - Liderazgo, Gestión del Conocimiento e Innovación",null,null,null,"Grupo Interno de Ciudades Inteligentes","Grupo Interno de Ciudades Inteligentes",null,null,null,null,null,null,null,null,null,null,null,null,null,null,null,null,null,null,null,null,null,null,null,null,"ZIP"]
[null,"GIT de Seguridad y Privacidad de la Información",114,"GRUPO INTERNO DE TRABAJO DE TRANSFORMACIÓN ORGANIZACIONAL","133.01","ACTAS",null,null,null,null,null,"GIT de Seguridad y Privacidad de la Información","GIT de Seguridad y Privacidad de la Información",null,null,null,null,null,null,null,null,null,null,null,null,null,null,null,null,null,null,null,null,null,null,null,null,"N/A"]
[null,"GIT de Investigación, Desarrollo e Innovación (I+D+i)",114,"GRUPO INTERNO DE TRABAJO DE TRANSFORMACIÓN ORGANIZACIONAL","133.02","ACCIONES CONSTITUCIONALES","114.78.02","Programas de Ambiente y Cultura Organizacional",null,null,null,"GIT de Investigación, Desarrollo e Innovación (I+D+i)","GIT de Investigación, Desarrollo e Innovación (I+D+i)"]
[null,"GIT de Emprendimiento Apps.CO",120,"OFICINA DE TECNOLOGIAS DE LA INFORMACIÓN","133.22","CONCILIACIONES","120.01.09","Actas del Comité de Control de Cambios",null,null,null,"GIT de Emprendimiento Apps.CO","GIT de Emprendimiento Apps.CO"]
[null,"GIT de Industria de Tecnologías de la Información",120,"OFICINA DE TECNOLOGIAS DE LA INFORMACIÓN","133.47","INFORMES","120.01.11","Actas del Comité de Cooperación del Sistema Colombia TIC",null,null,null,"GIT de Industria de Tecnologías de la Información","GIT de Industria de Tecnologías de la Información"]
[null,"GIT de Industria Creativa Digital",120,"OFICINA DE TECNOLOGIAS DE LA INFORMACIÓN","133.70","PROCESOS","120.04.07","Acuerdos de Servicios Estratégicos con Entidades del Sector",null,null,null,"GIT de Industria Creativa Digital","GIT de Industria Creativa Digital"]
[null,"Grupo Interno de Estrategia Talento de Tecnologías de la Información",120,"OFICINA DE TECNOLOGIAS DE LA INFORMACIÓN","134.04","ACUERDOS ","120.47.15","Informes de Estadisticas Sectoriales",null,null,null,"Grupo Interno de Estrategia Talento de Tecnologías de la Información","Grupo Interno de Estrategia Talento de Tecnologías de la Información"]
[null,"GIT de Comunicación Externa",120,"OFICINA DE TECNOLOGIAS DE LA INFORMACIÓN","134.30","CUOTAS PARTES PENSIONALES","120.47.16","Informes de Gestión",null,null,null,"GIT de Comunicación Externa","GIT de Comunicación Externa"]
[null,"GIT de Planeación y Seguimiento Presupuestal",120,"OFICINA DE TECNOLOGIAS DE LA INFORMACIÓN","134.47","INFORMES","120.54.01","Inventarios de Activos de Información",null,null,null,"GIT de Planeación y Seguimiento Presupuestal","GIT de Planeación y Seguimiento Presupuestal"]
[null,"GIT de Seguimiento a la Estrategia",120,"OFICINA DE TECNOLOGIAS DE LA INFORMACIÓN","134.70","PROCESOS","120.66.20","Planes Institucionales",null,null,null,"GIT de Seguimiento a la Estrategia","GIT de Seguimiento a la Estrategia"]
[null,"GIT de Estadísticas y Estudios Sectoriales",120,"OFICINA DE TECNOLOGIAS DE LA INFORMACIÓN","140.05","ACUERDOS INTERNACIONALES ",null,null,null,null,null,"GIT de Estadísticas y Estudios Sectoriales","GIT de Estadísticas y Estudios Sectoriales"]
[null,"GIT de Transformación Organizacional",130,"OFICINA ASESORA JURIDICA","140.47","INFORMES","130.47.16","Informes de Gestión",null,null,null,"GIT de Transformación Organizacional","GIT de Transformación Organizacional"]
[null,"Oficina Asesora de Prensa",130,"OFICINA ASESORA JURIDICA","150.12","BOLETINES INFORMATIVOS","130.47.19","Informe de Participación en el Comité de Estabilidad Jurídica",null,null,null,"Oficina Asesora de Prensa","Oficina Asesora de Prensa"]
[null,"Oficina Asesora Jurídica",130,"OFICINA ASESORA JURIDICA","150.20","COMUNICADOS DE PRENSA","130.47.21","Informes de Patrimonios Autonomos de Remanentes Par Telecom",null,null,null,"Oficina Asesora Jurídica","Oficina Asesora Jurídica"]
[null,"Oficina de Control Interno",130,"OFICINA ASESORA JURIDICA","150.47","INFORMES",null,null,null,null,null,"Oficina de Control Interno","Oficina de Control Interno"]
[null,"Oficina de Tecnologías de la Información",130,"OFICINA ASESORA JURIDICA","150.65","PETICIONES, QUEJAS, RECLAMOS, SUGERENCIAS Y DENUNCIAS - PQRSD","130.79.10","Proyectos Normativos",null,null,null,"Oficina de Tecnologías de la Información","Oficina de Tecnologías de la Información"]
[null,"Oficina Internacional",131,"GRUPO INTERNO DE TRABAJO DE CONCEPTOS","151.47","INFORMES","131.21.04","Conceptos Juirdicos",null,null,null,"Oficina Internacional","Oficina Internacional"]
[null,"Oficina para la Gestión de Ingresos del Fondo",131,"GRUPO INTERNO DE TRABAJO DE CONCEPTOS","151.65","PETICIONES, QUEJAS, RECLAMOS, SUGERENCIAS Y DENUNCIAS - PQRSD","131.47.16","Informes de Gestión",null,null,null,"Oficina para la Gestión de Ingresos del Fondo","Oficina para la Gestión de Ingresos del Fondo"]
[null,"Oficina Asesora de Planeación y Estudios Sectoriales",132,"GRUPO INTERNO DE TRABAJO ACTUACIONES ADMINISTRATIVAS Y ASESORIA CONTRACTUAL","151.66","PLANES","132.47.16","Informes de Gestión",null,null,null,"Oficina Asesora de Planeación y Estudios Sectoriales","Oficina Asesora de Planeación y Estudios Sectoriales"]
[null,"Secretaria General",132,"GRUPO INTERNO DE TRABAJO ACTUACIONES ADMINISTRATIVAS Y ASESORIA CONTRACTUAL","160.01","ACTAS",null,null,null,null,null,"Secretaria General","Secretaria General"]
[null,"Sub. de Gobierno en Línea",132,"GRUPO INTERNO DE TRABAJO ACTUACIONES ADMINISTRATIVAS Y ASESORIA CONTRACTUAL","160.47","INFORMES","132.70.18","Procesos Sancionatorios en las Actuaciones Administrativas",null,null,null,"Sub. de Gobierno en Línea","Sub. de Gobierno en Línea"]
[null,"Sub. Administrativa y de Gestión Humana",133,"GRUPO INTERNO DE TRABAJO DE PROCESOS JUDICIALES Y EXTRAJUDICIALES","160.65","PETICIONES, QUEJAS, RECLAMOS, SUGERENCIAS Y DENUNCIAS - PQRSD","133.01.07","Actas del Comité de Conciliación y Defensa Judicial ",null,null,null,"Sub. Administrativa y de Gestión Humana","Sub. Administrativa y de Gestión Humana"]
[null,"Sub. de Asuntos Postales",133,"GRUPO INTERNO DE TRABAJO DE PROCESOS JUDICIALES Y EXTRAJUDICIALES","160.66","PLANES","133.01.25","Actas del Sucomité Sectorial de Defensa Juridica",null,null,null,"Sub. de Asuntos Postales","Sub. de Asuntos Postales"]
[null,"Sub. de Comercio Electrónico",133,"GRUPO INTERNO DE TRABAJO DE PROCESOS JUDICIALES Y EXTRAJUDICIALES","160.78","PROGRAMAS","133.02.01","Acciones de Cumplimiento",null,null,null,"Sub. de Comercio Electrónico","Sub. de Comercio Electrónico"]
[null,"Sub. de Digitalización Sectorial",133,"GRUPO INTERNO DE TRABAJO DE PROCESOS JUDICIALES Y EXTRAJUDICIALES","200.47","INFORMES","133.02.02","Acciones de Grupo",null,null,null,"Sub. de Digitalización Sectorial","Sub. de Digitalización Sectorial"]
[null,"Sub. de Radiodifusión Sonora",133,"GRUPO INTERNO DE TRABAJO DE PROCESOS JUDICIALES Y EXTRAJUDICIALES","200.65","PETICIONES, QUEJAS, RECLAMOS, SUGERENCIAS Y DENUNCIAS - PQRSD","133.02.03","Acciones de Inconstitucionalidad",null,null,null,"Sub. de Radiodifusión Sonora","Sub. de Radiodifusión Sonora"]
[null,"Sub. Estándares y Arq de TI",133,"GRUPO INTERNO DE TRABAJO DE PROCESOS JUDICIALES Y EXTRAJUDICIALES","201.47","INFORMES","133.02.04","Acciones de Tutela",null,null,null,"Sub. Estándares y Arq de TI","Sub. Estándares y Arq de TI"]
[null,"Sub. Financiera",133,"GRUPO INTERNO DE TRABAJO DE PROCESOS JUDICIALES Y EXTRAJUDICIALES","201.52","INSTRUMENTOS DE CONTROL PARA LAS ACTUACIONES ADMINISTRATIVAS","133.02.05","Acciones Populares",null,null,null,"Sub. Financiera","Sub. Financiera"]
[null,"Sub. para la Industrial de Comunicaciones",133,"GRUPO INTERNO DE TRABAJO DE PROCESOS JUDICIALES Y EXTRAJUDICIALES","201.65","PETICIONES, QUEJAS, RECLAMOS, SUGERENCIAS Y DENUNCIAS - PQRSD","133.22.06","Conciliaciones Extrajudiciales",null,null,null,"Sub. para la Industrial de Comunicaciones","Sub. para la Industrial de Comunicaciones"]
[null,"Sub. Procesos de Apropiación de TIC",133,"GRUPO INTERNO DE TRABAJO DE PROCESOS JUDICIALES Y EXTRAJUDICIALES","210.21","CONCEPTOS","133.47.01","Informes a Entes de Control y Vigilancia",null,null,null,"Sub. Procesos de Apropiación de TIC","Sub. Procesos de Apropiación de TIC"]
[null,"Sub. Vigilancia y Control de Comunicaciones",133,"GRUPO INTERNO DE TRABAJO DE PROCESOS JUDICIALES Y EXTRAJUDICIALES","210.47","INFORMES","133.47.16","Informes de Gestión",null,null,null,"Sub. Vigilancia y Control de Comunicaciones","Sub. Vigilancia y Control de Comunicaciones"]
[null,"Sub. Vigilancia y Control de Radiodifusión Sonora",133,"GRUPO INTERNO DE TRABAJO DE PROCESOS JUDICIALES Y EXTRAJUDICIALES","210.65","PETICIONES, QUEJAS, RECLAMOS, SUGERENCIAS Y DENUNCIAS - PQRSD","133.70.05","Procesos Judiciales de Amparo Policivo",null,null,null,"Sub. Vigilancia y Control de Radiodifusión Sonora","Sub. Vigilancia y Control de Radiodifusión Sonora"]
[null,"Sub. Vigilancia y Control de Serv. Postales",133,"GRUPO INTERNO DE TRABAJO DE PROCESOS JUDICIALES Y EXTRAJUDICIALES","210.74","PROCESOS DE SELECCIÓN OBJETIVA DEL ESPECTRO","133.70.06","Procesos Judiciales de Conflictos de Competencias",null,null,null,"Sub. Vigilancia y Control de Serv. Postales","Sub. Vigilancia y Control de Serv. Postales"]
[null,"Sub. Dirección de Cultura Digital",133,"GRUPO INTERNO DE TRABAJO DE PROCESOS JUDICIALES Y EXTRAJUDICIALES","210.79","PROYECTOS","133.70.07","Procesos Judiciales de Controversias Contractual",null,null,null,"Sub. Dirección de Cultura Digital","Sub. Dirección de Cultura Digital"]
[null,null,133,"GRUPO INTERNO DE TRABAJO DE PROCESOS JUDICIALES Y EXTRAJUDICIALES","211.01","ACTAS","133.70.08","Procesos Judiciales de Laudo Arbitral"]
[null,null,133,"GRUPO INTERNO DE TRABAJO DE PROCESOS JUDICIALES Y EXTRAJUDICIALES","211.65","PETICIONES, QUEJAS, RECLAMOS, SUGERENCIAS Y DENUNCIAS - PQRSD","133.70.09","Procesos Judiciales de Liquidación Voluntaria"]
[null,null,133,"GRUPO INTERNO DE TRABAJO DE PROCESOS JUDICIALES Y EXTRAJUDICIALES","211.79","PROYECTOS","133.70.10","Procesos Judiciales de Nulidad"]
[null,null,133,"GRUPO INTERNO DE TRABAJO DE PROCESOS JUDICIALES Y EXTRAJUDICIALES","211.84","REGISTROS DE GESTIÓN DE PLANES DE ACCIÓN, SEGUIMIENTO Y MEJORA","133.70.11","Procesos Judiciales de Nulidad por Insconstitucionalidad"]
[null,null,133,"GRUPO INTERNO DE TRABAJO DE PROCESOS JUDICIALES Y EXTRAJUDICIALES","211.85","REGISTROS DE LA GESTIÓN  DE TRÁMITES, REGISTROS, AUTORIZACIONES, LICENCIAS Y PERMISOS","133.70.12","Procesos Judiciales de Nulidad y Restablecimiento del Derecho"]
[null,null,133,"GRUPO INTERNO DE TRABAJO DE PROCESOS JUDICIALES Y EXTRAJUDICIALES","211.86","REGISTROS DE PARTICIPACIÓN EN COMISIONES TÉCNICAS O NORMATIVAS","133.70.13","Procesos Judiciales de Reparación Directa"]
[null,null,133,"GRUPO INTERNO DE TRABAJO DE PROCESOS JUDICIALES Y EXTRAJUDICIALES","211.90","REQUERIMENTOS DE AJUSTES DE BASES DE DATOS","133.70.14","Procesos Judiciales de Restitución de Tierras"]
[null,null,133,"GRUPO INTERNO DE TRABAJO DE PROCESOS JUDICIALES Y EXTRAJUDICIALES","211.95","SOLICITUDES DENEGADAS, RECHAZADAS O INADMITIDAS SIN EXPEDIENTE EXISTENTE","133.70.15","Procesos Judiciales Ejecutivos"]
[null,null,133,"GRUPO INTERNO DE TRABAJO DE PROCESOS JUDICIALES Y EXTRAJUDICIALES","211.1.47","INFORMES ","133.70.16","Procesos Judiciales Ordinario Laboral"]
[null,null,133,"GRUPO INTERNO DE TRABAJO DE PROCESOS JUDICIALES Y EXTRAJUDICIALES","211.1.65","PETICIONES, QUEJAS, RECLAMOS, SUGERENCIAS Y DENUNCIAS - PQRSD","133.70.17","Procesos Penales"]
[null,null,133,"GRUPO INTERNO DE TRABAJO DE PROCESOS JUDICIALES Y EXTRAJUDICIALES","211.1.71","PROCESO DE ASIGNACIÓN DIRECTA DEL ESPECTRO RADIOELECTRICO ","133-70.19","Procesos Verbales"]
[null,null,133,"GRUPO INTERNO DE TRABAJO DE PROCESOS JUDICIALES Y EXTRAJUDICIALES","211.1.75","PROCESOS DE SELECCIÓN OBJETIVA PARA ASIGNACIÓN DEL ESPECTRO RADIOELÉCTRICO","133.70.20","Procesos y Actuaciones Administrativas"]
[null,null,134,"GRUPO INTERNO DE TRABAJO DE COBRO COACTIVO","211.1.81","REGISTRO DE RADIOAFICIONADOS Y RADIOS ITINERANTES","134.04.01","Acuerdos de Liquidación Obligatoria"]
[null,null,134,"GRUPO INTERNO DE TRABAJO DE COBRO COACTIVO","211.1.82","REGISTROS DE ASOCIACIONES DE RADIOAFICIONADOS Y DE BANDA CIUDADANA","134.04.02","Acuerdos de Liquidación Voluntaria"]
[null,null,134,"GRUPO INTERNO DE TRABAJO DE COBRO COACTIVO","211.1.87","REGISTROS DE PROVEEDOR DE CAPACIDAD SATELITAL","134.04.04","Acuerdos de Reestructuración de Pasivos"]
[null,null,134,"GRUPO INTERNO DE TRABAJO DE COBRO COACTIVO","211.2.47","INFORMES","134.04.05","Acuerdos de Reestructuración Empresarial"]
[null,null,134,"GRUPO INTERNO DE TRABAJO DE COBRO COACTIVO","211.2.65","PETICIONES, QUEJAS, RECLAMOS, SUGERENCIAS Y DENUNCIAS - PQRSD","134.04.06","Acuerdos de Reorganización Empresarial"]
[null,null,134,"GRUPO INTERNO DE TRABAJO DE COBRO COACTIVO","211.2.79","PROYECTOS","134.04.08","Acuerdo Extrajudicial de Validación"]
[null,null,134,"GRUPO INTERNO DE TRABAJO DE COBRO COACTIVO","211.2.83","REGISTROS DE GESTIÓN DE GARANTÍAS Y COBRO COACTIVO","134.30.01","Cobro Coactivo"]
[null,null,134,"GRUPO INTERNO DE TRABAJO DE COBRO COACTIVO","212.01","ACTAS","134.47.01","Informes a Entes de Control y Vigilancia"]
[null,null,134,"GRUPO INTERNO DE TRABAJO DE COBRO COACTIVO","212.39","ESTUDIOS","134.47.02","Informes a Otros Organismos"]
[null,null,134,"GRUPO INTERNO DE TRABAJO DE COBRO COACTIVO","212.58","LICENCIAS DE CONCESIÓN DE SERVICIOS DE RADIODIFUSIÓN SONORA","134.47.16","Informes de Gestión"]
[null,null,134,"GRUPO INTERNO DE TRABAJO DE COBRO COACTIVO","212.65","PETICIONES, QUEJAS, RECLAMOS, SUGERENCIAS Y DENUNCIAS - PQRSD","134.70.04","Procesos Ejecutivos Abiertos de Cobro Coactivo"]
[null,null,140,"OFICINA INTERNACIONAL","212.66","PLANES","140.05.01","Acuerdos Internacionales de Cooperación"]
[null,null,140,"OFICINA INTERNACIONAL","212.67","POLITICA NACIONAL DE RADIODIFUSIÓN SONORA","140.47.02","Informes a Otros Organismos"]
[null,null,140,"OFICINA INTERNACIONAL","212.73","PROCESOS DE SELECCIÓN OBJETIVA ASIGNACIÓN DE LICENCIAS DE RADIODIFUSIÓN SONORA","140.47.10","Informes de Comisiones Internacionales"]
[null,null,140,"OFICINA INTERNACIONAL","212.79","PROYECTOS","140.47.16","Informes de Gestión"]
[null,null,150,"OFICINA ASESORA DE PRENSA ","213.21","CONCEPTOS","150.12.03"]
[null,null,150,"OFICINA ASESORA DE PRENSA ","213.25","CONVENIOS  DEL CODIGO POSTAL DE LA REPÚBLICA DE COLOMBIA"]
[null,null,150,"OFICINA ASESORA DE PRENSA ","213.47","INFORMES","150.47.16","Informes de Gestión "]
[null,null,150,"OFICINA ASESORA DE PRENSA ","213.48","INSCRIPCIÓN DE OPERADORES EN EL REGISTRO POSTAL","150.47.17","Informes de Gestión Audiovisuales"]
[null,null,150,"OFICINA ASESORA DE PRENSA ","213.53","INVENTARIOS DEL MUSEO DE TECNOLOGIAS DE LA INFORMACIÓN Y LAS COMUNICACIONES"]
[null,null,151,"GRUPO INTERNO DE TRABAJO DE COMUNICACIÓN EXTERNA","213.67","POLITICA DE SERVICIOS POSTALES","151.47.16","Informes de Gestión"]
[null,null,151,"GRUPO INTERNO DE TRABAJO DE COMUNICACIÓN EXTERNA","213.93","RESOLUCIONES DE HABILITACIÓN DE SERVICIOS POSTALES"]
[null,null,151,"GRUPO INTERNO DE TRABAJO DE COMUNICACIÓN EXTERNA","213.94","SOLICITUDES DE EMISIONES FILATELICAS","151.66.07","Planes de Divulgación"]
[null,null,160,"OFICINA DE CONTROL INTERNO","220.47","INFORMES","160.01.02","Actas del Comité de Coordinación del Sistema de Control Interno"]
[null,null,160,"OFICINA DE CONTROL INTERNO","220.65","PETICIONES, QUEJAS, RECLAMOS, SUGERENCIAS Y DENUNCIAS - PQRSD","160.47.01","Informes a Entidades de Control y Vigilancia"]
[null,null,160,"OFICINA DE CONTROL INTERNO","220.70","PROCESOS ","160.47.05","Informes de Auditorias de Calidad"]
[null,null,160,"OFICINA DE CONTROL INTERNO","220.78","PROGRAMAS","160.47.06","Informes de Auditorias de Gestión"]
[null,null,160,"OFICINA DE CONTROL INTERNO","221.03","ACTUACIONES DE VIGILANCIA Y CONTROL ","160.47.16","Informes de Gestión"]
[null,null,160,"OFICINA DE CONTROL INTERNO","221.47","INFORMES"]
[null,null,160,"OFICINA DE CONTROL INTERNO","221.65","PETICIONES, QUEJAS, RECLAMOS, SUGERENCIAS Y DENUNCIAS - PQRSD","160.66.11","Planes de Mejoramiento de Calidad y Gestión"]
[null,null,160,"OFICINA DE CONTROL INTERNO","221.70","PROCESOS","160.66.13","Planes de Mejoramiento para Contraloria"]
[null,null,160,"OFICINA DE CONTROL INTERNO","221.78","PROGRAMAS","160.78.01","Programas Anuales de Auditorias"]
[null,null,200,"DESPACHO DEL VICEMINISTRO DE CONECTIVIDAD Y DIGITALIZACIÓN","222.21","CONCEPTOS","200.47.16","Informes de Gestión"]
[null,null,200,"DESPACHO DEL VICEMINISTRO DE CONECTIVIDAD Y DIGITALIZACIÓN","222.47","INFORMES"]
[null,null,201,"GRUPO INTERNO DE TRABAJO ESPECIALIZADO DE RECURSOS Y ACTUACIONES ADMINISTRATIVAS","222.65","PETICIONES, QUEJAS, RECLAMOS, SUGERENCIAS Y DENUNCIAS - PQRSD","201.47.16","Informes de Gestión"]
[null,null,201,"GRUPO INTERNO DE TRABAJO ESPECIALIZADO DE RECURSOS Y ACTUACIONES ADMINISTRATIVAS","222.70","PROCESOS"]
[null,null,201,"GRUPO INTERNO DE TRABAJO ESPECIALIZADO DE RECURSOS Y ACTUACIONES ADMINISTRATIVAS","222.78","PROGRAMAS"]
[null,null,210,"DIRECCIÓN DE INDUSTRIA DE COMUNICACIONES","223.21","CONCEPTOS","210.21.06","Conceptos Técnicos sobre Servicios de Telecomunicaciones "]
[null,null,210,"DIRECCIÓN DE INDUSTRIA DE COMUNICACIONES","223.47","INFORMES","210.47.16","Informes de Gestión"]
[null,null,210,"DIRECCIÓN DE INDUSTRIA DE COMUNICACIONES","223.65","PETICIONES, QUEJAS, RECLAMOS, SUGERENCIAS Y DENUNCIAS - PQRSD"]
[null,null,210,"DIRECCIÓN DE INDUSTRIA DE COMUNICACIONES","223.70","PROCESOS"]
[null,null,210,"DIRECCIÓN DE INDUSTRIA DE COMUNICACIONES","223.78","PROGRAMAS","210.79.03","Proyectos de Inversión"]
[null,null,210,"DIRECCIÓN DE INDUSTRIA DE COMUNICACIONES","230.47","INFORMES","210.79.12","Proyectos por Obligaciones de Hacer"]
[null,null,211,"SUBDIRECCIÓN PARA LA INDUSTRIA DE COMUNICACIONES","230.66","PLANES","211.01.13","Actas del Comité de Obligaciones de Hacer"]
[null,null,211,"SUBDIRECCIÓN PARA LA INDUSTRIA DE COMUNICACIONES","231.47","INFORMES"]
[null,null,211,"SUBDIRECCIÓN PARA LA INDUSTRIA DE COMUNICACIONES","232.47","INFORMES","211.79.13","Proyectos Técnicos y Normativos"]
[null,null,211,"SUBDIRECCIÓN PARA LA INDUSTRIA DE COMUNICACIONES","233.42","EVIDENCIAS EN EL MARCO DE LA ARTICULACIÓN TERRITORIAL"]
[null,null,211,"SUBDIRECCIÓN PARA LA INDUSTRIA DE COMUNICACIONES","233.47","INFORMES"]
[null,null,211,"SUBDIRECCIÓN PARA LA INDUSTRIA DE COMUNICACIONES","233.65","PETICIONES, QUEJAS, RECLAMOS, SUGERENCIAS Y DENUNCIAS - PQRSD"]
[null,null,211,"SUBDIRECCIÓN PARA LA INDUSTRIA DE COMUNICACIONES","240.47","INFORMES"]
[null,null,211,"SUBDIRECCIÓN PARA LA INDUSTRIA DE COMUNICACIONES","241.47","INFORMES"]
[null,null,211.1,"GRUPO INTERNO DE TRABAJO DE GESTIÓN DE ESPECTRO RADIOÉLECTRICO","241.61","MATRICES DE OFERTA INSTITUCIONAL","211.1.47.18","Informes de Participación en Comisiones Técnicas o Normativas"]
[null,null,211.1,"GRUPO INTERNO DE TRABAJO DE GESTIÓN DE ESPECTRO RADIOÉLECTRICO","241.65","PETICIONES, QUEJAS, RECLAMOS, SUGERENCIAS Y DENUNCIAS - PQRSD"]
[null,null,211.1,"GRUPO INTERNO DE TRABAJO DE GESTIÓN DE ESPECTRO RADIOÉLECTRICO","242.47","INFORMES"]
[null,null,211.1,"GRUPO INTERNO DE TRABAJO DE GESTIÓN DE ESPECTRO RADIOÉLECTRICO","242.65","PETICIONES, QUEJAS, RECLAMOS, SUGERENCIAS Y DENUNCIAS - PQRSD"]
[null,null,211.1,"GRUPO INTERNO DE TRABAJO DE GESTIÓN DE ESPECTRO RADIOÉLECTRICO","243.47","INFORMES"]
[null,null,211.1,"GRUPO INTERNO DE TRABAJO DE GESTIÓN DE ESPECTRO RADIOÉLECTRICO","243.65","PETICIONES, QUEJAS, RECLAMOS, SUGERENCIAS Y DENUNCIAS - PQRSD"]
[null,null,211.1,"GRUPO INTERNO DE TRABAJO DE GESTIÓN DE ESPECTRO RADIOÉLECTRICO","300.47","INFORMES"]
[null,null,211.2,"GRUPO INTERNO DE TRABAJO DE APOYO A LA GESTIÓN DE COBRO COACTIVO Y GARANTIAS","300.65","PETICIONES, QUEJAS, RECLAMOS, SUGERENCIAS Y DENUNCIAS - PQRSD","211.2.47.16","Informes de Gestión"]
[null,null,211.2,"GRUPO INTERNO DE TRABAJO DE APOYO A LA GESTIÓN DE COBRO COACTIVO Y GARANTIAS","300.78","PROGRAMAS"]
[null,null,211.2,"GRUPO INTERNO DE TRABAJO DE APOYO A LA GESTIÓN DE COBRO COACTIVO Y GARANTIAS","300.79","PROYECTOS","211.2.79.11","Proyectos Normativos y de Reglamentos en Materia de Garantías"]
[null,null,211.2,"GRUPO INTERNO DE TRABAJO DE APOYO A LA GESTIÓN DE COBRO COACTIVO Y GARANTIAS","310.47","INFORMES"]
[null,null,212,"SUBDIRECCIÓN DE RADIO DIFUSIÓN SONORA","310.65","PETICIONES, QUEJAS, RECLAMOS, SUGERENCIAS Y DENUNCIAS - PQRSD","212.01.05","Actas del Comité Consultivo de Radio Comunitaria"]
[null,null,212,"SUBDIRECCIÓN DE RADIO DIFUSIÓN SONORA","310.1.33","DIAGNÓSTICOS DE POLITICA PÚBLICA DE TI EN POBLACIONES VULNERABLES","212.39.01","Estudios de Radiodifusión Sonora"]
[null,null,212,"SUBDIRECCIÓN DE RADIO DIFUSIÓN SONORA","310.1.47","INFORMES","212.58.01","Solicitudes Licencias de Cadenas Radiales"]
[null,null,212,"SUBDIRECCIÓN DE RADIO DIFUSIÓN SONORA","310.1.65","PETICIONES, QUEJAS, RECLAMOS, SUGERENCIAS Y DENUNCIAS - PQRSD","212.58.02","Solicitudes Licencias de Emisoras Comerciales"]
[null,null,212,"SUBDIRECCIÓN DE RADIO DIFUSIÓN SONORA","311.47","INFORMES","212.58.03","Solicitudes Licencias de Emisoras Comunitarias"]
[null,null,212,"SUBDIRECCIÓN DE RADIO DIFUSIÓN SONORA","311.65","PETICIONES, QUEJAS, RECLAMOS, SUGERENCIAS Y DENUNCIAS - PQRSD","212.58.04","Solicitudes Licencias de Emisoras de Interés Público"]
[null,null,212,"SUBDIRECCIÓN DE RADIO DIFUSIÓN SONORA","311.79","PROYECTOS","212.58.05","Solicitudes de Licencias de Transmoviles"]
[null,null,212,"SUBDIRECCIÓN DE RADIO DIFUSIÓN SONORA","312.47","INFORMES"]
[null,null,212,"SUBDIRECCIÓN DE RADIO DIFUSIÓN SONORA","312.65","PETICIONES, QUEJAS, RECLAMOS, SUGERENCIAS Y DENUNCIAS - PQRSD","212.66.22","Planes Técnicos Nacionales de Radiodifusión Sonora"]
[null,null,212,"SUBDIRECCIÓN DE RADIO DIFUSIÓN SONORA","320.47","INFORMES"]
[null,null,212,"SUBDIRECCIÓN DE RADIO DIFUSIÓN SONORA","320.65","PETICIONES, QUEJAS, RECLAMOS, SUGERENCIAS Y DENUNCIAS - PQRSD"]
[null,null,212,"SUBDIRECCIÓN DE RADIO DIFUSIÓN SONORA","320.66","PLANES","212.79.05","Proyectos de Inversión Radio Pública"]
[null,null,213,"SUBDIRECCIÓN DE ASUNTOS POSTALES","320.78","PROGRAMAS","213.21.03","Conceptos Emitidos"]
[null,null,213,"SUBDIRECCIÓN DE ASUNTOS POSTALES","320.1.38","ESTRATEGIAS DE SEGURIDAD Y PRIVACIDAD DE LA INFORMACIÓN"]
[null,null,213,"SUBDIRECCIÓN DE ASUNTOS POSTALES","320.1.69","POLITICAS","213.47.16","Informes de Gestión"]
[null,null,213,"SUBDIRECCIÓN DE ASUNTOS POSTALES","320.2.47","INFORMES"]
[null,null,213,"SUBDIRECCIÓN DE ASUNTOS POSTALES","320.2.65","PETICIONES, QUEJAS, RECLAMOS, SUGERENCIAS Y DENUNCIAS - PQRSD"]
[null,null,213,"SUBDIRECCIÓN DE ASUNTOS POSTALES","320.2.66","PLANES"]
[null,null,213,"SUBDIRECCIÓN DE ASUNTOS POSTALES","320.2.78","PROGRAMAS","213.93.01","Incoporación en el Registro Postal"]
[null,null,213,"SUBDIRECCIÓN DE ASUNTOS POSTALES","320.3.39","ESTUDIOS","213.93.02","Resoluciones de Habilitación de Servicios Postales de Pago"]
[null,null,213,"SUBDIRECCIÓN DE ASUNTOS POSTALES","320.3.47","INFORMES","213.93.03","Resoluciones de Habilitación de Servicios Postales para Mensajeria Expresa"]
[null,null,213,"SUBDIRECCIÓN DE ASUNTOS POSTALES","320.3.65","PETICIONES, QUEJAS, RECLAMOS, SUGERENCIAS Y DENUNCIAS - PQRSD"]
[null,null,220,"DIRECCIÓN DE VIGILANCIA Y CONTROL","320.3.69","POLITICAS ","220.47.16","Informes de Gestión"]
[null,null,220,"DIRECCIÓN DE VIGILANCIA Y CONTROL","321.47","INFORMES","220.47.23","Informes de Presunto Incumplimiento"]
[null,null,220,"DIRECCIÓN DE VIGILANCIA Y CONTROL","321.65","PETICIONES, QUEJAS, RECLAMOS, SUGERENCIAS Y DENUNCIAS - PQRSD"]
[null,null,220,"DIRECCIÓN DE VIGILANCIA Y CONTROL","321.66","PLANES","220.70.01","Procesos Administrativos contra los Proveedores"]
[null,null,220,"DIRECCIÓN DE VIGILANCIA Y CONTROL","321.69","POLITICAS","220.78.11","Programas de Vigilancia y Control Preventivos"]
[null,null,221,"SUBDIRECCIÓN DE VIGILANCIA Y CONTROL DE COMUNICACIONES","321.70","PROCESOS"]
[null,null,221,"SUBDIRECCIÓN DE VIGILANCIA Y CONTROL DE COMUNICACIONES","321.79","PROYECTOS","221.47.16","Informes de Gestión"]
[null,null,221,"SUBDIRECCIÓN DE VIGILANCIA Y CONTROL DE COMUNICACIONES","322.06","ALIANZAS PUBLICO PRIVADAS NACIONALES E INTERNACIONALES"]
[null,null,221,"SUBDIRECCIÓN DE VIGILANCIA Y CONTROL DE COMUNICACIONES","322.47","INFORMES","221.70.02","Procesos Administrativos Sancionatorios"]
[null,null,221,"SUBDIRECCIÓN DE VIGILANCIA Y CONTROL DE COMUNICACIONES","322.55","INVESTIGACIONES EN MATERIA DE TECNOLÓGIAS DE LA INFORMACIÓN","221.78.15","Programas Preventivos de Servicios de Telecomunicaciones"]
[null,null,222,"SUBDIRECCIÓN DE VIGILANCIA Y CONTROL DE RADIODIFUSIÓN SONORA","322.65","PETICIONES, QUEJAS, RECLAMOS, SUGERENCIAS Y DENUNCIAS - PQRSD","222.21.01","Conceptos de no Procedibilidad"]
[null,null,222,"SUBDIRECCIÓN DE VIGILANCIA Y CONTROL DE RADIODIFUSIÓN SONORA","322.69","POLITICAS","222.47.16","Informes de Gestión"]
[null,null,222,"SUBDIRECCIÓN DE VIGILANCIA Y CONTROL DE RADIODIFUSIÓN SONORA","330.01","ACTAS"]
[null,null,222,"SUBDIRECCIÓN DE VIGILANCIA Y CONTROL DE RADIODIFUSIÓN SONORA","339.39","ESTUDIOS","222.70.02","Procesos Admnistrativos Sancionatorios"]
[null,null,222,"SUBDIRECCIÓN DE VIGILANCIA Y CONTROL DE RADIODIFUSIÓN SONORA","330.47","INFORMES","222.78.14","Programas Preventivos de Servicios de Radiodifusión Sonora"]
[null,null,223,"SUBDIRECCIÓN DE VIGILANCIA Y CONTROL DE SERVICIOS POSTALES","330.65","PETICIONES, QUEJAS, RECLAMOS, SUGERENCIAS Y DENUNCIAS - PQRSD","223.21.01","Conceptos de no Procedibilidad"]
[null,null,223,"SUBDIRECCIÓN DE VIGILANCIA Y CONTROL DE SERVICIOS POSTALES","330.1.47","INFORMES","223.47.16","Informes de Gestión"]
[null,null,223,"SUBDIRECCIÓN DE VIGILANCIA Y CONTROL DE SERVICIOS POSTALES","330.1.65","PETICIONES, QUEJAS, RECLAMOS, SUGERENCIAS Y DENUNCIAS - PQRSD"]
[null,null,223,"SUBDIRECCIÓN DE VIGILANCIA Y CONTROL DE SERVICIOS POSTALES","331.47","INFORMES ","223.70.02","Procesos Administrativos Sancionatorios"]
[null,null,223,"SUBDIRECCIÓN DE VIGILANCIA Y CONTROL DE SERVICIOS POSTALES","331.65","PETICIONES, QUEJAS, RECLAMOS, SUGERENCIAS Y DENUNCIAS - PQRSD","223.78.16","Programas Preventivos de Servicios Postales"]
[null,null,230,"DIRECCIÓN DE INFRAESTUCTURA","332.47","INFORMES","230.47.01","Informes a Entes de Control y Vigilancia"]
[null,null,230,"DIRECCIÓN DE INFRAESTUCTURA","332.65","PETICIONES, QUEJAS, RECLAMOS, SUGERENCIAS Y DENUNCIAS - PQRSD","230.47.02","Informes a Otros Organismos"]
[null,null,230,"DIRECCIÓN DE INFRAESTUCTURA","340.39","ESTUDIOS","230.47.16","Informes de Gestión"]
[null,null,230,"DIRECCIÓN DE INFRAESTUCTURA","340.47","INFORMES","230.47.28","Informes de Seguimiento de Calidad"]
[null,null,230,"DIRECCIÓN DE INFRAESTUCTURA","340.65","PETICIONES, QUEJAS, RECLAMOS, SUGERENCIAS Y DENUNCIAS - PQRSD","230.66.10","Planes de Mejoramiento"]
[null,null,231,"GRUPO INTERNO DE TRABAJO DE ESTRUCTURACIÓN E INVESTIGACIÓN","341.47","INFORMES","231.47.16","Informes de Gestión"]
[null,null,232,"GRUPO INTERNO DE TRABAJO DE OPERACIONES","341.65","PETICIONES, QUEJAS, RECLAMOS, SUGERENCIAS Y DENUNCIAS - PQRSD","232.47.16","Informes de Gestión"]
[null,null,233,"GRUPO INTERNO DE TRABAJO DE RELACIONES INSTITUCIONALES","342.47","INFORMES"]
[null,null,233,"GRUPO INTERNO DE TRABAJO DE RELACIONES INSTITUCIONALES","342.65","PETICIONES, QUEJAS, RECLAMOS, SUGERENCIAS Y DENUNCIAS - PQRSD","233.47.01","Informes a Entes de Control y Vigilancia"]
[null,null,233,"GRUPO INTERNO DE TRABAJO DE RELACIONES INSTITUCIONALES","343.47","INFORMES"]
[null,null,240,"DIRECCIÓN DE PROMOCIÓN DE TECNOLOGÍAS DE LA INFORMACIÓN Y LAS COMUNICACIONES","343.65","PETICIONES, QUEJAS, RECLAMOS, SUGERENCIAS Y DENUNCIAS - PQRSD","240.47.01","Informes a Entes de Control y Vigilancia"]
[null,null,240,"DIRECCIÓN DE PROMOCIÓN DE TECNOLOGÍAS DE LA INFORMACIÓN Y LAS COMUNICACIONES","344.47","INFORMES ","240.47.16","Informes de Gestión"]
[null,null,241,"GRUPO INTERNO DE TRABAJO DE OFERTA REGIONAL","344.65","PETICIONES, QUEJAS, RECLAMOS, SUGERENCIAS Y DENUNCIAS - PQRSD","241.47.16","Informes de Gestión"]
[null,null,241,"GRUPO INTERNO DE TRABAJO DE OFERTA REGIONAL","400.01","ACTAS"]
[null,null,241,"GRUPO INTERNO DE TRABAJO DE OFERTA REGIONAL","400.16","CIRCULARES "]
[null,null,242,"GRUPO INTERNO DE TRABAJO DE PROYECTOS REGIONALES","400.32","DECRETOS ","242.47.16","Informes de Gestión"]
[null,null,242,"GRUPO INTERNO DE TRABAJO DE PROYECTOS REGIONALES","400.60","MANUALES"]
[null,null,243,"GRUPO INTERNO DE TRABAJO DE FOMENTO REGIONAL","400.65","PETICIONES, QUEJAS, RECLAMOS, SUGERENCIAS Y DENUNCIAS - PQRSD","243.47.16","Informes de Gestión"]
[null,null,243,"GRUPO INTERNO DE TRABAJO DE FOMENTO REGIONAL","400.92","RESOLUCIONES"]
[null,null,300,"DESPACHO DEL VICEMINISTRO DE ECONOMIA DIGITAL","401.01","ACTAS","300.47.16","Informes de Gestión"]
[null,null,300,"DESPACHO DEL VICEMINISTRO DE ECONOMIA DIGITAL","401.24","CONTRATOS"]
[null,null,300,"DESPACHO DEL VICEMINISTRO DE ECONOMIA DIGITAL","401.26","CONVENIOS","300.78.04","Programas de Ciudades Inteligentes"]
[null,null,300,"DESPACHO DEL VICEMINISTRO DE ECONOMIA DIGITAL","401.47","INFORMES","300.78.05","Programas de Emprendimiento Digital"]
[null,null,300,"DESPACHO DEL VICEMINISTRO DE ECONOMIA DIGITAL","401.65","PETICIONES, QUEJAS, RECLAMOS, SUGERENCIAS Y DENUNCIAS - PQRSD","300.79.03","Proyectos de Inversión"]
[null,null,310,"DIRECCIÓN DE APROPIACIÓN DE TECNOLOGÍAS DE LA INFORMACIÓN Y LAS COMUNICACIONES","402.47","INFORMES","310.47.16","Informes de Gestión"]
[null,null,310,"DIRECCIÓN DE APROPIACIÓN DE TECNOLOGÍAS DE LA INFORMACIÓN Y LAS COMUNICACIONES","402.65","PETICIONES, QUEJAS, RECLAMOS, SUGERENCIAS Y DENUNCIAS - PQRSD"]
[null,null,"310.1","GRUPO INTERNO DE TRABAJO TÉCNICO DE INNOVACIÓN SOCIAL Y APROPIACIÓN EN COMUNIDADES","402.76","PROCESOS DISCIPLINARIOS"]
[null,null,"310.1","GRUPO INTERNO DE TRABAJO TÉCNICO DE INNOVACIÓN SOCIAL Y APROPIACIÓN EN COMUNIDADES","402.77","PROCESOS ORDINARIOS","310.1.47.16","Informes de Gestión"]
[null,null,"310.1","GRUPO INTERNO DE TRABAJO TÉCNICO DE INNOVACIÓN SOCIAL Y APROPIACIÓN EN COMUNIDADES","410.01","ACTAS"]
[null,null,311,"SUBDIRECCIÓN DE PROCESOS DE APROPIACIÓN DE TECNOLOGÍAS DE LA INFORMACIÓN Y LAS COMUNICACIONES","410.07","ANTEPROYECTO DE INGRESOS DEL FONDO","311.47.09","Informes de Comisión"]
[null,null,311,"SUBDIRECCIÓN DE PROCESOS DE APROPIACIÓN DE TECNOLOGÍAS DE LA INFORMACIÓN Y LAS COMUNICACIONES","410.47","INFORMES"]
[null,null,311,"SUBDIRECCIÓN DE PROCESOS DE APROPIACIÓN DE TECNOLOGÍAS DE LA INFORMACIÓN Y LAS COMUNICACIONES","410.65","PETICIONES, QUEJAS, RECLAMOS, SUGERENCIAS Y DENUNCIAS - PQRSD","311.79.03","Proyectos de Inversión"]
[null,null,312,"SUBDIRECCIÓN DE CULTURA DIGITAL","410.66","PLANES","312.47,16","Informes de Gestión"]
[null,null,312,"SUBDIRECCIÓN DE CULTURA DIGITAL","410.92","RESOLUCIONES"]
[null,null,320,"DIRECCIÓN DE GOBIERNO DIGITAL","411.01","ACTAS","320.47.16","Informes de Gestión"]
[null,null,320,"DIRECCIÓN DE GOBIERNO DIGITAL","411.47","INFORMES"]
[null,null,320,"DIRECCIÓN DE GOBIERNO DIGITAL","412.01","ACTAS","320.66.04","Planes de Acción"]
[null,null,320,"DIRECCIÓN DE GOBIERNO DIGITAL","412.47","INFORMES","320.78.10","Programas de Tecnologias de la Información en las Entidades del Estado"]
[null,null,"320.1","GRUPO INTERNO DE TRABAJO DE SEGURIDAD Y PRIVACIDAD DE LA INFORMACIÓN","420.47","INFORMES"]
[null,null,"320.1","GRUPO INTERNO DE TRABAJO DE SEGURIDAD Y PRIVACIDAD DE LA INFORMACIÓN","420.65","PETICIONES, QUEJAS, RECLAMOS, SUGERENCIAS Y DENUNCIAS - PQRSD","320.1.69.04","Políticas de Protección de la Información Pública"]
[null,null,"320.2","GRUPO INTERNO DE TRABAJO DE CIUDADES INTELIGENTES","421.04","ACUERDOS ","320.2.47","Informes de Gestión"]
[null,null,"320.2","GRUPO INTERNO DE TRABAJO DE CIUDADES INTELIGENTES","421.12","BOLETINES"]
[null,null,"320.2","GRUPO INTERNO DE TRABAJO DE CIUDADES INTELIGENTES","421.15","CERTIFICADOS ","320.2.66.14","Planes de Monitoreo y Evaluación de Ciudades Inteligentes"]
[null,null,"320.2","GRUPO INTERNO DE TRABAJO DE CIUDADES INTELIGENTES","421.22","CONCILIACIONES","320.2.78.04","Programas de Ciudades Inteligentes"]
[null,null,"320.3","GRUPO INTERNO DE TRABAJO DE POLITICA","421.27","CUENTAS BANCARIAS","320.3.39.02","Estudios en Materia de Gobierno Digital"]
[null,null,"320.3","GRUPO INTERNO DE TRABAJO DE POLITICA","421.31","DECLARACIONES TRIBUTARIAS ","320.3.47.16","Informes de Gestión"]
[null,null,"320.3","GRUPO INTERNO DE TRABAJO DE POLITICA","421.34","EMBARGOS"]
[null,null,"320.3","GRUPO INTERNO DE TRABAJO DE POLITICA","421.40","EVALUACIÓN Y SEGUIMIENTO DE CONVENIOS BANCARIOS","320.3.69.03","Politicas de Gobierno Digital"]
[null,null,321,"SUBDIRECCIÓN DE GOBIERNO EN LINEA","421.47","INFORMES","321.47.02","Informes a Otros Organismos"]
[null,null,321,"SUBDIRECCIÓN DE GOBIERNO EN LINEA","421.56","LEGALIZACIONES","321.47.16","Informes de Gestión"]
[null,null,321,"SUBDIRECCIÓN DE GOBIERNO EN LINEA","421.57","LIBROS AUXILIARES"]
[null,null,321,"SUBDIRECCIÓN DE GOBIERNO EN LINEA","421.62","NÓMINA","321.66.18","Planes Estrategicos de Gobierno Electronico del Estado"]
[null,null,321,"SUBDIRECCIÓN DE GOBIERNO EN LINEA","421.64","ORDENES DE PAGO","321.69.05","Politicas de Trámites y Servicios de la Informaciòn Estatal"]
[null,null,321,"SUBDIRECCIÓN DE GOBIERNO EN LINEA","421.65","PETICIONES, QUEJAS, RECLAMOS, SUGERENCIAS Y DENUNCIAS - PQRSD","321.70.03","Procesos de Infraestructura Tecnologica"]
[null,null,321,"SUBDIRECCIÓN DE GOBIERNO EN LINEA","421.66","PLANES","321.79.09","Proyectos de Tramites, Servicios, Datos, Transparencia y Participación"]
[null,null,322,"SUBDIRECCIÓN DE ESTANDARES Y ARQUITECTURA DE TECNOLOGÍA DE LA INFORMACIÓN","421.80","RECAUDOS"]
[null,null,322,"SUBDIRECCIÓN DE ESTANDARES Y ARQUITECTURA DE TECNOLOGÍA DE LA INFORMACIÓN","421.89","REINTEGROS DIRECCIÓN DEL TESORO NACIONAL MINISTERIO","322.47.16","Informes de Gestión"]
[null,null,322,"SUBDIRECCIÓN DE ESTANDARES Y ARQUITECTURA DE TECNOLOGÍA DE LA INFORMACIÓN","422.01","ACTAS"]
[null,null,322,"SUBDIRECCIÓN DE ESTANDARES Y ARQUITECTURA DE TECNOLOGÍA DE LA INFORMACIÓN","422.18","COMPROBANTES CONTABLES"]
[null,null,322,"SUBDIRECCIÓN DE ESTANDARES Y ARQUITECTURA DE TECNOLOGÍA DE LA INFORMACIÓN","422.22","CONCILIACIONES ","322.69.01","Evaluaciónes de Politicas Gestión de Tecnologías de la Información y Seguridad de la Información"]
[null,null,322,"SUBDIRECCIÓN DE ESTANDARES Y ARQUITECTURA DE TECNOLOGÍA DE LA INFORMACIÓN","422.36","ESTADOS FINANCIEROS","322.69.02","Políticas Públicas de Gestión de Tecnologías de la Información y Seguridad de la Información"]
[null,null,330,"DIRECCIÓN DE TRANSFORMACIÓN DIGITAL","422.47","INFORMES","330.01.02","Actas de la Comisión Intersectorial para el Desarrollo de la Economia Digital"]
[null,null,330,"DIRECCIÓN DE TRANSFORMACIÓN DIGITAL","422.65","PETICIONES, QUEJAS, RECLAMOS, SUGERENCIAS Y DENUNCIAS - PQRSD","330.39.04","Estudios en Transformación Digital"]
[null,null,330,"DIRECCIÓN DE TRANSFORMACIÓN DIGITAL","423.11","BALANCES PRESUPUESTALES","330.47.01","Informes a Entes de Control y Vigilancia"]
[null,null,330,"DIRECCIÓN DE TRANSFORMACIÓN DIGITAL","423.15","CERTIFICADOS","330.47.16","Informes de Gestión"]
[null,null,330,"DIRECCIÓN DE TRANSFORMACIÓN DIGITAL","423.47","INFORMES"]
[null,null,"330.1","GRUPO INTERNO DE TRABAJO DE INVESTIGACIÓN, DESARROLLO E INNOVACIÓN (I+D+i)","423.65","PETICIONES, QUEJAS, RECLAMOS, SUGERENCIAS Y DENUNCIAS - PQRSD","330.1.47.16","Informes de Gestión"]
[null,null,"330.1","GRUPO INTERNO DE TRABAJO DE INVESTIGACIÓN, DESARROLLO E INNOVACIÓN (I+D+i)","423.79","PROYECTOS"]
[null,null,331,"SUBDIRECCIÓN DE COMERCIO ELECTRÓNICO","423.88","REGISTROS PRESUPUESTALES","331.47.16","Informes de Gestión"]
[null,null,331,"SUBDIRECCIÓN DE COMERCIO ELECTRÓNICO","423.91","RESERVAS PRESUPUESTALES"]
[null,null,332,"SUBDIRECCIÓN DE DIGITALIZACIÓN SECTORIAL","424.14","CERTIFICACIONES","332.47.16","Informes de Gestión"]
[null,null,332,"SUBDIRECCIÓN DE DIGITALIZACIÓN SECTORIAL","424.17","COBROS"]
[null,null,340,"DIRECCIÓN DE DESARROLLO DE LA INDUSTRIA DE TECNOLOGIAS DE LA INFORMACIÓN","424.35","ESTADOS DE CUENTA","340.39.03","Estudios en Materia de Industria de Tecnología de la Información"]
[null,null,340,"DIRECCIÓN DE DESARROLLO DE LA INDUSTRIA DE TECNOLOGIAS DE LA INFORMACIÓN","424.47","INFORMES","340.47.01","Informes a Entes de Control y Vigilancia"]
[null,null,340,"DIRECCIÓN DE DESARROLLO DE LA INDUSTRIA DE TECNOLOGIAS DE LA INFORMACIÓN","424.59","LIQUIDACIÓN DE DERECHOS","340.47.16","Informes de Gestión"]
[null,null,340,"DIRECCIÓN DE DESARROLLO DE LA INDUSTRIA DE TECNOLOGIAS DE LA INFORMACIÓN","424.65","PETICIONES, QUEJAS, RECLAMOS, SUGERENCIAS Y DENUNCIAS - PQRSD"]
[null,null,341,"GRUPO INTERNO DE TRABAJO DE INDUSTRIA DE TECNOLOGIAS DE LA INFORMACIÓN","424.66","PLANES","341.47.16","Informes de Gestión"]
[null,null,341,"GRUPO INTERNO DE TRABAJO DE INDUSTRIA DE TECNOLOGIAS DE LA INFORMACIÓN","430.01","ACTAS"]
[null,null,342,"GRUPO INTERNO DE TRABAJO DE ESTRATEGIA TALENTO DE TECNOLOGIAS DE LA INFORMACIÓN","430.47","INFORMES","342.47.16","Informes de Gestión"]
[null,null,342,"GRUPO INTERNO DE TRABAJO DE ESTRATEGIA TALENTO DE TECNOLOGIAS DE LA INFORMACIÓN","430.65","PETICIONES, QUEJAS, RECLAMOS, SUGERENCIAS Y DENUNCIAS - PQRSD"]
[null,null,343,"GRUPO INTERNO DE TRABAJO DE EMPRENDIMIENTO APPS.CO","430.66","PLANES","343.47.16","Informes de Gestión"]
[null,null,343,"GRUPO INTERNO DE TRABAJO DE EMPRENDIMIENTO APPS.CO","431.01","ACTAS"]
[null,null,344,"GRUPO INTERNO DE TRABAJO DE INDUSTRIA CREATIVA DIGITAL","431.10","AUTORIZACIONES DE ENTRADA Y SALIDA DE ELEMENTOS","344.47.16","Informes de Gestión"]
[null,null,344,"GRUPO INTERNO DE TRABAJO DE INDUSTRIA CREATIVA DIGITAL","431.19","COMPROBANTES DE ALMACEN"]
[null,null,400,"SECRETARÍA GENERAL","431.44","HISTORIALES DE BIENES INMUEBLES","400.01.04","Actas de Reunión del Sindicato Nacional de Trabajadores del Ministero de Tecnologias de la Información y las Comunicaciones"]
[null,null,400,"SECRETARÍA GENERAL","431.47","INFORMES","400.01.16","Actas del Comité Directivo"]
[null,null,400,"SECRETARÍA GENERAL","431.51","INSTRUMENTOS DE CONTROL PARA ADMINISTRACIÓN DE BIENES","400.01.21","Actas del Consejo de la Medalla al Merito"]
[null,null,400,"SECRETARÍA GENERAL","431.54","INVENTARIOS "]
[null,null,400,"SECRETARÍA GENERAL","431.65","PETICIONES, QUEJAS, RECLAMOS, SUGERENCIAS Y DENUNCIAS - PQRSD"]
[null,null,400,"SECRETARÍA GENERAL","432.47","INFORMES","400.60.01","Manuales de Contratación"]
[null,null,400,"SECRETARÍA GENERAL","432.63","NOTIFICACIONES POR AVISO DE ACTOS ADMINISTRATIVOS","400.60.02","Manuales de Funciones y de Competencias Laborales"]
[null,null,400,"SECRETARÍA GENERAL","432.65","PETICIONES, QUEJAS, RECLAMOS, SUGERENCIAS Y DENUNCIAS - PQRSD"]
[null,null,400,"SECRETARÍA GENERAL","433.01","ACTAS","400.92.03","Resoluciones del Fondo de Tecnologias de la Información y las Comunicaciones"]
[null,null,400,"SECRETARÍA GENERAL","433.47","INFORMES","400.92.04","Resoluciones del Ministerio"]
[null,null,401,"GRUPO INTERNO DE TRABAJO DE CONTRATACIÓN","433.49","INSTRUMENTOS ARCHIVISTICOS","401.01.08","Actas del Comité de Contratación"]
[null,null,401,"GRUPO INTERNO DE TRABAJO DE CONTRATACIÓN","433.50","INSTRUMENTOS DE CONTROL","401.01.14","Actas del Comité de Seguimiento al Plan Anual de Adquisiciones"]
[null,null,401,"GRUPO INTERNO DE TRABAJO DE CONTRATACIÓN","433.65","PETICIONES, QUEJAS, RECLAMOS, SUGERENCIAS Y DENUNCIAS - PQRSD","401.24.01","Contratos de Arrendamiento del Fondo "]
[null,null,401,"GRUPO INTERNO DE TRABAJO DE CONTRATACIÓN","433.66","PLANES","401.24.02","Contratos de Arrendamiento del Ministerio"]
[null,null,401,"GRUPO INTERNO DE TRABAJO DE CONTRATACIÓN","433.78","PROGRAMAS","401.24.03","Contratos de Ciencia, Tecnología e Innovación del Fondo"]
[null,null,401,"GRUPO INTERNO DE TRABAJO DE CONTRATACIÓN","433.96","TRANSFERENCIAS DOCUMENTALES","401.24.04","Contratos de Ciencia, Tecnología e Innovación del Ministerio"]
[null,null,401,"GRUPO INTERNO DE TRABAJO DE CONTRATACIÓN","434.23","CONSECUTIVO DE COMUNICACIONES OFICIALES","401.24.05","Contratos de Comodato del Fondo"]
[null,null,401,"GRUPO INTERNO DE TRABAJO DE CONTRATACIÓN","434.47","INFORMES","401.24.06","Contratos de Comodato del Ministerio"]
[null,null,401,"GRUPO INTERNO DE TRABAJO DE CONTRATACIÓN","434.50","INSTRUMENTOS DE CONTROL","401.24.07","Contratos de Compraventa del Fondo"]
[null,null,401,"GRUPO INTERNO DE TRABAJO DE CONTRATACIÓN","434.65","PETICIONES, QUEJAS, RECLAMOS, SUGERENCIAS Y DENUNCIAS - PQRSD","401.24.08","Contratos de Compraventa del Ministerio"]
[null,null,401,"GRUPO INTERNO DE TRABAJO DE CONTRATACIÓN","434.78","PROGRAMAS","401.24.09","Contratos de Consultoria del Fondo"]
[null,null,401,"GRUPO INTERNO DE TRABAJO DE CONTRATACIÓN","435.09","AUTORIZACIONES DE COMISIONES AL EXTERIOR","401.24.10","Contratos de Consultoria del Ministerio"]
[null,null,401,"GRUPO INTERNO DE TRABAJO DE CONTRATACIÓN","435.45","HISTORIALES DE VEHÍCULOS","401.24.11","Contratos de Interventoría del Fondo"]
[null,null,401,"GRUPO INTERNO DE TRABAJO DE CONTRATACIÓN","435.50","INSTRUMENTOS DE CONTROL","401.24.12","Contratos de Interventoría del Ministerio"]
[null,null,401,"GRUPO INTERNO DE TRABAJO DE CONTRATACIÓN","435.65","PETICIONES, QUEJAS, RECLAMOS, SUGERENCIAS Y DENUNCIAS - PQRSD","401.24.13","Contratos de Obra del Fondo"]
[null,null,401,"GRUPO INTERNO DE TRABAJO DE CONTRATACIÓN","435.66","PLANES","401.24.14","Contratos de Obra del Ministerio           "]
[null,null,401,"GRUPO INTERNO DE TRABAJO DE CONTRATACIÓN","436.01","ACTAS","401.24.15","Contratos de Prestación de Servicios del Fondo        "]
[null,null,401,"GRUPO INTERNO DE TRABAJO DE CONTRATACIÓN","436.46","HISTORIAS LABORALES","401.24.16","Contratos de Prestación de Servicios del Ministerio     "]
[null,null,401,"GRUPO INTERNO DE TRABAJO DE CONTRATACIÓN","436.65","PETICIONES, QUEJAS, RECLAMOS, SUGERENCIAS Y DENUNCIAS - PQRSD","401.24.17","Contratos de Prestación de Servicios Profesionales o Apoyo a Gestión del Fondo"]
[null,null,401,"GRUPO INTERNO DE TRABAJO DE CONTRATACIÓN","436.66","PLANES","401.24.18","Contratos de Prestación de Servicios Profesionales o Apoyo a Gestión del Ministerio"]
[null,null,401,"GRUPO INTERNO DE TRABAJO DE CONTRATACIÓN","436.78","PROGRAMAS","401.24.19","Contratos de Suministros del Fondo          "]
[null,null,401,"GRUPO INTERNO DE TRABAJO DE CONTRATACIÓN","437.13","BONOS PENSIONALES","401.24.20","Contratos de Suministros del Ministerio"]
[null,null,401,"GRUPO INTERNO DE TRABAJO DE CONTRATACIÓN","437.14","CERTIFICACIONES","401.24.21","Contratos Interadministrativos del Fondo"]
[null,null,401,"GRUPO INTERNO DE TRABAJO DE CONTRATACIÓN","437.28","CUENTAS POR COBRAR","401.24.22","Contratos Interadministrativos del Ministerio"]
[null,null,401,"GRUPO INTERNO DE TRABAJO DE CONTRATACIÓN","437.29","CUENTAS POR PAGAR","401.26.01","Convenios de Asociación del Fondo"]
[null,null,401,"GRUPO INTERNO DE TRABAJO DE CONTRATACIÓN","437.47","INFORMES","401.26.02","Convenios de Asociación del Ministerio"]
[null,null,401,"GRUPO INTERNO DE TRABAJO DE CONTRATACIÓN","437.65","PETICIONES, QUEJAS, RECLAMOS, SUGERENCIAS Y DENUNCIAS - PQRSD","401.26.03","Convenios de Cooperación del Fondo"]
[null,null,401,"GRUPO INTERNO DE TRABAJO DE CONTRATACIÓN",null,null,"401.26.04","Convenios de Cooperación del Ministerio"]
[null,null,401,"GRUPO INTERNO DE TRABAJO DE CONTRATACIÓN",null,null,"401.26.05","Convenios Interadministrativos del Fondo"]
[null,null,401,"GRUPO INTERNO DE TRABAJO DE CONTRATACIÓN",null,null,"401.27.06","Convenios Interadministrativos del Ministerio"]
[null,null,401,"GRUPO INTERNO DE TRABAJO DE CONTRATACIÓN",null,null,"401.47.01","Informes a Entes de Control y Vigilancia"]
[null,null,401,"GRUPO INTERNO DE TRABAJO DE CONTRATACIÓN"]
[null,null,402,"GRUPO INTERNO DE TRABAJO DE CONTROL INTERNO DISCIPLINARIO",null,null,"402.47.16","Informes de Gestión"]
[null,null,402,"GRUPO INTERNO DE TRABAJO DE CONTROL INTERNO DISCIPLINARIO"]
[null,null,402,"GRUPO INTERNO DE TRABAJO DE CONTROL INTERNO DISCIPLINARIO",null,null,"402.76.01","Procesos Disciplinarios Verbales"]
[null,null,402,"GRUPO INTERNO DE TRABAJO DE CONTROL INTERNO DISCIPLINARIO",null,null,"402.77.01","Procesos Ordinarios de Autos Inhibitorios"]
[null,null,402,"GRUPO INTERNO DE TRABAJO DE CONTROL INTERNO DISCIPLINARIO",null,null,"402.77.02","Procesos Ordinarios de Indagación Preliminar"]
[null,null,402,"GRUPO INTERNO DE TRABAJO DE CONTROL INTERNO DISCIPLINARIO",null,null,"402.77.03","Procesos Ordinarios de Investigación Disciplinaria"]
[null,null,410,"OFICINA PARA LA GESTIÓN DE INGRESOS DEL FONDO",null,null,"410.01.10","Actas del Comité de Control y Seguimiento del Fondo de Tecnologías de la Información y las Comunicaciones "]
[null,null,410,"OFICINA PARA LA GESTIÓN DE INGRESOS DEL FONDO"]
[null,null,410,"OFICINA PARA LA GESTIÓN DE INGRESOS DEL FONDO",null,null,"410.47.01","Informes a Entes de Control y Vigilancia"]
[null,null,410,"OFICINA PARA LA GESTIÓN DE INGRESOS DEL FONDO",null,null,"410.47.12","Informes de Control y Seguimiento del Fondo"]
[null,null,410,"OFICINA PARA LA GESTIÓN DE INGRESOS DEL FONDO"]
[null,null,410,"OFICINA PARA LA GESTIÓN DE INGRESOS DEL FONDO",null,null,"410.66.10","Planes de Mejoramiento"]
[null,null,410,"OFICINA PARA LA GESTIÓN DE INGRESOS DEL FONDO",null,null,"410.92.01","Resoluciones de Subsidios a Internet"]
[null,null,410,"OFICINA PARA LA GESTIÓN DE INGRESOS DEL FONDO",null,null,"410.92.02","Resoluciones de Subsidios de Telefonia Pública Basica Conmunatada "]
[null,null,411,"GRUPO INTERNO DE TRABAJO DE SEGUIMIENTO A LA EJECUCIÓN CONTRACTUAL",null,null,"411.01.22","Actas del Subcomité de Asuntos Precontractuales"]
[null,null,411,"GRUPO INTERNO DE TRABAJO DE SEGUIMIENTO A LA EJECUCIÓN CONTRACTUAL",null,null,"411.01.23","Actas del  Subcomité de Seguimiento Correctivo y Preventivo"]
[null,null,411,"GRUPO INTERNO DE TRABAJO DE SEGUIMIENTO A LA EJECUCIÓN CONTRACTUAL",null,null,"411.47.16","Informes de Gestión"]
[null,null,412,"GRUPO INTERNO DE TRABAJO DE SEGUIMIENTO A LA GESTIÓN DE INGRESOS DEL FONDO TIC",null,null,"412.01.24","Actas del Subcomité de Seguimiento Ingresos del Fondo"]
[null,null,412,"GRUPO INTERNO DE TRABAJO DE SEGUIMIENTO A LA GESTIÓN DE INGRESOS DEL FONDO TIC",null,null,"412.47.26","Informes de Seguimiento a la Gestión de Ingresos del Fondo"]
[null,null,420,"SUBDIRECCIÓN FINANCIERA",null,null,"420.47.01","Informes a Entes de Control y Vigilancia."]
[null,null,420,"SUBDIRECCIÓN FINANCIERA",null,null,"420.47.16","Informes de Gestión"]
[null,null,420,"SUBDIRECCIÓN FINANCIERA",null,null,"420.47.20","Informes de Patrimonios Autonomos"]
[null,null,420,"SUBDIRECCIÓN FINANCIERA"]
[null,null,421,"GRUPO INTERNO DE TRABAJO DE TESORERIA",null,null,"421.04.03","Acuerdos de Pago"]
[null,null,421,"GRUPO INTERNO DE TRABAJO DE TESORERIA",null,null,"421.12.01","Boletines de Caja y Bancos Fondo"]
[null,null,421,"GRUPO INTERNO DE TRABAJO DE TESORERIA",null,null,"421.12.02","Boletines de Caja y Bancos Ministerio"]
[null,null,421,"GRUPO INTERNO DE TRABAJO DE TESORERIA",null,null,"421.15.03","Certificados de Ica Iva y Renta"]
[null,null,421,"GRUPO INTERNO DE TRABAJO DE TESORERIA",null,null,"421.22.02","Conciliaciones Bancarias Cuenta Única Nacional"]
[null,null,421,"GRUPO INTERNO DE TRABAJO DE TESORERIA",null,null,"421.22.03","Conciliaciones Bancarias Fondo "]
[null,null,421,"GRUPO INTERNO DE TRABAJO DE TESORERIA",null,null,"421.22.04","Conciliaciones Bancarias Ministerio"]
[null,null,421,"GRUPO INTERNO DE TRABAJO DE TESORERIA",null,null,"421.27.01","Cuentas Bancarias del Fondo"]
[null,null,421,"GRUPO INTERNO DE TRABAJO DE TESORERIA",null,null,"421.27.02","Cuentas Bancarias del Ministerio "]
[null,null,421,"GRUPO INTERNO DE TRABAJO DE TESORERIA",null,null,"421.31.01","Clasificación Tributaria Contratistas PN Fondo"]
[null,null,421,"GRUPO INTERNO DE TRABAJO DE TESORERIA",null,null,"421.31.02","Declaraciones Tributarias de Obra Pública Fondo"]
[null,null,421,"GRUPO INTERNO DE TRABAJO DE TESORERIA",null,null,"421.31.03","Declaraciones Tributarias de Obra Pública Ministerio"]
[null,null,421,"GRUPO INTERNO DE TRABAJO DE TESORERIA",null,null,"421.31.04","Declaraciones Tributarias de Retención en la Fuente Fondo"]
[null,null,421,"GRUPO INTERNO DE TRABAJO DE TESORERIA",null,null,"421.31.05","Declaraciones Tributarias de Retención en la Fuente Ministerio"]
[null,null,421,"GRUPO INTERNO DE TRABAJO DE TESORERIA",null,null,"421.31.06","Declaraciones Trbutarias Estampillas Fondo"]
[null,null,421,"GRUPO INTERNO DE TRABAJO DE TESORERIA",null,null,"421.31.07","Declaraciones Trbutarias Estampillas Ministerio"]
[null,null,421,"GRUPO INTERNO DE TRABAJO DE TESORERIA",null,null,"421.31.08","Declaraciones Tributarias ICA Fondo"]
[null,null,421,"GRUPO INTERNO DE TRABAJO DE TESORERIA",null,null,"421.31.09","Declaraciones Tributarias ICA Mnisterio"]
[null,null,421,"GRUPO INTERNO DE TRABAJO DE TESORERIA",null,null,"421.34.01","Embargos Fondo"]
[null,null,421,"GRUPO INTERNO DE TRABAJO DE TESORERIA",null,null,"421.34.02","Embargos Ministerio"]
[null,null,421,"GRUPO INTERNO DE TRABAJO DE TESORERIA"]
[null,null,421,"GRUPO INTERNO DE TRABAJO DE TESORERIA",null,null,"421.47.02","Informes a Otros Organismos"]
[null,null,421,"GRUPO INTERNO DE TRABAJO DE TESORERIA",null,null,"421.47.11","Informes de Constitución de Cuentas por Pagar"]
[null,null,421,"GRUPO INTERNO DE TRABAJO DE TESORERIA",null,null,"421.56.01","Legalizaciones de Caja Menor Fondo"]
[null,null,421,"GRUPO INTERNO DE TRABAJO DE TESORERIA",null,null,"421.56.02","Legalizaciones de Viaticos"]
[null,null,421,"GRUPO INTERNO DE TRABAJO DE TESORERIA",null,null,"421.57.01","Libros Auxiliares de Banco Ministerio"]
[null,null,421,"GRUPO INTERNO DE TRABAJO DE TESORERIA"]
[null,null,421,"GRUPO INTERNO DE TRABAJO DE TESORERIA",null,null,"421.64.01","Ordenes de Pago del Fondo"]
[null,null,421,"GRUPO INTERNO DE TRABAJO DE TESORERIA",null,null,"421.64.02","Ordenes de Pago del Ministerio"]
[null,null,421,"GRUPO INTERNO DE TRABAJO DE TESORERIA"]
[null,null,421,"GRUPO INTERNO DE TRABAJO DE TESORERIA",null,null,"421.66.02","Planes Anuales de Caja PAC"]
[null,null,421,"GRUPO INTERNO DE TRABAJO DE TESORERIA",null,null,"421.66.09","Planes de Inversión del Fondo - Portafolio"]
[null,null,421,"GRUPO INTERNO DE TRABAJO DE TESORERIA"]
[null,null,421,"GRUPO INTERNO DE TRABAJO DE TESORERIA"]
[null,null,422,"GRUPO INTERNO DE TRABAJO DE CONTABILIDAD",null,null,"422.01.20","Actas del Comité Técnico de Sostenibilidad del Sistema de Contabilidad"]
[null,null,422,"GRUPO INTERNO DE TRABAJO DE CONTABILIDAD",null,null,"422.18.01","Comprobantes Contables de Ajuste"]
[null,null,422,"GRUPO INTERNO DE TRABAJO DE CONTABILIDAD",null,null,"422.18.02","Comprobantes Contables de Egreso"]
[null,null,422,"GRUPO INTERNO DE TRABAJO DE CONTABILIDAD",null,null,"422.18.03","Comprobantes Contables de Ingreso"]
[null,null,422,"GRUPO INTERNO DE TRABAJO DE CONTABILIDAD",null,null,"422.22.01","Conciliaciones Bancarias"]
[null,null,422,"GRUPO INTERNO DE TRABAJO DE CONTABILIDAD",null,null,"422.22.05","Conciliaciones de Operaciones Reciprocas"]
[null,null,422,"GRUPO INTERNO DE TRABAJO DE CONTABILIDAD"]
[null,null,422,"GRUPO INTERNO DE TRABAJO DE CONTABILIDAD",null,null,"422.47.01","Informes a Entes de Control y Vigilancia"]
[null,null,422,"GRUPO INTERNO DE TRABAJO DE CONTABILIDAD",null,null,"422.47.02","Informes a Otros Organismos"]
[null,null,422,"GRUPO INTERNO DE TRABAJO DE CONTABILIDAD"]
[null,null,423,"GRUPO INTERNO DE TRABAJO DE PRESUPUESTO"]
[null,null,423,"GRUPO INTERNO DE TRABAJO DE PRESUPUESTO",null,null,"423.15.01","Certificados de Disponibilidad Presupuestal Fondo"]
[null,null,423,"GRUPO INTERNO DE TRABAJO DE PRESUPUESTO",null,null,"423.15.02","Certificados de Disponibilidad Presupuestal Ministerio"]
[null,null,423,"GRUPO INTERNO DE TRABAJO DE PRESUPUESTO",null,null,"423.47.01","Informes a Entes de Control y Vigilancia"]
[null,null,423,"GRUPO INTERNO DE TRABAJO DE PRESUPUESTO",null,null,"423.47.02","Informes a Otros Organismos"]
[null,null,423,"GRUPO INTERNO DE TRABAJO DE PRESUPUESTO",null,null,"423.47.14","Informes de Ejecución Presupuestal"]
[null,null,423,"GRUPO INTERNO DE TRABAJO DE PRESUPUESTO"]
[null,null,423,"GRUPO INTERNO DE TRABAJO DE PRESUPUESTO",null,null,"423.79.03","Proyectos de Inversión"]
[null,null,423,"GRUPO INTERNO DE TRABAJO DE PRESUPUESTO",null,null,"423.79.07","Proyectos de Presupuesto del Fondo"]
[null,null,423,"GRUPO INTERNO DE TRABAJO DE PRESUPUESTO",null,null,"423.79.08","Proyectos de Presupuesto del Ministerio"]
[null,null,423,"GRUPO INTERNO DE TRABAJO DE PRESUPUESTO",null,null,"423.88.01","Registros Presupuestales de Compromiso Fondo"]
[null,null,423,"GRUPO INTERNO DE TRABAJO DE PRESUPUESTO",null,null,"423.88.02","Registros Presupuestales de Compromiso Mnisterio"]
[null,null,423,"GRUPO INTERNO DE TRABAJO DE PRESUPUESTO",null,null,"423.91.01","Reservas Presupuestales y Cuentas por Pagar del Fondo"]
[null,null,423,"GRUPO INTERNO DE TRABAJO DE PRESUPUESTO",null,null,"423.91.02","Reservas Presupuestales y Cuentas por Pagar del Ministerio"]
[null,null,424,"GRUPO INTERNO DE TRABAJO DE CARTERA",null,null,"424.14.02","Certificaciones de Cumplimiento"]
[null,null,424,"GRUPO INTERNO DE TRABAJO DE CARTERA",null,null,"424.17.01","Cobros Coactivos"]
[null,null,424,"GRUPO INTERNO DE TRABAJO DE CARTERA",null,null,"424.17.02","Cobros Persuasivos"]
[null,null,424,"GRUPO INTERNO DE TRABAJO DE CARTERA"]
[null,null,424,"GRUPO INTERNO DE TRABAJO DE CARTERA",null,null,"424.47.24","Informes de Revisión de Autoliquidaciones"]
[null,null,424,"GRUPO INTERNO DE TRABAJO DE CARTERA"]
[null,null,424,"GRUPO INTERNO DE TRABAJO DE CARTERA"]
[null,null,424,"GRUPO INTERNO DE TRABAJO DE CARTERA",null,null,"424.66.12","Planes de Mejoramiento de los Recursos del Fondo"]
[null,null,430,"SUBDIRECCIÓN ADMINISTRATIVA Y DE GESTIÓN HUMANA",null,null,"430.01.15","Actas del Comité del Coordinador de Teletrabajo"]
[null,null,430,"SUBDIRECCIÓN ADMINISTRATIVA Y DE GESTIÓN HUMANA",null,null,"430.47.01","Informes a Entes de Control y Vigilancia"]
[null,null,430,"SUBDIRECCIÓN ADMINISTRATIVA Y DE GESTIÓN HUMANA",null,null,"430.47.02","Informes a Otros Organismos"]
[null,null,430,"SUBDIRECCIÓN ADMINISTRATIVA Y DE GESTIÓN HUMANA",null,null,"430.47.16","Informes de Gestión"]
[null,null,430,"SUBDIRECCIÓN ADMINISTRATIVA Y DE GESTIÓN HUMANA"]
[null,null,430,"SUBDIRECCIÓN ADMINISTRATIVA Y DE GESTIÓN HUMANA",null,null,"430.66.03","Planes Anuales de Compras"]
[null,null,431,"GRUPO INTERNO DE TRABAJO DE ADMINISTRACIÓN DE BIENES",null,null,"431.01.06","Actas del Comité de Administratción de Bienes"]
[null,null,431,"GRUPO INTERNO DE TRABAJO DE ADMINISTRACIÓN DE BIENES"]
[null,null,431,"GRUPO INTERNO DE TRABAJO DE ADMINISTRACIÓN DE BIENES",null,null,"431.19.01","Comprobantes de Egresos de Elementos de Consumo"]
[null,null,431,"GRUPO INTERNO DE TRABAJO DE ADMINISTRACIÓN DE BIENES",null,null,"431.19.02","Comprobantes de Egresos de Elementos Devolutivos"]
[null,null,431,"GRUPO INTERNO DE TRABAJO DE ADMINISTRACIÓN DE BIENES",null,null,"431.19.03","Comprobantes de Ingresos de Bienes"]
[null,null,431,"GRUPO INTERNO DE TRABAJO DE ADMINISTRACIÓN DE BIENES",null,null,"431.19.04","Comproantes de Ingresos de Elementos de Consumo"]
[null,null,431,"GRUPO INTERNO DE TRABAJO DE ADMINISTRACIÓN DE BIENES",null,null,"431.19.05","Comprobantes de Traslado y  Reintegro de Bienes entre Funcionarios"]
[null,null,431,"GRUPO INTERNO DE TRABAJO DE ADMINISTRACIÓN DE BIENES"]
[null,null,431,"GRUPO INTERNO DE TRABAJO DE ADMINISTRACIÓN DE BIENES",null,null,"431.47.01","Informes a Entes de Control y Vigilancia"]
[null,null,431,"GRUPO INTERNO DE TRABAJO DE ADMINISTRACIÓN DE BIENES",null,null,"431.47.16","Informes de Gestión"]
[null,null,431,"GRUPO INTERNO DE TRABAJO DE ADMINISTRACIÓN DE BIENES",null,null,"431.51.01","Actas de Baja de Bienes"]
[null,null,431,"GRUPO INTERNO DE TRABAJO DE ADMINISTRACIÓN DE BIENES",null,null,"431.51.02","Actas de Decomisos de Bienes"]
[null,null,431,"GRUPO INTERNO DE TRABAJO DE ADMINISTRACIÓN DE BIENES",null,null,"431.51.03","Formato de Traslado y Reintegro de Bienes"]
[null,null,431,"GRUPO INTERNO DE TRABAJO DE ADMINISTRACIÓN DE BIENES",null,null,"431.54.02","Inventarios de Almacen"]
[null,null,431,"GRUPO INTERNO DE TRABAJO DE ADMINISTRACIÓN DE BIENES",null,null,"431.54.03","Inventarios de Elementos Devolutivos"]
[null,null,431,"GRUPO INTERNO DE TRABAJO DE ADMINISTRACIÓN DE BIENES",null,null,"431.54.04","Inventarios y Conciliaciones de Activos Fijos"]
[null,null,431,"GRUPO INTERNO DE TRABAJO DE ADMINISTRACIÓN DE BIENES"]
[null,null,432,"GRUPO INTERNO DE TRABAJO DE NOTIFICACIONES",null,null,"432.47.01","Informes a Entes de Control y vigilancia"]
[null,null,432,"GRUPO INTERNO DE TRABAJO DE NOTIFICACIONES",null,null,"432.47.16","Informes de Gestión"]
[null,null,432,"GRUPO INTERNO DE TRABAJO DE NOTIFICACIONES"]
[null,null,432,"GRUPO INTERNO DE TRABAJO DE NOTIFICACIONES"]
[null,null,433,"GRUPO INTERNO DE TRABAJO DE GESTIÓN DE LA INFORMACIÓN",null,null,"433.01.01","Actas de Eliminación Documental"]
[null,null,433,"GRUPO INTERNO DE TRABAJO DE GESTIÓN DE LA INFORMACIÓN",null,null,"433.47.07","Informes de Autenticaciones"]
[null,null,433,"GRUPO INTERNO DE TRABAJO DE GESTIÓN DE LA INFORMACIÓN",null,null,"433.47.16","Informes de Gestión"]
[null,null,433,"GRUPO INTERNO DE TRABAJO DE GESTIÓN DE LA INFORMACIÓN",null,null,"433.49.01","Banco Terminologico"]
[null,null,433,"GRUPO INTERNO DE TRABAJO DE GESTIÓN DE LA INFORMACIÓN",null,null,"433.49.02","Cuadro de Clasificación Documental "]
[null,null,433,"GRUPO INTERNO DE TRABAJO DE GESTIÓN DE LA INFORMACIÓN",null,null,"433.49.03","Inventario Documental"]
[null,null,433,"GRUPO INTERNO DE TRABAJO DE GESTIÓN DE LA INFORMACIÓN",null,null,"433.49.04","Mapa de Procesos"]
[null,null,433,"GRUPO INTERNO DE TRABAJO DE GESTIÓN DE LA INFORMACIÓN",null,null,"433.39.05","Modelos de Requisitos para la Gestión de Documentos Electrónicos"]
[null,null,433,"GRUPO INTERNO DE TRABAJO DE GESTIÓN DE LA INFORMACIÓN",null,null,"433.49.06","Tablas de Retención Documental"]
[null,null,433,"GRUPO INTERNO DE TRABAJO DE GESTIÓN DE LA INFORMACIÓN",null,null,"433.49.07","Tablas de Valoración Documental"]
[null,null,433,"GRUPO INTERNO DE TRABAJO DE GESTIÓN DE LA INFORMACIÓN",null,null,"433.50.02","Instrumentos de Control de Salida de Expedientes"]
[null,null,433,"GRUPO INTERNO DE TRABAJO DE GESTIÓN DE LA INFORMACIÓN"]
[null,null,433,"GRUPO INTERNO DE TRABAJO DE GESTIÓN DE LA INFORMACIÓN",null,null,"433.66.21","Planes Institucionales de Archivos- PINAR"]
[null,null,433,"GRUPO INTERNO DE TRABAJO DE GESTIÓN DE LA INFORMACIÓN",null,null,"433.78.06","Programas de Gestión Documental"]
[null,null,433,"GRUPO INTERNO DE TRABAJO DE GESTIÓN DE LA INFORMACIÓN",null,null,"433.78.12","Programas del Sistema Integrado de Conservación Documental"]
[null,null,433,"GRUPO INTERNO DE TRABAJO DE GESTIÓN DE LA INFORMACIÓN",null,null,"433.96.01","Transferencias Documentales Primarias"]
[null,null,433,"GRUPO INTERNO DE TRABAJO DE GESTIÓN DE LA INFORMACIÓN",null,null,"433.96.02","Transferencias Documentales Secundarias"]
[null,null,434,"GRUPO INTERNO DE TRABAJO DE FORTALECIMIENTO DE LAS RELACIONES CON LOS GRUPOS DE INTERES"]
[null,null,434,"GRUPO INTERNO DE TRABAJO DE FORTALECIMIENTO DE LAS RELACIONES CON LOS GRUPOS DE INTERES",null,null,"434.47.22","Informes de PQRSD y Derechos de Petición"]
[null,null,434,"GRUPO INTERNO DE TRABAJO DE FORTALECIMIENTO DE LAS RELACIONES CON LOS GRUPOS DE INTERES",null,null,"434.50.01","Instrumentos de Control de Correspondencia"]
[null,null,434,"GRUPO INTERNO DE TRABAJO DE FORTALECIMIENTO DE LAS RELACIONES CON LOS GRUPOS DE INTERES"]
[null,null,434,"GRUPO INTERNO DE TRABAJO DE FORTALECIMIENTO DE LAS RELACIONES CON LOS GRUPOS DE INTERES",null,null,"434.78.08","Programas de Responsabilidad Social"]
[null,null,434,"GRUPO INTERNO DE TRABAJO DE FORTALECIMIENTO DE LAS RELACIONES CON LOS GRUPOS DE INTERES",null,null,"434.78.09","Programas de Servicio al Ciudadano"]
[null,null,434,"GRUPO INTERNO DE TRABAJO DE FORTALECIMIENTO DE LAS RELACIONES CON LOS GRUPOS DE INTERES",null,null,"434.78.13","Programas Institucionales de Gestión Ambiental"]
[null,null,435,"GRUPO INTERNO DE TRABAJO DE GESTIÓN DE SERVICIOS ADMINISTRATIVOS"]
[null,null,435,"GRUPO INTERNO DE TRABAJO DE GESTIÓN DE SERVICIOS ADMINISTRATIVOS"]
[null,null,435,"GRUPO INTERNO DE TRABAJO DE GESTIÓN DE SERVICIOS ADMINISTRATIVOS",null,null,"435.50.03","Instrumentos de Control de Vehiculos"]
[null,null,435,"GRUPO INTERNO DE TRABAJO DE GESTIÓN DE SERVICIOS ADMINISTRATIVOS"]
[null,null,435,"GRUPO INTERNO DE TRABAJO DE GESTIÓN DE SERVICIOS ADMINISTRATIVOS",null,null,"435.65.16","Planes de Seguridad Vial"]
[null,null,436,"GRUPO INTERNO DE TRABAJO DE GESTIÓN DE TALENTO HUMANO",null,null,"434.01.18","Actas del Comité Paritario de Seguridad y Salud en el Trabajo"]
[null,null,436,"GRUPO INTERNO DE TRABAJO DE GESTIÓN DE TALENTO HUMANO"]
[null,null,436,"GRUPO INTERNO DE TRABAJO DE GESTIÓN DE TALENTO HUMANO"]
[null,null,436,"GRUPO INTERNO DE TRABAJO DE GESTIÓN DE TALENTO HUMANO",null,null,"436.66.17","Planes de Seguridad y Salud en el Trabajo"]
[null,null,436,"GRUPO INTERNO DE TRABAJO DE GESTIÓN DE TALENTO HUMANO",null,null,"436.78.03","Programas de Capacitación, Bienestar, Incentivos, Seguridad y Salud en el Trabajo"]
[null,null,436,"GRUPO INTERNO DE TRABAJO DE GESTIÓN DE TALENTO HUMANO",null,null,"436.78.07","Programas de Incentivos"]
[null,null,437,"GRUPO INTERNO DE TRABAJO DE GESTION PENSIONAL"]
[null,null,437,"GRUPO INTERNO DE TRABAJO DE GESTION PENSIONAL",null,null,"437.14.03","Certificaciones para Bono Pensional y Pensiones"]
[null,null,437,"GRUPO INTERNO DE TRABAJO DE GESTION PENSIONAL",null,null,"437.28.01","Cuentas por Cobrar de Cuotas Partes Pensionales"]
[null,null,437,"GRUPO INTERNO DE TRABAJO DE GESTION PENSIONAL",null,null,"437.29.01","Cuentas por Pagar de Cuotas Partes Pensionales"]
[null,null,437,"GRUPO INTERNO DE TRABAJO DE GESTION PENSIONAL",null,null,"437.47.02","Informes a Otros Organismos"]
[null,null,437,"GRUPO INTERNO DE TRABAJO DE GESTION PENSIONAL",null,null,"437.47.08","Informes de Cálculo Actuarial"]
[null,null,437,"GRUPO INTERNO DE TRABAJO DE GESTION PENSIONAL",null,null,"437.47.16","Informes de Gestión"]
[null,null,437,"GRUPO INTERNO DE TRABAJO DE GESTION PENSIONAL"]
[null,null,"N/A","N/A","N/A","N/A","N/A","N/A"]