{"text_format":"1","workbook":"xlsx","n_sheets":7,"sheets":["Parametros tecnológicos","Espectro MW","Modelo","Detalle","Resultados","Tablas Espectro MW","Datos"],"not_rendered":{"charts":1,"images":0,"macros":1,"external_links":1,"defined_names":57,"comments":4,"pivot_tables":0},"unopened":[],"bounds":{"document_bytes":16777216,"sheet_cells":100000,"rows_first":2000,"rows_last":500,"rows_between":2000,"halvings":0,"cell_chars":16384,"cell_head_chars":4096},"cells_cut":0,"cells_raw":0,"read":"whole","date_system":"1900"}

{"sheet":"Parametros tecnológicos","index":0,"n_rows":81,"n_cols":13,"rows_kept":81,"cut":false,"hidden":false,"merged":[[3,2,3,3],[4,2,4,3],[5,2,5,3]]}
["Parámetros tecnológicos"]
[]
["Componente","Parametro","Incluir","Valor","Descripción","Referencia"]
["General","Tecnología","5G",null,"Tipologia de tecnologia presentada","NA"]
[null,"Dificultad de acceso",1,null,{"$f":"+IF(TipoEspecifico=1,\"Acceso Facil\",IF(TipoEspecifico=2,\"Acceso Dificil\",\"Complejo\"))","v":"Acceso Facil"},"NA"]
[null,"Tipo de red","Móvil",null,"Servicio móvil o fija"]
["Obra civil","Altura de torre","S",30," mts",{"$f":"+IF(C7=\"N\",\"\",IF(D7=\"\",\"\",IF(AND(D7>=12,D7<=18),\"12-18\",IF(AND(D7>=19,D7<=35),\"19-35\",IF(AND(D7>=36,D7<=45),\"36-45\",IF(AND(D7>=46,D7<=60),\"46-60\",IF(D7>60,90,\"Verificar\")))))))","v":"19-35"}]
[null,"Tipo de torre",null,"Convencional","Monopolo o convencional","NA"]
[null,"Eventos mantenimiento <= 2 años",null,0]
[null,"Eventos mantenimiento > 2 años",null,2,"Eventos mantenimiento correctivo por año"]
["Red de energia","Topología de terreno","S","Plano","Plano u ondulado",{"$f":"+\"Terreno \"&Tipo_Terreno","v":"Terreno Plano"}]
[null,"Distancia red de MT",null,500," mts lineales (500,750,1000,1500+)",{"$f":"+IF(D12=\"\",\"\",IF(D12<=500,500,IF(AND(D12>500,D12<=1000),1000,IF(D12>1000,1500,\"Verificar\"))))","v":500}]
[null,"KW - energía",null,25,"15 o 25 KW","NA"]
[null,"Eventos mantenimiento <= 2 años",null,0]
[null,"Eventos mantenimiento > 2 años",null,2]
{"$rows_left_out":67}
{"sheet":"Espectro MW","index":1,"n_rows":9,"n_cols":3,"rows_kept":9,"cut":false,"hidden":false,"merged":[]}
["Calculo del Valor Anual de Contraprestaciones (VAC)"]
[]
["Variable","Descripción","Valor"]
["Valor publicado por el MINTIC",null,859584.41]
["Ancho de Banda (MHz)",null,28]
["Valores del factor de valoracióńn de banda (MHz)",7200,{"$f":"+IF(B6<=1000,1,IF(AND(B6>1000,B6<=3000),0.8,IF(AND(B6>3000,B6<=3700),0.7,IF(AND(B6>3700,B6<=7100),0.612,IF(AND(B6>7100,B6<=14000),0.544,IF(AND(B6>14000,B6<=20000),0.476,IF(AND(B6>20000,B6<=30000),0.408,IF(AND(B6>30000,B6<=70000),0.0375,IF(AND(B6>70000,B6<=300000),0.0055,0)))))))))","v":0.54400000000000004}]
["Valores del factor de distancia","Satisface la distancia mínima del CNABF ",{"$f":"+VLOOKUP(B7,'Tablas Espectro MW'!$A$43:$C$46,2,0)","v":0.9}]
["Valores del factor de priorizacióń","Cabeceras municipales que no se ubican en departamentos priorizados ",{"$f":"+VLOOKUP(B8,'Tablas Espectro MW'!$A$20:$B$23,2,0)","v":0.8}]
["Valor Anual de Contraprestaciones (Para un enlace simétrico - La resolución no es clara en como se aplica para cada segmento)",null,{"$f":"+(C4*(C5)*C6*C7)*C8*2","v":18854193.215692803}]

{"sheet":"Modelo","index":2,"n_rows":101,"n_cols":126,"rows_kept":101,"cut":false,"hidden":false,"merged":[[87,0,87,2],[76,0,76,2],[16,0,16,2],[17,0,17,2],[41,0,41,2],[57,0,57,2],[52,0,52,2]]}
["Modelo Financiero - MinTIC"]
[]
["Parámetros","Valor",null,"Concepto",{"$f":"+YEAR(B7)","v":2020},{"$f":"+E3+1","v":2021},2022,2023,2024,2025,2026,2027,2028,2029,2030]
["TRM",4000,null,"IPC",0.03,0.03,0.03,0.03,0.03,0.03,0.03,0.03,0.03,0.03,0.03]
["Valor del proyecto",{"$f":"+SUM(F9:DV10)","v":1701697651.8042638},null,"Acumulado",1,{"$f":"(1+E4)*E5","v":1.03},1.0609,1.092727,1.1255088100000001,1.1592740743000001,1.1940522965290001,1.2298738654248702,1.2667700813876164,1.3047731838292449,1.3439163793441222]
["Imprevistos",0.05,null,"Pagos anuales CAPEX",{"$f":"+SUMIF($F$8:$DW$8,E3,$F$9:$DV$9)","v":596915003.41457367},{"$f":"+SUMIF($F$8:$DV$8,F3,$F$9:$DV$9)","v":0},0,0,0,0,0,0,0,0,0]
["Fecha inicio obra","2020-05-28",null,"Pagos anuales OPEX",{"$f":"+SUMIF($F$8:$DV$8,E3,$F$10:$DV$10)","v":117931973.65226418},208290767.09483352,239882393.5969457,254284079.97150961,261912602.37065503,22480831.703481223,0,0,0,0,0]
["Fecha inicio funcionamiento","2020-07-01",null,null,null,{"$f":"+YEAR(F16)","v":2020},2020,2020,2020,2020,2020,2020,2020,2021,2021,2021,2021,2021,2021,2021,2021,2021,2021,2021,2021,2022,2022,2022,2022,2022,2022,2022,2022,2022,2022,2022,2022,{"$f":"+YEAR(AL16)","v":2023},2023,2023,2023,2023,2023,2023,2023,2023,2023,2023,2023,2024,2024,2024,2024,2024,2024,2024,2024,2024,2024,2024,2024,2025,2025,2025,2025,2025,2025,2025,2025,{"$f":"+YEAR(BR16)","v":2025},2025,2025,2025,2026,2026,2026,2026,2026,2026,2026,2026,2026,2026,2026,2026,2027,2027,2027,2027,2027,2027,2027,2027,2027,2027,2027,2027,2028,2028,2028,2028,{"$f":"+YEAR(CX16)","v":2028},2028,2028,2028,2028,2028,2028,2028,2029,2029,2029,2029,2029,2029,2029,2029,2029,2029,2029,2029,2030,2030,2030,2030,2030]
["Tiempo reconocimiento OPEX (meses)",56,null,null,"Flujo de Caja CAPEX",{"$f":"+SUM(F20:F26,F36:F40,F44:F46,F50:F52,F59:F61,F66:F74,F77:F86,F90:F91)","v":596915003.41457367},0,0,0,0,0,0,0,0,0,0,0,0,0,0,0,0,0,0,0,0,0,0,0,0,0,0,0,0,0,0,0,{"$f":"+SUM(AL20:AL26,AL36:AL40,AL44:AL46,AL50:AL52,AL59:AL61,AL66:AL74,AL77:AL86,AL90:AL91)","v":0},0,0,0,0,0,0,0,0,0,0,0,0,0,0,0,0,0,0,0,0,0,0,0,0,0,0,0,0,0,0,0,{"$f":"+SUM(BR20:BR26,BR36:BR40,BR44:BR46,BR50:BR52,BR59:BR61,BR66:BR74,BR77:BR86,BR90:BR91)","v":0},0,0,0,0,0,0,0,0,0,0,0,0,0,0,0,0,0,0,0,0,0,0,0,0,0,0,0,0,0,0,0,{"$f":"+SUM(CX20:CX26,CX36:CX40,CX44:CX46,CX50:CX52,CX59:CX61,CX66:CX74,CX77:CX86,CX90:CX91)","v":0},0,0,0,0,0,0,0,0,0,0,0,0,0,0,0,0,0,0,0,0,0,0,0,0]
["Tiempo reconocimiento OPEX (Recomendado)",{"$f":"IF(IF((F9/(B11*B12-AVERAGEIF(G10:DV10,\">0\")))>120,120,(F9/(B11*B12-AVERAGEIF(G10:DV10,\">0\"))))<0,120,IF((F9/(B11*B12-AVERAGEIF(G10:DV10,\">0\")))>120,120,(F9/(B11*B12-AVERAGEIF(G10:DV10,\">0\")))))","v":4.8683764032282433},null,null,"Flujo de Caja OPEX",{"$f":"+SUM(F19,F27:F35,F43,F47:F48,F54:F57,F62:F65,F75,F89)+F11+F12","v":29845750.170728683},0,15247230.701415917,15247230.701415917,15247230.701415917,12060445.701415917,15142042.837935917,15142042.837935917,15596304.123073995,15596304.123073995,15596304.123073995,15596304.123073995,15596304.123073995,18615606.639923368,18615606.639923368,18615606.639923368,18615606.639923368,18615606.639923368,18615606.639923368,18615606.639923368,19174074.83912107,19174074.83912107,19174074.83912107,19174074.83912107,19174074.83912107,20573145.628762916,20573145.628762916,20573145.628762916,20573145.628762916,20573145.628762916,20573145.628762916,20573145.628762916,{"$f":"+SUM(AL19,AL27:AL35,AL43,AL47:AL48,AL54:AL57,AL62:AL65,AL75,AL89)+AL11+AL12","v":21190339.997625805},21190339.997625805,21190339.997625805,21190339.997625805,21190339.997625805,21190339.997625805,21190339.997625805,21190339.997625805,21190339.997625805,21190339.997625805,21190339.997625805,21190339.997625805,21826050.197554581,21826050.197554581,21826050.197554581,21826050.197554581,21826050.197554581,21826050.197554581,21826050.197554581,21826050.197554581,21826050.197554581,21826050.197554581,21826050.197554581,21826050.197554581,22480831.703481223,0,0,0,0,0,0,0,{"$f":"+SUM(BR19,BR27:BR35,BR43,BR47:BR48,BR54:BR57,BR62:BR65,BR75,BR89)+BR11+BR12","v":0},0,0,0,0,0,0,0,0,0,0,0,0,0,0,0,0,0,0,0,0,0,0,0,0,0,0,0,0,0,0,0,{"$f":"+SUM(CX19,CX27:CX35,CX43,CX47:CX48,CX54:CX57,CX62:CX65,CX75,CX89)+CX11+CX12","v":0},0,0,0,0,0,0,0,0,0,0,0,0,0,0,0,0,0,0,0,0,0,0,0,0]
["ARPU",50000,null,null,"Gastos administrativos",{"$f":"+SUM(F19,F27:F35,F43,F47:F48,F54:F57,F62:F65,F75,F89)*4.7%","v":0},0,653254.18684279686,653254.18684279686,653254.18684279686,516719.1868427968,648747.50536279683,648747.50536279683,668209.93052368076,668209.93052368076,668209.93052368076,668209.93052368076,668209.93052368076,797070.59677800885,797070.59677800885,797070.59677800885,797070.59677800885,797070.59677800885,797070.59677800885,797070.59677800885,820982.714681349,820982.714681349,820982.714681349,820982.714681349,820982.714681349,880924.67194038897,880924.67194038897,880924.67194038897,880924.67194038897,880924.67194038897,880924.67194038897,880924.67194038897,{"$f":"+SUM(AL19,AL27:AL35,AL43,AL47:AL48,AL54:AL57,AL62:AL65,AL75,AL89)*4.7%","v":907352.41209860065},907352.41209860065,907352.41209860065,907352.41209860065,907352.41209860065,907352.41209860065,907352.41209860065,907352.41209860065,907352.41209860065,907352.41209860065,907352.41209860065,907352.41209860065,934572.98446155887,934572.98446155887,934572.98446155887,934572.98446155887,934572.98446155887,934572.98446155887,934572.98446155887,934572.98446155887,934572.98446155887,934572.98446155887,934572.98446155887,934572.98446155887,962610.1739954059,0,0,0,0,0,0,0,{"$f":"+SUM(BR19,BR27:BR35,BR43,BR47:BR48,BR54:BR57,BR62:BR65,BR75,BR89)*4.7%","v":0},0,0,0,0,0,0,0,0,0,0,0,0,0,0,0,0,0,0,0,0,0,0,0,0,0,0,0,0,0,0,0,{"$f":"+SUM(CX19,CX27:CX35,CX43,CX47:CX48,CX54:CX57,CX62:CX65,CX75,CX89)*4.7%","v":0},0,0,0,0,0,0,0,0,0,0,0,0,0,0,0,0,0,0,0,0,0,0,0,0]
["Subscriptores / hogares",{"$f":"SubscriptoresSugeridos","v":2843.1},null,null,"Imprevistos",{"$f":"+SUM(F17:F91)*$B$6","v":29845750.170728683},0,694951.26259872003,694951.26259872003,694951.26259872003,549701.26259872003,690156.92059872008,690156.92059872008,710861.62821668165,710861.62821668165,710861.62821668165,710861.62821668165,710861.62821668165,859587.17552815157,859587.17552815157,859587.17552815157,859587.17552815157,859587.17552815157,859587.17552815157,859587.17552815157,885374.79079399619,885374.79079399619,885374.79079399619,885374.79079399619,885374.79079399619,949142.83043127274,949142.83043127274,949142.83043127274,949142.83043127274,949142.83043127274,949142.83043127274,949142.83043127274,{"$f":"+SUM(AL17:AL91)*$B$6","v":977617.11534421099},977617.11534421099,977617.11534421099,977617.11534421099,977617.11534421099,977617.11534421099,977617.11534421099,977617.11534421099,977617.11534421099,977617.11534421099,977617.11534421099,977617.11534421099,1006945.6288045374,1006945.6288045374,1006945.6288045374,1006945.6288045374,1006945.6288045374,1006945.6288045374,1006945.6288045374,1006945.6288045374,1006945.6288045374,1006945.6288045374,1006945.6288045374,1006945.6288045374,1037153.9976686735,0,0,0,0,0,0,0,{"$f":"+SUM(BR17:BR91)*$B$6","v":0},0,0,0,0,0,0,0,0,0,0,0,0,0,0,0,0,0,0,0,0,0,0,0,0,0,0,0,0,0,0,0,{"$f":"+SUM(CX17:CX91)*$B$6","v":0},0,0,0,0,0,0,0,0,0,0,0,0,0,0,0,0,0,0,0,0,0,0,0,0]
["Subscriptores / hogares recomendados",{"$f":"IFERROR(IF(TipoRed=\"Fija\",ValocidadPromedioDL/(RelacionContencion*Velocidad),(ValocidadPromedioDL*RelacionContencion*3600*24*30)/(8000*Velocidad)),0)","v":2843.1},null,null,{"$f":"+DAY(F16)","v":1},1,2,2,2,3,3,4,4,4,7,7,8,8,9,9,9,10,10,11,11,11,14,14,15,15,16,16,16,17,17,18,18,18,21,21,22,22,23,23,23,24,24,25,3,{"$f":"+DAY(AY16)","v":3},{"$f":"+DAY(AZ16)","v":5},{"$f":"+DAY(BA16)","v":5},{"$f":"+DAY(BB16)","v":6},6,7,7,7,8,8,9,9,9,12,12,13,{"$f":"+DAY(BO16)","v":13},14,14,14,15,15,16,16,16,19,19,20,20,21,21,21,22,22,23,23,23,26,26,27,{"$f":"+DAY(CM16)","v":27},28,28,28,29,29,30,8,8,10,10,11,11,12,12,12,13,13,14,14,14,17,17,18,18,19,19,19,20,20,21,21,21,24,24,25]
["CAPEX total",{"$f":"+SUM(B20:B26,B36:B40,B44:B46,B50:B52,B59:B61,B66:B74,B78:B86,B90:B91)","v":596915003.41457367},null,null,1,2,3,4,5,6,7,8,9,10,11,12,13,14,15,16,17,18,19,20,21,22,23,24,25,26,27,28,29,30,31,32,33,34,35,36,37,38,39,40,41,42,43,44,45,46,47,48,49,50,51,52,53,54,55,56,57,58,59,60,61,62,63,64,65,66,67,68,69,70,71,72,73,74,75,76,77,78,79,80,81,82,83,84,85,86,87,88,89,90,91,92,93,94,95,96,97,98,99,100,101,102,103,104,105,106,107,108,109,110,111,112,113,114,115,116,117,118,119,120,121]
["Costo total por Usuario",{"$f":"B5/SubscriptoresSugeridos","v":598535.9824854082},null,null,null,0,1,2,3,4,5,6,7,8,9,10,11,12,13,14,15,16,17,18,19,20,21,22,23,24,25,26,27,28,29,30,31,32,33,34,35,36,37,38,39,40,41,42,43,44,45,46,47,48,49,50,51,52,53,54,55,56,57,58,59,60,61,62,63,64,65,66,67,68,69,70,71,72,73,74,75,76,77,78,79,80,81,82,83,84,85,86,87,88,89,90,91,92,93,94,95,96,97,98,99,100,101,102,103,104,105,106,107,108,109,110,111,112,113,114,115,116,117,118,119,120]
{"$rows_left_out":87}
{"sheet":"Detalle","index":3,"n_rows":979,"n_cols":20,"rows_kept":979,"cut":false,"hidden":false,"merged":[]}
["Tipología","Grupo","Descripcion","Detalle","Tipos","Clase","Unidad","Valor","TRM","Relación","Terreno - Energia","Kw-Energia","Clase Torre","Sector Enodeb","FTTH","Total","Item utilizado"]
["TMC 4G","Obra Civil","Servicios Profesionales: Terreno, Ambiente, Aeronautica","Altura (mts) / (Monopolo, Portatil, Convencional) 12 - 18",1,"CAPEX","Unitario",17740633.5,1,{"$f":"+IF(ISNUMBER(FIND(\"12 - 18\",D2)),\"12-18\",IF(ISNUMBER(FIND(\"19 - 35\",D2)),\"19-35\",IF(ISNUMBER(FIND(\"36 - 45\",D2)),\"36-45\",IF(ISNUMBER(FIND(\"46 - 60\",D2)),\"46-60\",IF(ISNUMBER(FIND(\"90\",D2)),\"90\",\"\")))))","v":"12-18"},null,null,null,null,"S",{"$f":"+I2*H2","v":17740633.5},"N"]
["TMC 4G","Obra Civil","Servicios Profesionales: Terreno, Ambiente, Aeronautica","Altura (mts) / (Monopolo, Portatil, Convencional) 19 - 35",1,"CAPEX","Unitario",17740633.5,1,"19-35",null,null,null,null,"S",17740633.5,"N"]
["TMC 4G","Obra Civil","Servicios Profesionales: Terreno, Ambiente, Aeronautica","Altura (mts) / (Monopolo, Portatil, Convencional) 36 - 45",1,"CAPEX","Unitario",17740633.5,1,"36-45",null,null,null,null,"S",17740633.5,"N"]
["TMC 4G","Obra Civil","Servicios Profesionales: Terreno, Ambiente, Aeronautica","Altura (mts) / (Monopolo, Portatil, Convencional) 46 - 60",1,"CAPEX","Unitario",17740633.5,1,"46-60",null,null,null,null,"S",17740633.5,"N"]
["TMC 4G","Obra Civil","Servicios Profesionales: Terreno, Ambiente, Aeronautica","Altura (mts) / (Monopolo, Portatil, Convencional) 90",1,"CAPEX","Unitario",17740633.5,1,"90",null,null,null,null,"S",17740633.5,"N"]
["TMC 4G","Obra Civil","Servicios Profesionales: Terreno, Ambiente, Aeronautica","Altura (mts) / (Monopolo, Portatil, Convencional) 12 - 18",2,"CAPEX","Unitario",17740633.5,1,"12-18",null,null,null,null,"S",17740633.5,"N"]
["TMC 4G","Obra Civil","Servicios Profesionales: Terreno, Ambiente, Aeronautica","Altura (mts) / (Monopolo, Portatil, Convencional) 19 - 35",2,"CAPEX","Unitario",17740633.5,1,"19-35",null,null,null,null,"S",17740633.5,"N"]
["TMC 4G","Obra Civil","Servicios Profesionales: Terreno, Ambiente, Aeronautica","Altura (mts) / (Monopolo, Portatil, Convencional) 36 - 45",2,"CAPEX","Unitario",17740633.5,1,"36-45",null,null,null,null,"S",17740633.5,"N"]
["TMC 4G","Obra Civil","Servicios Profesionales: Terreno, Ambiente, Aeronautica","Altura (mts) / (Monopolo, Portatil, Convencional) 46 - 60",2,"CAPEX","Unitario",17740633.5,1,"46-60",null,null,null,null,"S",17740633.5,"N"]
["TMC 4G","Obra Civil","Servicios Profesionales: Terreno, Ambiente, Aeronautica","Altura (mts) / (Monopolo, Portatil, Convencional) 90",2,"CAPEX","Unitario",17740633.5,1,"90",null,null,null,null,"S",17740633.5,"N"]
["TMC 4G","Obra Civil","Servicios Profesionales: Terreno, Ambiente, Aeronautica","Altura (mts) / (Monopolo, Portatil, Convencional) 12 - 18",3,"CAPEX","Unitario",17740633.5,1,"12-18",null,null,null,null,"S",17740633.5,"N"]
["TMC 4G","Obra Civil","Servicios Profesionales: Terreno, Ambiente, Aeronautica","Altura (mts) / (Monopolo, Portatil, Convencional) 19 - 35",3,"CAPEX","Unitario",17740633.5,1,"19-35",null,null,null,null,"S",17740633.5,"N"]
["TMC 4G","Obra Civil","Servicios Profesionales: Terreno, Ambiente, Aeronautica","Altura (mts) / (Monopolo, Portatil, Convencional) 36 - 45",3,"CAPEX","Unitario",17740633.5,1,"36-45",null,null,null,null,"S",17740633.5,"N"]
["TMC 4G","Obra Civil","Servicios Profesionales: Terreno, Ambiente, Aeronautica","Altura (mts) / (Monopolo, Portatil, Convencional) 46 - 60",3,"CAPEX","Unitario",17740633.5,1,"46-60",null,null,null,null,"S",17740633.5,"N"]
{"$rows_left_out":965}
{"sheet":"Resultados","index":4,"n_rows":5,"n_cols":2,"rows_kept":5,"cut":false,"hidden":false,"merged":[]}
["Resultados"]
[]
["Total",{"$f":"+SUM(B4:B5)","v":1631031498.4730749}]
["CAPEX",{"$f":"+SUM(Modelo!$B$19:$B$101)","v":640850139.35676837}]
["OPEX",{"$f":"+SUM(Modelo!G19:DV101)","v":990181359.11630642}]

{"sheet":"Tablas Espectro MW","index":5,"n_rows":46,"n_cols":2,"rows_kept":46,"cut":false,"hidden":false,"merged":[]}
["Calculo del Valor Anual de Contraprestaciones (VAC)"]
["Basado en Resolución 2734 de 2019"]
[]
["Valores del factor de valoración de banda Fv "]
[]
["Frecuencia de enlace F [MHz] ","Fv [1/MHz] "]
["3 < F = 1.000 ",1]
["1.000 < F = 3.000 ",0.8]
["3.000 < F = 3.700 ",0.7]
["3.700 < F = 7100 ",0.61199999999999999]
["7.100 < F = 14.000 ",0.54400000000000004]
["14.000 < F = 20.000 ",0.47599999999999998]
["20.000 < F = 30.000 ",0.40799999999999997]
["30.000 < F = 70.000 ",3.7499999999999999E-2]
["70.000 < F = 300.000 ",5.4999999999999997E-3]
{"$rows_left_out":32}
{"sheet":"Datos","index":6,"n_rows":11,"n_cols":2,"rows_kept":11,"cut":false,"hidden":true,"merged":[]}
["Resumen"]
[]
["Fecha inicio",{"$f":"+TODAY()","v":"2020-06-26"}]
["WACC"]
["VPN"]
[]
["Utilizado"]
["S"]
["N"]
["Dias"]
[31]